{"text_format":"1","workbook":"xlsx","n_sheets":6,"sheets":["Doku","TNL","Urkunde","RS 3","RS 4","Data"],"not_rendered":{"charts":0,"images":15,"macros":1,"external_links":0,"defined_names":5,"comments":0,"pivot_tables":0},"unopened":[],"bounds":{"document_bytes":16777216,"sheet_cells":100000,"rows_first":2000,"rows_last":500,"rows_between":2000,"halvings":0,"cell_chars":16384,"cell_head_chars":4096},"cells_cut":0,"cells_raw":0,"read":"whole","date_system":"1900"}

{"sheet":"Doku","index":0,"n_rows":78,"n_cols":153,"rows_kept":78,"cut":false,"hidden":false,"merged":[[12,107,14,107],[12,108,12,111],[74,136,76,165],[12,126,14,126],[1,1,78,1],[6,2,6,165],[7,2,7,21],[7,22,7,29],[7,32,7,81],[2,2,2,165],[4,2,4,165],[3,2,3,165],[5,65,5,67],[9,152,9,165],[11,2,11,7],[11,8,11,63],[11,64,11,79],[11,80,11,107],[10,2,10,165],[9,126,9,127],[11,136,11,165],[12,7,14,7],[12,8,14,8],[12,9,14,63],[7,82,7,85],[7,86,7,113],[7,114,7,165],[11,108,11,135],[8,2,8,165],[9,2,9,28],[9,29,9,52],[9,53,9,59],[9,60,9,82],[9,83,9,91],[9,92,9,95],[9,133,9,146],[5,182,5,185],[9,147,9,151],[9,96,9,102],[9,103,9,125],[9,128,9,132],[12,136,14,165],[13,80,13,81],[13,82,13,83],[13,94,13,95],[13,96,13,97],[13,108,13,109],[13,110,13,111],[13,122,13,123],[14,108,14,111],[12,127,14,134],[12,93,14,93],[12,94,12,97],[12,98,14,98],[12,99,14,106],[12,80,12,83],[12,84,14,84],[12,85,14,92],[5,175,5,178],[1,166,78,166],[12,64,14,79],[12,135,14,135],[14,122,14,125],[14,80,14,83],[14,94,14,97],[15,64,17,79],[15,80,15,83],[15,84,17,84],[15,85,17,92],[17,80,17,83],[16,80,16,81],[16,82,16,83],[15,93,17,93],[15,94,15,97],[15,98,17,98],[17,94,17,97],[16,94,16,95],[16,96,16,97],[15,99,17,106],[12,112,14,112],[12,113,14,120],[12,121,14,121],[12,122,12,125],[13,124,13,125],[15,136,17,165],[15,107,17,107],[15,108,15,111],[15,112,17,112],[15,113,17,120],[16,108,16,109],[16,110,16,111],[16,122,16,123],[16,124,16,125],[15,121,17,121],[17,108,17,111],[15,122,15,125],[15,126,17,126],[15,127,17,134],[17,122,17,125],[15,135,17,135],[18,7,20,7],[18,8,20,8],[18,9,20,63],[18,64,20,79],[18,80,18,83],[18,84,20,84],[19,80,19,81],[19,82,19,83],[15,7,17,7],[15,8,17,8],[15,9,17,63],[18,98,20,98],[20,94,20,97],[18,99,20,106],[20,108,20,111],[18,122,18,125],[19,124,19,125],[18,121,20,121],[18,126,20,126],[18,127,20,134],[20,122,20,125],[19,94,19,95],[19,96,19,97],[18,85,20,92],[20,80,20,83],[18,93,20,93],[18,94,18,97],[23,94,23,97],[22,96,22,97],[23,80,23,83],[21,93,23,93],[21,94,21,97],[23,122,23,125],[21,136,23,165],[22,110,22,111],[22,122,22,123],[22,124,22,125],[21,121,23,121],[21,107,23,107],[21,108,21,111],[21,112,23,112],[21,113,23,120],[22,108,22,109],[24,7,26,7],[24,8,26,8],[24,9,26,63],[24,64,26,79],[24,80,24,83],[25,96,25,97],[21,64,23,79],[21,80,21,83],[18,136,20,165],[18,107,20,107],[18,108,18,111],[18,112,20,112],[18,113,20,120],[19,108,19,109],[19,110,19,111],[19,122,19,123],[21,135,23,135],[18,135,20,135],[21,98,23,98],[21,99,23,106],[23,108,23,111],[21,122,21,125],[21,126,23,126],[21,127,23,134],[24,98,26,98],[26,94,26,97],[24,99,26,106],[26,108,26,111],[24,122,24,125],[27,135,29,135],[25,124,25,125],[24,121,26,121],[21,7,23,7],[21,8,23,8],[21,9,23,63],[21,84,23,84],[22,80,22,81],[22,82,22,83],[22,94,22,95],[21,85,23,92],[24,84,26,84],[25,80,25,81],[25,82,25,83],[25,94,25,95],[24,85,26,92],[26,80,26,83],[24,93,26,93],[24,94,24,97],[24,136,26,165],[24,107,26,107],[24,108,24,111],[24,112,26,112],[24,113,26,120],[25,108,25,109],[25,110,25,111],[25,122,25,123],[24,127,26,134],[26,122,26,125],[24,126,26,126],[24,135,26,135],[27,7,29,7],[27,8,29,8],[27,9,29,63],[27,64,29,79],[27,80,27,83],[27,84,29,84],[28,80,28,81],[27,127,29,134],[29,122,29,125],[27,93,29,93],[27,94,27,97],[28,96,28,97],[28,124,28,125],[27,98,29,98],[29,94,29,97],[27,99,29,106],[29,108,29,111],[27,122,27,125],[28,82,28,83],[28,94,28,95],[27,85,29,92],[29,80,29,83],[27,136,29,165],[27,107,29,107],[27,108,27,111],[27,112,29,112],[27,113,29,120],[28,108,28,109],[28,110,28,111],[28,122,28,123],[27,121,29,121],[27,126,29,126],[30,84,32,84],[31,80,31,81],[31,82,31,83],[31,94,31,95],[30,85,32,92],[32,80,32,83],[30,93,32,93],[30,94,30,97],[30,7,32,7],[30,8,32,8],[30,9,32,63],[30,64,32,79],[30,80,30,83],[31,96,31,97],[30,98,32,98],[32,94,32,97],[30,99,32,106],[32,108,32,111],[30,122,30,125],[34,96,34,97],[34,124,34,125],[33,135,35,135],[31,124,31,125],[30,121,32,121],[30,126,32,126],[30,136,32,165],[30,107,32,107],[30,108,30,111],[30,112,32,112],[30,113,32,120],[31,108,31,109],[31,110,31,111],[31,122,31,123],[30,127,32,134],[32,122,32,125],[30,135,32,135],[33,7,35,7],[33,8,35,8],[33,9,35,63],[33,64,35,79],[33,80,33,83],[33,84,35,84],[34,80,34,81],[33,127,35,134],[35,122,35,125],[33,93,35,93],[33,94,33,97],[33,98,35,98],[35,94,35,97],[33,99,35,106],[35,108,35,111],[33,122,33,125],[34,82,34,83],[34,94,34,95],[33,85,35,92],[35,80,35,83],[33,136,35,165],[33,107,35,107],[33,108,33,111],[33,112,35,112],[33,113,35,120],[34,108,34,109],[34,110,34,111],[34,122,34,123],[33,121,35,121],[33,126,35,126],[36,84,38,84],[37,80,37,81],[37,82,37,83],[37,94,37,95],[36,85,38,92],[38,80,38,83],[36,93,38,93],[36,94,36,97],[36,7,38,7],[36,8,38,8],[36,9,38,63],[36,64,38,79],[36,80,36,83],[37,96,37,97],[36,98,38,98],[38,94,38,97],[36,99,38,106],[38,108,38,111],[36,122,36,125],[40,96,40,97],[40,124,40,125],[39,135,41,135],[37,124,37,125],[36,121,38,121],[36,126,38,126],[36,136,38,165],[36,107,38,107],[36,108,36,111],[36,112,38,112],[36,113,38,120],[37,108,37,109],[37,110,37,111],[37,122,37,123],[36,127,38,134],[38,122,38,125],[36,135,38,135],[39,7,41,7],[39,8,41,8],[39,9,41,63],[39,64,41,79],[39,80,39,83],[39,84,41,84],[40,80,40,81],[39,127,41,134],[41,122,41,125],[39,93,41,93],[39,94,39,97],[39,98,41,98],[41,94,41,97],[39,99,41,106],[41,108,41,111],[39,122,39,125],[40,82,40,83],[40,94,40,95],[39,85,41,92],[41,80,41,83],[39,136,41,165],[39,107,41,107],[39,108,39,111],[39,112,41,112],[39,113,41,120],[40,108,40,109],[40,110,40,111],[40,122,40,123],[39,121,41,121],[39,126,41,126],[42,84,44,84],[43,80,43,81],[43,82,43,83],[43,94,43,95],[42,85,44,92],[44,80,44,83],[42,93,44,93],[42,94,42,97],[42,7,44,7],[42,8,44,8],[42,9,44,63],[42,64,44,79],[42,80,42,83],[43,96,43,97],[42,98,44,98],[44,94,44,97],[42,99,44,106],[44,108,44,111],[42,122,42,125],[46,96,46,97],[46,124,46,125],[45,135,47,135],[43,124,43,125],[42,121,44,121],[42,126,44,126],[42,136,44,165],[42,107,44,107],[42,108,42,111],[42,112,44,112],[42,113,44,120],[43,108,43,109],[43,110,43,111],[43,122,43,123],[42,127,44,134],[44,122,44,125],[42,135,44,135],[45,7,47,7],[45,8,47,8],[45,9,47,63],[45,64,47,79],[45,80,45,83],[45,84,47,84],[46,80,46,81],[45,127,47,134],[47,122,47,125],[45,93,47,93],[45,94,45,97],[45,98,47,98],[47,94,47,97],[45,99,47,106],[47,108,47,111],[45,122,45,125],[46,82,46,83],[46,94,46,95],[45,85,47,92],[47,80,47,83],[45,136,47,165],[45,107,47,107],[45,108,45,111],[45,112,47,112],[45,113,47,120],[46,108,46,109],[46,110,46,111],[46,122,46,123],[45,121,47,121],[45,126,47,126],[48,84,50,84],[49,80,49,81],[49,82,49,83],[49,94,49,95],[48,85,50,92],[50,80,50,83],[48,93,50,93],[48,94,48,97],[48,7,50,7],[48,8,50,8],[48,9,50,63],[48,64,50,79],[48,80,48,83],[49,96,49,97],[48,98,50,98],[50,94,50,97],[48,99,50,106],[50,108,50,111],[48,122,48,125],[52,96,52,97],[52,124,52,125],[51,135,53,135],[49,124,49,125],[48,121,50,121],[48,126,50,126],[48,136,50,165],[48,107,50,107],[48,108,48,111],[48,112,50,112],[48,113,50,120],[49,108,49,109],[49,110,49,111],[49,122,49,123],[48,127,50,134],[50,122,50,125],[48,135,50,135],[51,7,53,7],[51,8,53,8],[51,9,53,63],[51,64,53,79],[51,80,51,83],[51,84,53,84],[52,80,52,81],[51,127,53,134],[53,122,53,125],[51,93,53,93],[51,94,51,97],[51,98,53,98],[53,94,53,97],[51,99,53,106],[53,108,53,111],[51,122,51,125],[52,82,52,83],[52,94,52,95],[51,85,53,92],[53,80,53,83],[51,136,53,165],[51,107,53,107],[51,108,51,111],[51,112,53,112],[51,113,53,120],[52,108,52,109],[52,110,52,111],[52,122,52,123],[51,121,53,121],[51,126,53,126],[55,94,55,95],[54,85,56,92],[56,80,56,83],[54,93,56,93],[54,94,54,97],[54,7,56,7],[54,8,56,8],[54,9,56,63],[54,64,56,79],[54,80,54,83],[55,96,55,97],[77,2,77,43],[77,51,77,91],[54,136,56,165],[54,107,56,107],[54,108,54,111],[54,112,56,112],[54,113,56,120],[55,108,55,109],[55,110,55,111],[55,122,55,123],[54,127,56,134],[56,122,56,125],[54,135,56,135],[54,98,56,98],[56,94,56,97],[54,99,56,106],[56,108,56,111],[54,122,54,125],[55,124,55,125],[54,121,56,121],[54,126,56,126],[54,84,56,84],[55,80,55,81],[55,82,55,83],[61,82,61,83],[63,64,65,79],[63,80,63,83],[63,7,65,7],[63,8,65,8],[63,9,65,63],[63,84,65,84],[64,80,64,81],[57,2,59,6],[57,7,59,7],[60,84,62,84],[74,2,75,43],[60,7,62,7],[60,8,62,8],[60,9,62,63],[57,136,59,165],[58,80,58,81],[74,44,77,50],[74,51,76,91],[58,82,58,83],[58,94,58,95],[74,92,77,98],[76,2,76,43],[57,8,59,8],[57,9,59,63],[57,64,59,79],[57,80,57,83],[59,80,59,83],[57,93,59,93],[60,64,62,79],[60,80,60,83],[60,85,62,92],[62,80,62,83],[61,80,61,81],[57,84,59,84],[57,85,59,92],[77,99,77,128],[77,136,77,165],[74,99,75,128],[74,129,77,135],[57,107,59,107],[57,108,57,111],[57,112,59,112],[57,113,59,120],[59,108,59,111],[76,99,76,128],[58,96,58,97],[58,124,58,125],[57,121,59,121],[57,122,57,125],[58,108,58,109],[58,110,58,111],[57,94,57,97],[57,98,59,98],[57,99,59,106],[59,94,59,97],[60,98,62,98],[62,94,62,97],[61,94,61,95],[61,96,61,97],[62,108,62,111],[60,99,62,106],[60,126,62,126],[60,127,62,134],[62,122,62,125],[63,135,65,135],[63,98,65,98],[57,135,59,135],[58,122,58,123],[57,127,59,134],[59,122,59,125],[57,126,59,126],[61,124,61,125],[60,122,60,125],[64,110,64,111],[64,122,64,123],[65,94,65,97],[63,99,65,106],[65,108,65,111],[63,122,63,125],[63,107,65,107],[63,108,63,111],[63,112,65,112],[66,93,68,93],[66,94,66,97],[60,136,62,165],[60,107,62,107],[60,108,60,111],[60,112,62,112],[60,113,62,120],[61,108,61,109],[61,110,61,111],[63,93,65,93],[63,94,63,97],[64,96,64,97],[64,124,64,125],[63,121,65,121],[63,126,65,126],[63,136,65,165],[60,121,62,121],[60,93,62,93],[60,94,60,97],[64,94,64,95],[60,135,62,135],[61,122,61,123],[63,127,65,134],[65,122,65,125],[66,7,68,7],[66,8,68,8],[66,9,68,63],[66,64,68,79],[66,80,66,83],[66,84,68,84],[67,80,67,81],[64,82,64,83],[63,85,65,92],[65,80,65,83],[67,82,67,83],[66,85,68,92],[68,80,68,83],[63,113,65,120],[64,108,64,109],[66,135,68,135],[66,98,68,98],[68,94,68,97],[66,99,68,106],[68,108,68,111],[66,122,66,125],[67,124,67,125],[67,94,67,95],[67,96,67,97],[66,136,68,165],[66,107,68,107],[66,108,66,111],[66,112,68,112],[66,113,68,120],[67,108,67,109],[67,110,67,111],[67,122,67,123],[66,121,68,121],[66,126,68,126],[66,127,68,134],[68,122,68,125],[69,7,71,7],[69,8,71,8],[69,9,71,63],[69,64,71,79],[69,80,69,83],[69,84,71,84],[71,94,71,97],[70,80,70,81],[70,82,70,83],[70,94,70,95],[70,96,70,97],[69,85,71,92],[71,80,71,83],[69,93,71,93],[69,94,69,97],[69,127,71,134],[71,122,71,125],[69,135,71,135],[69,98,71,98],[69,121,71,121],[71,108,71,111],[69,122,69,125],[69,99,71,106],[69,136,71,165],[69,107,71,107],[69,108,69,111],[69,112,71,112],[69,113,71,120],[70,108,70,109],[70,110,70,111],[70,122,70,123],[70,124,70,125],[69,126,71,126],[72,2,72,165],[73,2,73,165],[5,108,5,165],[5,68,5,107],[5,2,5,64],[60,2,62,6],[63,2,65,6],[66,2,68,6],[69,2,71,6],[12,2,14,6],[15,2,17,6],[18,2,20,6],[21,2,23,6],[24,2,26,6],[27,2,29,6],[30,2,32,6],[33,2,35,6],[36,2,38,6],[51,2,53,6],[54,2,56,6],[45,2,47,6],[48,2,50,6],[39,2,41,6],[42,2,44,6]]}
[]
[{"$f":"IF(TNL!BE18<>\"\",'RS 3'!J35,0)","v":0}]
[{"$f":"IF(TNL!CF18<>\"\",'RS 4'!J35,0)","v":0},null,"Dokumentationsblatt nach DGUV-Grundsatz 304-001/3.4.6"]
[{"$f":"SUM(A2:A3)","v":0},null,"zum Nachweis für die Qualitätssicherungsstelle (QSEH) Erste Hilfe"]
[]
[null,null,{"$f":"IF(TNL!C18<>\"\",TNL!C18,\"\")","v":""},null,null,null,null,null,null,null,null,null,null,null,null,null,null,null,null,null,null,null,null,null,null,null,null,null,null,null,null,null,null,null,null,null,null,null,null,null,null,null,null,null,null,null,null,null,null,null,null,null,null,null,null,null,null,null,null,null,null,null,null,null,null,{"$f":"IF(TNL!BE18&TNL!CF18<>\"\",TNL!BE18&TNL!CF18,\"\")","v":""},null,null," Fortbildung für Erste Hilfe-Ausbilder "]
{"$rows_left_out":73}
{"sheet":"TNL","index":1,"n_rows":68,"n_cols":117,"rows_kept":68,"cut":false,"hidden":false,"merged":[[22,112,22,113],[24,112,24,113],[26,112,26,113],[22,114,22,118],[24,114,24,118],[26,114,26,118],[20,112,20,118],[17,112,18,113],[14,112,16,113],[19,61,19,82],[17,34,17,55],[19,83,19,87],[13,67,13,78],[17,88,17,109],[8,112,8,115],[11,112,11,114],[12,112,12,114],[9,113,9,114],[10,35,11,38],[20,64,20,77],[19,88,19,109],[17,83,18,87],[18,88,18,109],[17,61,17,82],[10,79,11,82],[11,83,11,109],[20,78,21,109],[20,2,21,7],[20,8,20,35],[20,36,20,63],[21,8,21,42],[21,43,21,77],[19,29,19,33],[19,34,19,55],[19,7,19,28],[17,56,18,60],[18,61,18,82],[13,65,13,66],[19,2,19,6],[11,39,11,78],[10,39,10,78],[10,83,10,109],[19,56,19,60],[8,16,8,20],[14,46,14,55],[17,2,18,6],[16,2,16,109],[17,29,18,33],[17,7,17,28],[18,7,18,28],[15,65,15,84],[14,62,14,84],[14,85,14,109],[12,101,12,109],[12,65,12,66],[12,97,13,100],[13,101,13,109],[8,83,8,109],[9,83,9,109],[8,79,9,82],[8,39,8,78],[7,2,7,28],[7,29,7,55],[14,2,14,9],[14,10,15,10],[14,11,14,41],[14,42,14,45],[15,11,15,41],[15,42,15,45],[8,2,8,13],[12,21,12,34],[8,23,8,27],[12,35,13,38],[12,39,12,64],[14,57,14,60],[13,21,13,34],[13,16,13,20],[13,39,13,64],[13,2,13,15],[12,2,12,15],[11,2,11,34],[12,16,12,20],[8,14,8,15],[8,21,8,22],[10,2,10,34],[4,2,4,109],[5,18,6,21],[5,22,5,78],[6,22,6,78],[6,2,6,17],[5,2,5,17],[5,79,6,82],[5,83,6,109],[18,34,18,55],[8,35,9,38],[15,2,15,9],[8,28,8,29],[15,46,15,55],[9,39,9,78],[12,67,12,78],[15,61,15,64],[9,2,9,34],[8,30,8,34],[15,57,15,60],[7,56,7,109],[15,85,15,109],[13,83,13,96],[12,79,13,82],[12,83,12,96],[26,2,27,7],[26,8,26,35],[26,36,26,63],[27,8,27,42],[27,43,27,77],[26,64,26,77],[24,78,25,109],[26,78,27,109],[22,2,23,7],[22,36,22,63],[22,78,23,109],[24,2,25,7],[24,64,24,77],[24,8,24,35],[24,36,24,63],[25,8,25,42],[25,43,25,77],[22,8,22,35],[23,8,23,42],[23,43,23,77],[22,64,22,77],[32,78,33,109],[34,78,35,109],[28,2,29,7],[28,64,28,77],[28,8,28,35],[28,36,28,63],[30,2,31,7],[30,8,30,35],[30,36,30,63],[31,8,31,42],[31,43,31,77],[30,64,30,77],[28,78,29,109],[30,78,31,109],[29,8,29,42],[29,43,29,77],[33,8,33,42],[33,43,33,77],[32,2,33,7],[32,64,32,77],[32,8,32,35],[32,36,32,63],[34,2,35,7],[34,8,34,35],[34,36,34,63],[35,8,35,42],[35,43,35,77],[34,64,34,77],[41,8,41,42],[41,43,41,77],[40,2,41,7],[40,64,40,77],[40,78,41,109],[43,43,43,77],[42,2,43,7],[42,64,42,77],[42,8,42,35],[42,36,42,63],[42,78,43,109],[37,8,37,42],[37,43,37,77],[36,2,37,7],[36,64,36,77],[36,8,36,35],[36,36,36,63],[40,8,40,35],[40,36,40,63],[38,2,39,7],[38,8,38,35],[38,36,38,63],[39,8,39,42],[39,43,39,77],[38,64,38,77],[36,78,37,109],[38,78,39,109],[54,36,54,63],[54,64,54,77],[55,8,55,42],[55,43,55,77],[58,2,59,7],[2,2,3,89],[2,90,3,109],[50,8,50,35],[50,36,50,63],[49,8,49,42],[49,43,49,77],[46,2,47,7],[46,64,46,77],[48,8,48,35],[48,36,48,63],[44,2,45,7],[44,8,44,35],[44,36,44,63],[45,8,45,42],[45,43,45,77],[47,8,47,42],[47,43,47,77],[44,64,44,77],[43,8,43,42],[52,2,53,7],[48,2,49,7],[48,64,48,77],[46,8,46,35],[46,36,46,63],[63,2,67,75],[67,79,67,109],[63,79,66,109],[62,2,62,109],[63,76,67,78],[51,8,51,42],[51,43,51,77],[50,2,51,7],[50,64,50,77],[53,8,53,42],[53,43,53,77],[52,8,52,35],[52,36,52,63],[52,64,52,77],[56,8,56,35],[56,36,56,63],[56,64,56,77],[54,2,55,7],[54,8,54,35],[60,2,61,7],[60,8,60,35],[60,36,60,63],[56,2,57,7],[60,64,60,77],[61,8,61,42],[61,43,61,77],[58,8,58,35],[58,36,58,63],[58,64,58,77],[57,8,57,42],[57,43,57,77],[59,8,59,42],[59,43,59,77],[44,78,45,109],[46,78,47,109],[48,78,49,109],[50,78,51,109],[52,78,53,109],[54,78,55,109],[56,78,57,109],[58,78,59,109],[60,78,61,109]]}
[]
[null,null,null,null,null,null,null,null,null,null,null,null,null,null,null,null,null,null,null,null,null,null,null,null,null,null,null,null,null,null,null,null,null,null,null,null,null,null,null,null,null,null,null,null,null,null,null,null,null,null,null,null,null,null,null,null,null,null,null,null,null,null,null,null,null,null,null,null,null,null,null,null,null,null,null,null,null,null,null,null,null,null,null,null,null,null,null,null,null,null,null,null,null,null,null,null,null,null,null,null,null,null,null,null,null,null,null,null,null,null,null,null,{"$f":"SUM(DI4:DI7)","v":0},null,null,{"$f":"IF(DI2<>0,VLOOKUP(DI2,DI4:DL7,4,FALSE),\"000\")","v":"000"}]
[null,null,{"$f":"IF(DI2<>0,VLOOKUP(DI2,DI4:DL7,3,FALSE),\"Teilnehmerliste – Fobi EH-Ausbilder\")","v":"Teilnehmerliste – Fobi EH-Ausbilder"}]
[null,null,null,null,null,null,null,null,null,null,null,null,null,null,null,null,null,null,null,null,null,null,null,null,null,null,null,null,null,null,null,null,null,null,null,null,null,null,null,null,null,null,null,null,null,null,null,null,null,null,null,null,null,null,null,null,null,null,null,null,null,null,null,null,null,null,null,null,null,null,null,null,null,null,null,null,null,null,null,null,null,null,null,null,null,null,null,null,null,null,null,null,null,null,null,null,null,null,null,null,null,null,null,null,null,null,null,null,null,null,null,null,{"$f":"IF(C18<>\"\",1,0)","v":0},1,"Teilnehmerliste – Pädagogische Lehrkräfteschulung",371,55]
[null,null,null,null,null,null,null,null,null,null,null,null,null,null,null,null,null,null,null,null,null,null,null,null,null,null,null,null,null,null,null,null,null,null,null,null,null,null,null,null,null,null,null,null,null,null,null,null,null,null,null,null,null,null,null,null,null,null,null,null,null,null,null,null,null,null,null,null,null,null,null,null,null,null,null,null,null,null,null,null,null,null,null,null,null,null,null,null,null,null,null,null,null,null,null,null,null,null,null,null,null,null,null,null,null,null,null,null,null,null,null,null,{"$f":"IF(AD18<>\"\",2,0)","v":0},2,"Teilnehmerliste – Erste Hilfe-Ausbilder",381,16]
[null,null,null,null,null,null,null,null,null,null,null,null,null,null,null,null,null,null,null,null,null,null,null,null,null,null,null,null,null,null,null,null,null,null,null,null,null,null,null,null,null,null,null,null,null,null,null,null,null,null,null,null,null,null,null,null,null,null,null,null,null,null,null,null,null,null,null,null,null,null,null,null,null,null,null,null,null,null,null,null,null,null,null,"Angaben für die Bescheinigungen",null,null,null,null,null,null,null,null,null,null,null,null,null,null,null,null,null,null,null,null,null,null,null,null,null,null,null,null,{"$f":"IF(BE18<>\"\",3,0)","v":0},3,"Teilnehmerliste – Fortbildung für Erste Hilfe-Ausbilder",381,16]
{"$rows_left_out":63}
{"sheet":"Urkunde","index":2,"n_rows":60,"n_cols":22,"rows_kept":60,"cut":false,"hidden":false,"merged":[[36,2,36,5],[37,2,37,5],[26,4,28,5],[24,2,24,3],[25,2,25,3],[30,2,30,3],[30,4,32,5],[35,2,35,5],[19,2,19,5],[23,2,23,5],[20,2,22,5],[13,2,13,5],[14,2,14,5],[15,2,15,5],[16,2,16,5],[17,2,17,5],[18,2,18,5],[3,8,6,10],[12,2,12,5],[2,2,2,5],[3,2,3,5],[4,2,4,5],[5,2,5,5],[6,2,6,5],[7,2,7,5],[8,2,8,5],[9,2,9,5],[10,2,10,5],[11,2,11,5]]}
[null,null,null,null,null,null,null,null,{"$f":"SUM(Data!H2:H5)","v":0}]
[]
[null,null,{"$f":"IF(I1<>0,IF(ISERROR(VLOOKUP(I1,Data!H2:R5,2,FALSE)),\"\",VLOOKUP(I1,Data!H2:R5,2,FALSE)),\"\")","v":""}]
[null,null,null,null,null,null,null,null,"\nLfd-Nr. für den Einzekdruck\nNummer aus der Teilnehmerliste"]
[null,null,{"$f":"IF(I1<>0,IF(ISERROR(VLOOKUP(I1,Data!H2:R5,3,FALSE)),\"\",VLOOKUP(I1,Data!H2:R5,3,FALSE)),\"\")","v":""}]
[null,null,null,null,null,null,null,null,null,null,null,null,null,null,null,null,null,null,null,null,null," "]
{"$rows_left_out":55}
{"sheet":"RS 3","index":3,"n_rows":37,"n_cols":16,"rows_kept":37,"cut":false,"hidden":false,"merged":[[36,10,37,10],[2,9,3,9],[2,10,2,12],[3,10,3,12],[2,3,3,6],[34,3,34,6],[5,3,6,6],[36,3,37,6],[36,9,37,9]]}
[1,{"$f":"IF(Data!A2<>\"\",A1,0)","v":0}]
[2,{"$f":"IF(Data!A3<>\"\",A2,0)","v":0}]
[3,{"$f":"IF(Data!A4<>\"\",A3,0)","v":0},null,{"$f":"IF(TNL!BE18<>\"\",CONCATENATE(N3,\", \",O3,\" – \",TEXT(P3,\"TT.MM.JJJJ\")),\"\")","v":""},null,null,null,null,null,null," Lfd-Nr. für den Einzekdruck",null,null,{"$f":"IF(J3<>\"\",IF(ISERROR(VLOOKUP(J3,Data!A2:D21,2,FALSE)),\"\",VLOOKUP(J3,Data!A2:D21,2,FALSE)),\"\")","v":""},{"$f":"IF(J3<>\"\",IF(ISERROR(VLOOKUP(J3,Data!A2:D21,3,FALSE)),\"\",VLOOKUP(J3,Data!A2:D21,3,FALSE)),\"\")","v":""},{"$f":"IF(J3<>\"\",IF(ISERROR(VLOOKUP(J3,Data!A2:D21,4,FALSE)),\"\",VLOOKUP(J3,Data!A2:D21,4,FALSE)),\"\")","v":""}]
[4,{"$f":"IF(Data!A5<>\"\",A4,0)","v":0},null,null,null,null,null,null,null,null," Nummer aus der Teilnehmerliste"]
[5,{"$f":"IF(Data!A6<>\"\",A5,0)","v":0}]
[6,{"$f":"IF(Data!A7<>\"\",A6,0)","v":0},null,{"$f":"IF(D3<>\"\",\"Folgende Inhalte wurden in der Fortbildung für Erste Hilfe-Ausbilder mit mindestens 16 Lerneinheiten (LE) vermittelt:\",\"\")","v":""}]
{"$rows_left_out":32}
{"sheet":"RS 4","index":4,"n_rows":37,"n_cols":16,"rows_kept":37,"cut":false,"hidden":false,"merged":[[5,3,6,6],[36,3,37,6],[36,9,37,9],[36,10,37,10],[2,3,3,6],[2,9,3,9],[34,3,34,6]]}
[1,{"$f":"IF(Data!A2<>\"\",A1,0)","v":0}]
[2,{"$f":"IF(Data!A3<>\"\",A2,0)","v":0}]
[3,{"$f":"IF(Data!A4<>\"\",A3,0)","v":0},null,{"$f":"IF(TNL!CF18<>\"\",CONCATENATE(N3,\", \",O3,\" – \",TEXT(P3,\"TT.MM.JJJJ\")),\"\")","v":""},null,null,null,null,null,null," Lfd-Nr. für den Einzekdruck",null,null,{"$f":"IF(J3<>\"\",IF(ISERROR(VLOOKUP(J3,Data!A2:D21,2,FALSE)),\"\",VLOOKUP(J3,Data!A2:D21,2,FALSE)),\"\")","v":""},{"$f":"IF(J3<>\"\",IF(ISERROR(VLOOKUP(J3,Data!A2:D21,3,FALSE)),\"\",VLOOKUP(J3,Data!A2:D21,3,FALSE)),\"\")","v":""},{"$f":"IF(J3<>\"\",IF(ISERROR(VLOOKUP(J3,Data!A2:D21,4,FALSE)),\"\",VLOOKUP(J3,Data!A2:D21,4,FALSE)),\"\")","v":""}]
[4,{"$f":"IF(Data!A5<>\"\",A4,0)","v":0},null,null,null,null,null,null,null,null," Nummer aus der Teilnehmerliste"]
[5,{"$f":"IF(Data!A6<>\"\",A5,0)","v":0}]
[6,{"$f":"IF(Data!A7<>\"\",A6,0)","v":0},null,{"$f":"IF(D3<>\"\",CONCATENATE(\"Folgende Fortbildungsinhalte wurden in diesem Fortbildungsteil für Erste Hilfe-Ausbilder mit \",J35,\" Lerneinheiten (LE) vermittelt:\"),\"\")","v":""}]
{"$rows_left_out":32}
{"sheet":"Data","index":5,"n_rows":21,"n_cols":19,"rows_kept":21,"cut":false,"hidden":true,"merged":[]}
["Nr.","Name","Vorname","Geb.","Reg.-Nr.",null,0,1,2,3,4,5,6,7,8,9,10,11]
[{"$f":"IF(B2<>\"\",1,\"\")","v":""},{"$f":"IF(TNL!I23<>0,TNL!I23,\"\")","v":""},{"$f":"IF(A2<>\"\",TNL!AK23,\"\")","v":""},{"$f":"IF(A2<>\"\",TNL!BM23,\"\")","v":""},{"$f":"IF(A2<>\"\",TNL!CA23,\"\")","v":""},null,1,{"$f":"IF(TNL!DI4<>0,1,0)","v":0},null,null,null,null,null,null,null,null,null,null," "]
[{"$f":"IF(B3<>\"\",2,\"\")","v":""},{"$f":"IF(TNL!I25<>0,TNL!I25,\"\")","v":""},{"$f":"IF(A3<>\"\",TNL!AK25,\"\")","v":""},{"$f":"IF(A3<>\"\",TNL!BM25,\"\")","v":""},{"$f":"IF(A3<>\"\",TNL!CA25,\"\")","v":""},null,2,{"$f":"IF(TNL!DI5<>0,2,0)","v":0}]
[{"$f":"IF(B4<>\"\",3,\"\")","v":""},{"$f":"IF(TNL!I27<>0,TNL!I27,\"\")","v":""},{"$f":"IF(A4<>\"\",TNL!AK27,\"\")","v":""},{"$f":"IF(A4<>\"\",TNL!BM27,\"\")","v":""},{"$f":"IF(A4<>\"\",TNL!CA27,\"\")","v":""},null,3,{"$f":"IF(TNL!DI6<>0,3,0)","v":0},"Fortbildungsnachweis","Erste Hilfe-Ausbilder",{"$f":"IF(TNL!BF15<>\"\",CONCATENATE(\"Dieser Nachweis ist gültig bis \",TEXT(TNL!AU15,\"TT.MM.JJJJ\")),\"Dieser Nachweis ist unbegrenzt gültig!\")","v":"Dieser Nachweis ist unbegrenzt gültig!"},"hat an einer Fortbildung ","für Erste Hilfe-Ausbilder mit mindestens ","16 Lerneinheiten (LE) erfolgreich teilgenommen.","Die pädagogische sowie die fachliche/medizinische Fortbildung erfolgte nach \ndem DGUV Grundsatz 304-001 und den Gemeinsamen Grundsätzen \nder Bundesarbeitsgemeinschaft Erste Hilfe (BAGEH)."]
[{"$f":"IF(B5<>\"\",4,\"\")","v":""},{"$f":"IF(TNL!I29<>0,TNL!I29,\"\")","v":""},{"$f":"IF(A5<>\"\",TNL!AK29,\"\")","v":""},{"$f":"IF(A5<>\"\",TNL!BM29,\"\")","v":""},{"$f":"IF(A5<>\"\",TNL!CA29,\"\")","v":""},null,4,{"$f":"IF(TNL!DI7<>0,4,0)","v":0},"Fortbildungsnachweis","Erste Hilfe-Ausbilder",{"$f":"CONCATENATE(\"Fortbildungsteil (\",'RS 4'!J35,\" LE)\")","v":"Fortbildungsteil ( LE)"},"hat an einer Fortbildung für Erste Hilfe-Ausbilder",{"$f":"CONCATENATE(\"mit insgesamt \",'RS 4'!J35,\" Lerneinheiten (LE)\")","v":"mit insgesamt  Lerneinheiten (LE)"},"erfolgreich teilgenommen.","Dieser Fortbildungsteil (pädagogisch und/oder fachlich/medizinisch) erfolgte \nnach dem DGUV Grundsatz 304-001 und den Gemeinsamen Grundsätzen \nder Bundesarbeitsgemeinschaft Erste Hilfe (BAGEH)."]
[{"$f":"IF(B6<>\"\",5,\"\")","v":""},{"$f":"IF(TNL!I31<>0,TNL!I31,\"\")","v":""},{"$f":"IF(A6<>\"\",TNL!AK31,\"\")","v":""},{"$f":"IF(A6<>\"\",TNL!BM31,\"\")","v":""},{"$f":"IF(A6<>\"\",TNL!CA31,\"\")","v":""}]
{"$rows_left_out":15}