{"text_format":"1","workbook":"xlsx","n_sheets":3,"sheets":["TNL","TNB","Data"],"not_rendered":{"charts":0,"images":8,"macros":1,"external_links":0,"defined_names":3,"comments":0,"pivot_tables":0},"unopened":[],"bounds":{"document_bytes":16777216,"sheet_cells":100000,"rows_first":2000,"rows_last":500,"rows_between":2000,"halvings":0,"cell_chars":16384,"cell_head_chars":4096},"cells_cut":0,"cells_raw":0,"read":"whole","date_system":"1900"}

{"sheet":"TNL","index":0,"n_rows":56,"n_cols":27,"rows_kept":56,"cut":false,"hidden":false,"merged":[[5,18,5,20],[8,6,8,9],[7,6,7,7],[7,8,7,11],[53,2,53,18],[53,19,53,20],[47,20,48,20],[48,4,48,7],[48,11,48,13],[48,15,48,18],[45,20,46,20],[46,4,46,7],[46,11,46,13],[46,15,46,18],[47,2,48,2],[47,4,47,7],[47,8,48,9],[47,11,47,13],[47,15,47,18],[47,19,48,19],[45,2,46,2],[45,4,45,7],[45,8,46,9],[45,11,45,13],[45,15,45,18],[45,19,46,19],[54,2,54,20],[55,2,55,9],[55,11,55,18],[55,19,55,20],[49,20,50,20],[50,4,50,7],[50,11,50,13],[50,15,50,18],[52,2,52,18],[52,19,52,20],[49,2,50,2],[49,4,49,7],[49,8,50,9],[49,11,49,13],[49,15,49,18],[49,19,50,19],[43,2,44,2],[43,4,43,7],[43,8,44,9],[43,11,43,13],[43,15,43,18],[43,19,44,19],[43,20,44,20],[44,4,44,7],[44,11,44,13],[44,15,44,18],[41,2,42,2],[41,4,41,7],[41,8,42,9],[41,11,41,13],[41,15,41,18],[41,19,42,19],[41,20,42,20],[42,4,42,7],[42,11,42,13],[42,15,42,18],[39,2,40,2],[39,4,39,7],[39,8,40,9],[39,11,39,13],[39,15,39,18],[39,19,40,19],[39,20,40,20],[40,4,40,7],[40,11,40,13],[40,15,40,18],[37,2,38,2],[37,4,37,7],[37,8,38,9],[37,11,37,13],[37,15,37,18],[37,19,38,19],[37,20,38,20],[38,4,38,7],[38,11,38,13],[38,15,38,18],[35,2,36,2],[35,4,35,7],[35,8,36,9],[35,11,35,13],[35,15,35,18],[35,19,36,19],[35,20,36,20],[36,4,36,7],[36,11,36,13],[36,15,36,18],[33,2,34,2],[33,4,33,7],[33,8,34,9],[33,11,33,13],[33,15,33,18],[33,19,34,19],[33,20,34,20],[34,4,34,7],[34,11,34,13],[34,15,34,18],[31,2,32,2],[31,4,31,7],[31,8,32,9],[31,11,31,13],[31,15,31,18],[31,19,32,19],[31,20,32,20],[32,4,32,7],[32,11,32,13],[32,15,32,18],[29,2,30,2],[29,4,29,7],[29,8,30,9],[29,11,29,13],[29,15,29,18],[29,19,30,19],[29,20,30,20],[30,4,30,7],[30,11,30,13],[30,15,30,18],[27,2,28,2],[27,4,27,7],[27,8,28,9],[27,11,27,13],[27,15,27,18],[27,19,28,19],[27,20,28,20],[28,4,28,7],[28,11,28,13],[28,15,28,18],[25,2,26,2],[25,4,25,7],[25,8,26,9],[25,11,25,13],[25,15,25,18],[25,19,26,19],[25,20,26,20],[26,4,26,7],[26,11,26,13],[26,15,26,18],[23,2,24,2],[23,4,23,7],[23,8,24,9],[23,11,23,13],[23,15,23,18],[23,19,24,19],[23,20,24,20],[24,4,24,7],[24,11,24,13],[24,15,24,18],[21,2,22,2],[21,4,21,7],[21,8,22,9],[21,11,21,13],[21,15,21,18],[21,19,22,19],[21,20,22,20],[22,4,22,7],[22,11,22,13],[22,15,22,18],[19,2,20,2],[19,4,19,7],[19,8,20,9],[19,11,19,13],[19,15,19,18],[19,19,20,19],[19,20,20,20],[20,4,20,7],[20,11,20,13],[20,15,20,18],[17,2,18,2],[17,4,17,7],[17,8,18,9],[17,11,17,13],[17,15,17,18],[17,19,18,19],[17,20,18,20],[18,4,18,7],[18,11,18,13],[18,15,18,18],[15,2,16,2],[15,4,15,7],[15,8,16,9],[15,11,15,13],[15,15,15,18],[15,19,16,19],[15,20,16,20],[16,4,16,7],[16,11,16,13],[16,15,16,18],[10,24,11,26],[11,2,12,2],[11,4,11,7],[11,8,12,9],[11,11,11,13],[11,15,11,18],[11,19,12,19],[11,20,12,20],[12,4,12,7],[12,11,12,13],[12,15,12,18],[12,24,13,24],[12,25,13,25],[12,26,13,26],[13,2,14,2],[13,4,13,7],[13,8,14,9],[13,11,13,13],[13,15,13,18],[13,19,14,19],[13,20,14,20],[14,4,14,7],[14,11,14,13],[14,15,14,18],[2,2,3,19],[2,20,3,20],[4,2,4,4],[4,6,4,11],[4,13,4,16],[7,2,7,4],[7,13,7,16],[7,18,7,20],[10,4,10,7],[10,8,10,9],[10,11,10,13],[10,15,10,18],[8,2,8,4],[5,2,5,4],[5,6,5,11],[5,13,5,16],[6,2,6,4],[6,7,6,8],[6,10,6,11],[6,13,6,16],[8,13,8,16],[8,18,8,20],[6,18,6,19],[4,18,4,20]]}
[]
[]
[null,null,{"$f":"IF(Data!P1<>0,CONCATENATE(\"Teilnehmerliste – \",VLOOKUP(Data!P1,Data!P2:V5,6,FALSE)),\"Teilnehmerliste – Erste Hilfe bei Kindernotfällen\")","v":"Teilnehmerliste – Ausb. EH bei Kindernotfällen"}]
[]
[null,null," Lehrgangstitel",null,null,null,"Ausb. EH bei Kindernotfällen",null,null,null,null,null,null," Straße der Gliederung"]
[null,null," Lehrgangs-Nummer",null,null,null,null,null,null,null,null,null,null," PLZ und Ort der Gliederung"]
[null,null," Lehrgangsdatum",null,null,null,"vom",null,null,"bis",null,null,null," Name und Nr. des Ausbilders"]
[null,null," Lehrgangsort",null,null,null,null,null,null,null,null,null,null," Name des Ausbildungshelfers"]
[null,null," Gliederungsname",null,null,null,null,null,null,null,null,null,null," Name des Hospitanten/Assistenten"]
[]
[null,null,"Lfd.\nNr.",null,"Name\nVorname",null,null,null,"Geburts-\ndatum",null,null,"Straße und Hausnummer\nPLZ und Wohnort",null,null,null,"Telefon\nE-Mail",null,null,null," Reg.-Nr."," Unterschrift des\n Teilnehmers",null,null,null,"Lfd-Nr. der Bescheinigung\nBeginn mit der Nummer?"]
[null,null,1,null,null,null,null,null,null,null,null,null,null,null,null,null,null,null,null,{"$f":"IF(E12<>\"\",Data!N3,\"\")","v":""}]
[null,null,null,null,null,null,null,null,null,null,null,null,null,null,null,null,null,null,null,null,null,null,null,null,1,"bis",{"$f":"IF(NOT(ISBLANK(Y13)),MAX(Data!L3:L22),\"\")","v":0}]
[null,null,2,null,null,null,null,null,null,null,null,null,null,null,null,null,null,null,null,{"$f":"IF(E14<>\"\",Data!N4,\"\")","v":""}]
[]
[null,null,3,null,null,null,null,null,null,null,null,null,null,null,null,null,null,null,null,{"$f":"IF(E16<>\"\",Data!N5,\"\")","v":""}]
[]
[null,null,4,null,null,null,null,null,null,null,null,null,null,null,null,null,null,null,null,{"$f":"IF(E18<>\"\",Data!N6,\"\")","v":""}]
[]
[null,null,5,null,null,null,null,null,null,null,null,null,null,null,null,null,null,null,null,{"$f":"IF(E20<>\"\",Data!N7,\"\")","v":""}]
{"$rows_left_out":37}
{"sheet":"TNB","index":1,"n_rows":54,"n_cols":113,"rows_kept":54,"cut":false,"hidden":false,"merged":[[38,2,38,109],[39,2,39,109],[40,2,42,109],[45,2,47,109],[49,2,49,36],[49,37,53,37],[49,38,49,73],[49,74,53,74],[50,2,50,36],[50,38,50,73],[51,2,51,36],[51,38,51,73],[52,38,52,73],[53,38,53,73],[48,2,48,109],[49,75,52,109],[35,112,36,112],[36,2,36,109],[37,2,37,11],[37,12,37,27],[37,28,37,32],[37,33,37,48],[37,49,37,52],[37,53,37,109],[35,2,35,9],[35,10,35,39],[35,40,35,42],[35,54,35,80],[35,81,35,83],[31,13,31,42],[31,43,31,87],[32,2,32,87],[33,2,33,87],[34,2,34,87],[8,112,9,112],[28,2,28,109],[22,37,26,37],[35,94,35,109],[22,74,26,74],[22,38,22,73],[10,28,10,32],[10,33,10,48],[10,53,10,109],[35,84,35,93],[24,38,24,73],[27,2,27,109],[22,2,22,36],[18,2,20,109],[16,2,16,109],[17,2,17,109],[53,75,53,109],[53,2,53,36],[52,2,52,36],[54,2,54,109],[23,2,23,36],[23,38,23,73],[26,38,26,73],[44,2,44,109],[43,2,43,109],[26,2,26,36],[25,2,25,36],[24,2,24,36],[29,2,29,87],[29,88,34,109],[30,2,30,87],[31,2,31,12],[21,2,21,109],[25,38,25,73],[26,75,26,109],[22,75,25,109],[2,88,7,109],[2,2,2,87],[3,2,3,87],[4,2,4,12],[4,13,4,42],[4,43,4,87],[5,2,5,87],[6,2,6,87],[7,2,7,87],[8,94,8,109],[8,84,8,93],[8,81,8,83],[8,2,8,9],[8,10,8,39],[8,40,8,42],[8,54,8,80],[12,2,12,109],[13,2,15,109],[11,2,11,109],[9,2,9,109],[10,2,10,11],[10,12,10,27],[10,49,10,52]]}
[]
[]
[null,null,"Teilnahmebescheinigung",null,null,null,null,null,null,null,null,null,null,null,null,null,null,null,null,null,null,null,null,null,null,null,null,null,null,null,null,null,null,null,null,null,null,null,null,null,null,null,null,null,null,null,null,null,null,null,null,null,null,null,null,null,null,null,null,null,null,null,null,null,null,null,null,null,null,null,null,null,null,null,null,null,null,null,null,null,null,null,null,null,null,null,null,null,null,null,null,null,null,null,null,null,null,null,null,null,null,null,null,null,null,null,null,null,null,null,null,null,{"$f":"SUM(Data!P2:P5)","v":1}]
[]
[null,null,"Nummer:",null,null,null,null,null,null,null,null,null,null,{"$f":"IF(ISNA(IF(DI9<>\"\",VLOOKUP(DI9,Data!B3:N22,13,FALSE),\"\")),\"\",IF(DI9<>\"\",VLOOKUP(DI9,Data!B3:N22,13,FALSE),\"\"))","v":""}]
[null,null,null,null,null,null,null,null,null,null,null,null,null,null,null,null,null,null,null,null,null,null,null,null,null,null,null,null,null,null,null,null,null,null,null,null,null,null,null,null,null,null,null,null,null,null,null,null,null,null,null,null,null,null,null,null,null,null,null,null,null,null,null,null,null,null,null,null,null,null,null,null,null,null,null,null,null,null,null,null,null,null,null,null,null,null,null,null,null,null,null,null,null,null,null,null,null,null,null,null,null,null,null,null,null,null,null,null,null,null,null,null,"Für das Drucken einzelner Bescheinigung:"]
[null,null,null,null,null,null,null,null,null,null,null,null,null,null,null,null,null,null,null,null,null,null,null,null,null,null,null,null,null,null,null,null,null,null,null,null,null,null,null,null,null,null,null,null,null,null,null,null,null,null,null,null,null,null,null,null,null,null,null,null,null,null,null,null,null,null,null,null,null,null,null,null,null,null,null,null,null,null,null,null,null,null,null,null,null,null,null,null,null,null,null,null,null,null,null,null,null,null,null,null,null,null,null,null,null,null,null,null,null,null,null,null,"Die laufende Nummer aus der Teilnehmerliste (TNL) hier eintragen."]
[]
[null,null,"Name:",null,null,null,null,null,null,null,{"$f":"IF(ISNA(IF(DI9<>\"\",VLOOKUP(DI9,Data!B3:N22,3,FALSE),\"\")),\"\",IF(DI9<>\"\",VLOOKUP(DI9,Data!B3:N22,3,FALSE),\"\"))","v":""},null,null,null,null,null,null,null,null,null,null,null,null,null,null,null,null,null,null,null,null,null,null,null,null,null,null,null,null,null,null,null,null,"Vorname:",null,null,null,null,null,null,null,null,null,null,{"$f":"IF(ISNA(IF(DI9<>\"\",VLOOKUP(DI9,Data!B3:N22,4,FALSE),\"\")),\"\",IF(DI9<>\"\",VLOOKUP(DI9,Data!B3:N22,4,FALSE),\"\"))","v":""},null,null,null,null,null,null,null,null,null,null,null,null,null,null,null,null,null,null,null,null,null,null,null,null,null,null,null,null,null,"geb. am:",null,null,null,null,null,null,null,null,null,{"$f":"IF(ISNA(IF(DI9<>\"\",VLOOKUP(DI9,Data!B3:N22,5,FALSE),\"\")),\"\",IF(DI9<>\"\",VLOOKUP(DI9,Data!B3:N22,5,FALSE),\"\"))","v":""},null,null,null,null,null,null,null,null,null,null,null,null,null,null,null,null,null,1]
[]
[null,null,"hat vom:",null,null,null,null,null,null,null,null,null,{"$f":"IF(TNL!H7<>\"\",TNL!H7,\"\")","v":""},null,null,null,null,null,null,null,null,null,null,null,null,null,null,null,"bis:",null,null,null,null,{"$f":"IF(TNL!K7<>\"\",TNL!K7,\"\")","v":""},null,null,null,null,null,null,null,null,null,null,null,null,null,null,null,"in:",null,null,null,{"$f":"IF(TNL!G8<>\"\",CONCATENATE(TEXT(TNL!G8,\"00000\")&\" \"&TNL!I8),\"\")","v":""}]
[]
[null,null,{"$f":"IF(DI3<>0,VLOOKUP(Data!P1,Data!P2:V5,7,FALSE),\"\")","v":"erfolgreich an einer Ausbildung"}]
[null,null,{"$f":"IF(DI3<>0,VLOOKUP(DI3,Data!Q2:T5,2,FALSE),\"\")","v":"Erste Hilfe bei Kindernotfällen"}]
[]
[]
[null,null,{"$f":"IF(DI3<>0,\"mit 9 Lerneinheiten* teilgenommen. (*Eine Lerneinheit gleich 45 Minuten.)\",\"\")","v":"mit 9 Lerneinheiten* teilgenommen. (*Eine Lerneinheit gleich 45 Minuten.)"}]
[]
[null,null,{"$f":"IF(DI3<>0,VLOOKUP(DI3,Data!P2:U5,5,FALSE),\"\")","v":"Diese Erste Hilfe-Ausbildung ist eine spezielle Schulung für Eltern, Sorgeberechtigte, Erzieher und Lehrer sowie sonstige Interessierte, um auf Notfälle, die im Kindesalter auftreten können, vorbereitet zu sein. Sie eignet sich insbesondere für Personal in Kindertageseinrichtungen und Grundschulen."}]
[]
{"$rows_left_out":35}
{"sheet":"Data","index":2,"n_rows":22,"n_cols":22,"rows_kept":22,"cut":false,"hidden":true,"merged":[]}
[1,2,3,4,5,6,7,8,9,10,11,12,13,14,null,{"$f":"SUM(P2:P5)","v":1},2,3,{"$f":"SUM(S2:S5)","v":313},4,5,6]
["DNr.","Nr.","Name, Vorname","Name","Vorname","Geb.","Straße","Wohnort","Nummer Gliederung","PO-Nummer","Plus Nr.","Lfd.-Nr.","Jahr","Reg.-Nr.",null,{"$f":"IF(TNL!G5=U2,1,0)","v":1},1,"Erste Hilfe bei Kindernotfällen",{"$f":"IF(P2<>0,313,0)","v":313},"Diese Erste Hilfe-Ausbildung ist eine spezielle Schulung für Eltern, Sorgeberechtigte, Erzieher und Lehrer sowie sonstige Interessierte, um auf Notfälle, die im Kindesalter auftreten können, vorbereitet zu sein. Sie eignet sich insbesondere für Personal in Kindertageseinrichtungen und Grundschulen.","Ausb. EH bei Kindernotfällen","erfolgreich an einer Ausbildung"]
[{"$f":"IF(B3<>\"\",B3,0)","v":0},{"$f":"IF(C3<>\"\",1,\"\")","v":""},{"$f":"IF(TNL!E12<>\"\",TNL!E12&\", \"&TNL!E13,\"\")","v":""},{"$f":"IF(C3<>\"\",TNL!E12,\"\")","v":""},{"$f":"IF(C3<>\"\",TNL!E13,\"\")","v":""},{"$f":"IF(C3<>\"\",TEXT(TNL!I12,\"TT.MM.JJJJ\"),\"\")","v":""},{"$f":"IF(C3<>\"\",TNL!L12,\"\")","v":""},{"$f":"IF(C3<>\"\",TNL!L13,\"\")","v":""},{"$f":"IF(B3<>\"\",TEXT(TNL!$L$9,\"00 00 000\"),\"\")","v":""},{"$f":"IF(B3<>\"\",$S$1,\"\")","v":""},{"$f":"IF(C3<>\"\",0,\"\")","v":""},{"$f":"IF(C3<>\"\",TNL!$Y$13+K3,\"\")","v":""},{"$f":"IF(B3<>\"\",CONCATENATE(TEXT(TNL!$K$7,\"JJ\"),\"\"),IF(TNL!$K$7<>\"\",\"\",\"\"))","v":""},{"$f":"IF(B3<>\"\",CONCATENATE(I3,\" / \",J3,\" / \",TEXT(L3,\"0000\"),\" / \",M3),\"\")","v":""},null,0,2,null,{"$f":"IF(P3<>0,0,0)","v":0},null," "]
[{"$f":"IF(B4<>\"\",B4,0)","v":0},{"$f":"IF(C4<>\"\",2,\"\")","v":""},{"$f":"IF(TNL!E14<>\"\",TNL!E14&\", \"&TNL!E15,\"\")","v":""},{"$f":"IF(C4<>\"\",TNL!E14,\"\")","v":""},{"$f":"IF(C4<>\"\",TNL!E15,\"\")","v":""},{"$f":"IF(C4<>\"\",TEXT(TNL!I14,\"TT.MM.JJJJ\"),\"\")","v":""},{"$f":"IF(C4<>\"\",TNL!L14,\"\")","v":""},{"$f":"IF(C4<>\"\",TNL!L15,\"\")","v":""},{"$f":"IF(B4<>\"\",TEXT(TNL!$L$9,\"00 00 000\"),\"\")","v":""},{"$f":"IF(B4<>\"\",$S$1,\"\")","v":""},{"$f":"IF(C4<>\"\",1,\"\")","v":""},{"$f":"IF(C4<>\"\",TNL!$Y$13+K4,\"\")","v":""},{"$f":"IF(B4<>\"\",CONCATENATE(TEXT(TNL!$K$7,\"JJ\"),\"\"),IF(TNL!$K$7<>\"\",\"\",\"\"))","v":""},{"$f":"IF(B4<>\"\",CONCATENATE(I4,\" / \",J4,\" / \",TEXT(L4,\"0000\"),\" / \",M4),\"\")","v":""},null,{"$f":"IF(TNL!G5=U4,3,0)","v":0},3,"Erste Hilfe bei Kindernotfällen",{"$f":"IF(P4<>0,322,0)","v":0},"Diese Erste Hilfe-Fortbildung ist eine spezielle Schulung für Eltern, Sorgeberechtigte, Erzieher und Lehrer sowie sonstige Interessierte, um auf Notfälle, die im Kindesalter auftreten können, vorbereitet zu sein. Sie eignet sich insbesondere für Personal in Kindertageseinrichtungen und Grundschulen.","Fobi. EH bei Kindernotfällen","ergolgreich an einer Fortbildung"]
[0,{"$f":"IF(C5<>\"\",3,\"\")","v":""},{"$f":"IF(TNL!E16<>\"\",TNL!E16&\", \"&TNL!E17,\"\")","v":""},{"$f":"IF(C5<>\"\",TNL!E16,\"\")","v":""},{"$f":"IF(C5<>\"\",TNL!E17,\"\")","v":""},{"$f":"IF(C5<>\"\",TEXT(TNL!I16,\"TT.MM.JJJJ\"),\"\")","v":""},{"$f":"IF(C5<>\"\",TNL!L16,\"\")","v":""},{"$f":"IF(C5<>\"\",TNL!L17,\"\")","v":""},{"$f":"IF(B5<>\"\",TEXT(TNL!$L$9,\"00 00 000\"),\"\")","v":""},"",{"$f":"IF(C5<>\"\",2,\"\")","v":""},{"$f":"IF(C5<>\"\",TNL!$Y$13+K5,\"\")","v":""},{"$f":"IF(B5<>\"\",CONCATENATE(TEXT(TNL!$K$7,\"JJ\"),\"\"),IF(TNL!$K$7<>\"\",\"\",\"\"))","v":""},"",null,0,4,null,{"$f":"IF(P5<>0,0,0)","v":0},null," "]
[0,{"$f":"IF(C6<>\"\",4,\"\")","v":""},{"$f":"IF(TNL!E18<>\"\",TNL!E18&\", \"&TNL!E19,\"\")","v":""},{"$f":"IF(C6<>\"\",TNL!E18,\"\")","v":""},{"$f":"IF(C6<>\"\",TNL!E19,\"\")","v":""},{"$f":"IF(C6<>\"\",TEXT(TNL!I18,\"TT.MM.JJJJ\"),\"\")","v":""},{"$f":"IF(C6<>\"\",TNL!L18,\"\")","v":""},{"$f":"IF(C6<>\"\",TNL!L19,\"\")","v":""},{"$f":"IF(B6<>\"\",TEXT(TNL!$L$9,\"00 00 000\"),\"\")","v":""},"",{"$f":"IF(C6<>\"\",3,\"\")","v":""},{"$f":"IF(C6<>\"\",TNL!$Y$13+K6,\"\")","v":""},{"$f":"IF(B6<>\"\",CONCATENATE(TEXT(TNL!$K$7,\"JJ\"),\"\"),IF(TNL!$K$7<>\"\",\"\",\"\"))","v":""},""]
[0,{"$f":"IF(C7<>\"\",5,\"\")","v":""},{"$f":"IF(TNL!E20<>\"\",TNL!E20&\", \"&TNL!E21,\"\")","v":""},{"$f":"IF(C7<>\"\",TNL!E20,\"\")","v":""},{"$f":"IF(C7<>\"\",TNL!E21,\"\")","v":""},{"$f":"IF(C7<>\"\",TEXT(TNL!I20,\"TT.MM.JJJJ\"),\"\")","v":""},{"$f":"IF(C7<>\"\",TNL!L20,\"\")","v":""},{"$f":"IF(C7<>\"\",TNL!L21,\"\")","v":""},{"$f":"IF(B7<>\"\",TEXT(TNL!$L$9,\"00 00 000\"),\"\")","v":""},"",{"$f":"IF(C7<>\"\",4,\"\")","v":""},{"$f":"IF(C7<>\"\",TNL!$Y$13+K7,\"\")","v":""},{"$f":"IF(B7<>\"\",CONCATENATE(TEXT(TNL!$K$7,\"JJ\"),\"\"),IF(TNL!$K$7<>\"\",\"\",\"\"))","v":""},""]
[0,{"$f":"IF(C8<>\"\",6,\"\")","v":""},{"$f":"IF(TNL!E22<>\"\",TNL!E22&\", \"&TNL!E23,\"\")","v":""},{"$f":"IF(C8<>\"\",TNL!E22,\"\")","v":""},{"$f":"IF(C8<>\"\",TNL!E23,\"\")","v":""},{"$f":"IF(C8<>\"\",TEXT(TNL!I22,\"TT.MM.JJJJ\"),\"\")","v":""},{"$f":"IF(C8<>\"\",TNL!L22,\"\")","v":""},{"$f":"IF(C8<>\"\",TNL!L23,\"\")","v":""},{"$f":"IF(B8<>\"\",TEXT(TNL!$L$9,\"00 00 000\"),\"\")","v":""},"",{"$f":"IF(C8<>\"\",5,\"\")","v":""},{"$f":"IF(C8<>\"\",TNL!$Y$13+K8,\"\")","v":""},{"$f":"IF(B8<>\"\",CONCATENATE(TEXT(TNL!$K$7,\"JJ\"),\"\"),IF(TNL!$K$7<>\"\",\"\",\"\"))","v":""},""]
[0,{"$f":"IF(C9<>\"\",7,\"\")","v":""},{"$f":"IF(TNL!E24<>\"\",TNL!E24&\", \"&TNL!E25,\"\")","v":""},{"$f":"IF(C9<>\"\",TNL!E24,\"\")","v":""},{"$f":"IF(C9<>\"\",TNL!E25,\"\")","v":""},{"$f":"IF(C9<>\"\",TEXT(TNL!I24,\"TT.MM.JJJJ\"),\"\")","v":""},{"$f":"IF(C9<>\"\",TNL!L24,\"\")","v":""},{"$f":"IF(C9<>\"\",TNL!L25,\"\")","v":""},{"$f":"IF(B9<>\"\",TEXT(TNL!$L$9,\"00 00 000\"),\"\")","v":""},"",{"$f":"IF(C9<>\"\",6,\"\")","v":""},{"$f":"IF(C9<>\"\",TNL!$Y$13+K9,\"\")","v":""},{"$f":"IF(B9<>\"\",CONCATENATE(TEXT(TNL!$K$7,\"JJ\"),\"\"),IF(TNL!$K$7<>\"\",\"\",\"\"))","v":""},""]
[0,{"$f":"IF(C10<>\"\",8,\"\")","v":""},{"$f":"IF(TNL!E26<>\"\",TNL!E26&\", \"&TNL!E27,\"\")","v":""},{"$f":"IF(C10<>\"\",TNL!E26,\"\")","v":""},{"$f":"IF(C10<>\"\",TNL!E27,\"\")","v":""},{"$f":"IF(C10<>\"\",TEXT(TNL!I26,\"TT.MM.JJJJ\"),\"\")","v":""},{"$f":"IF(C10<>\"\",TNL!L26,\"\")","v":""},{"$f":"IF(C10<>\"\",TNL!L27,\"\")","v":""},{"$f":"IF(B10<>\"\",TEXT(TNL!$L$9,\"00 00 000\"),\"\")","v":""},"",{"$f":"IF(C10<>\"\",7,\"\")","v":""},{"$f":"IF(C10<>\"\",TNL!$Y$13+K10,\"\")","v":""},{"$f":"IF(B10<>\"\",CONCATENATE(TEXT(TNL!$K$7,\"JJ\"),\"\"),IF(TNL!$K$7<>\"\",\"\",\"\"))","v":""},""]
[0,{"$f":"IF(C11<>\"\",9,\"\")","v":""},{"$f":"IF(TNL!E28<>\"\",TNL!E28&\", \"&TNL!E29,\"\")","v":""},{"$f":"IF(C11<>\"\",TNL!E28,\"\")","v":""},{"$f":"IF(C11<>\"\",TNL!E29,\"\")","v":""},{"$f":"IF(C11<>\"\",TEXT(TNL!I28,\"TT.MM.JJJJ\"),\"\")","v":""},{"$f":"IF(C11<>\"\",TNL!L28,\"\")","v":""},{"$f":"IF(C11<>\"\",TNL!L29,\"\")","v":""},{"$f":"IF(B11<>\"\",TEXT(TNL!$L$9,\"00 00 000\"),\"\")","v":""},"",{"$f":"IF(C11<>\"\",8,\"\")","v":""},{"$f":"IF(C11<>\"\",TNL!$Y$13+K11,\"\")","v":""},{"$f":"IF(B11<>\"\",CONCATENATE(TEXT(TNL!$K$7,\"JJ\"),\"\"),IF(TNL!$K$7<>\"\",\"\",\"\"))","v":""},""]
[0,{"$f":"IF(C12<>\"\",10,\"\")","v":""},{"$f":"IF(TNL!E30<>\"\",TNL!E30&\", \"&TNL!E31,\"\")","v":""},{"$f":"IF(C12<>\"\",TNL!E30,\"\")","v":""},{"$f":"IF(C12<>\"\",TNL!E31,\"\")","v":""},{"$f":"IF(C12<>\"\",TEXT(TNL!I30,\"TT.MM.JJJJ\"),\"\")","v":""},{"$f":"IF(C12<>\"\",TNL!L30,\"\")","v":""},{"$f":"IF(C12<>\"\",TNL!L31,\"\")","v":""},{"$f":"IF(B12<>\"\",TEXT(TNL!$L$9,\"00 00 000\"),\"\")","v":""},"",{"$f":"IF(C12<>\"\",9,\"\")","v":""},{"$f":"IF(C12<>\"\",TNL!$Y$13+K12,\"\")","v":""},{"$f":"IF(B12<>\"\",CONCATENATE(TEXT(TNL!$K$7,\"JJ\"),\"\"),IF(TNL!$K$7<>\"\",\"\",\"\"))","v":""},""]
[0,{"$f":"IF(C13<>\"\",11,\"\")","v":""},{"$f":"IF(TNL!E32<>\"\",TNL!E32&\", \"&TNL!E33,\"\")","v":""},{"$f":"IF(C13<>\"\",TNL!E32,\"\")","v":""},{"$f":"IF(C13<>\"\",TNL!E33,\"\")","v":""},{"$f":"IF(C13<>\"\",TEXT(TNL!I32,\"TT.MM.JJJJ\"),\"\")","v":""},{"$f":"IF(C13<>\"\",TNL!L32,\"\")","v":""},{"$f":"IF(C13<>\"\",TNL!L33,\"\")","v":""},{"$f":"IF(B13<>\"\",TEXT(TNL!$L$9,\"00 00 000\"),\"\")","v":""},"",{"$f":"IF(C13<>\"\",10,\"\")","v":""},{"$f":"IF(C13<>\"\",TNL!$Y$13+K13,\"\")","v":""},{"$f":"IF(B13<>\"\",CONCATENATE(TEXT(TNL!$K$7,\"JJ\"),\"\"),IF(TNL!$K$7<>\"\",\"\",\"\"))","v":""},""]
[0,{"$f":"IF(C14<>\"\",12,\"\")","v":""},{"$f":"IF(TNL!E34<>\"\",TNL!E34&\", \"&TNL!E35,\"\")","v":""},{"$f":"IF(C14<>\"\",TNL!E34,\"\")","v":""},{"$f":"IF(C14<>\"\",TNL!E35,\"\")","v":""},{"$f":"IF(C14<>\"\",TEXT(TNL!I34,\"TT.MM.JJJJ\"),\"\")","v":""},{"$f":"IF(C14<>\"\",TNL!L34,\"\")","v":""},{"$f":"IF(C14<>\"\",TNL!L35,\"\")","v":""},{"$f":"IF(B14<>\"\",TEXT(TNL!$L$9,\"00 00 000\"),\"\")","v":""},"",{"$f":"IF(C14<>\"\",11,\"\")","v":""},{"$f":"IF(C14<>\"\",TNL!$Y$13+K14,\"\")","v":""},{"$f":"IF(B14<>\"\",CONCATENATE(TEXT(TNL!$K$7,\"JJ\"),\"\"),IF(TNL!$K$7<>\"\",\"\",\"\"))","v":""},""]
[0,{"$f":"IF(C15<>\"\",13,\"\")","v":""},{"$f":"IF(TNL!E36<>\"\",TNL!E36&\", \"&TNL!E37,\"\")","v":""},{"$f":"IF(C15<>\"\",TNL!E36,\"\")","v":""},{"$f":"IF(C15<>\"\",TNL!E37,\"\")","v":""},{"$f":"IF(C15<>\"\",TEXT(TNL!I36,\"TT.MM.JJJJ\"),\"\")","v":""},{"$f":"IF(C15<>\"\",TNL!L36,\"\")","v":""},{"$f":"IF(C15<>\"\",TNL!L37,\"\")","v":""},{"$f":"IF(B15<>\"\",TEXT(TNL!$L$9,\"00 00 000\"),\"\")","v":""},"",{"$f":"IF(C15<>\"\",12,\"\")","v":""},{"$f":"IF(C15<>\"\",TNL!$Y$13+K15,\"\")","v":""},{"$f":"IF(B15<>\"\",CONCATENATE(TEXT(TNL!$K$7,\"JJ\"),\"\"),IF(TNL!$K$7<>\"\",\"\",\"\"))","v":""},""]
[0,{"$f":"IF(C16<>\"\",14,\"\")","v":""},{"$f":"IF(TNL!E38<>\"\",TNL!E38&\", \"&TNL!E39,\"\")","v":""},{"$f":"IF(C16<>\"\",TNL!E38,\"\")","v":""},{"$f":"IF(C16<>\"\",TNL!E39,\"\")","v":""},{"$f":"IF(C16<>\"\",TEXT(TNL!I38,\"TT.MM.JJJJ\"),\"\")","v":""},{"$f":"IF(C16<>\"\",TNL!L38,\"\")","v":""},{"$f":"IF(C16<>\"\",TNL!L39,\"\")","v":""},{"$f":"IF(B16<>\"\",TEXT(TNL!$L$9,\"00 00 000\"),\"\")","v":""},"",{"$f":"IF(C16<>\"\",13,\"\")","v":""},{"$f":"IF(C16<>\"\",TNL!$Y$13+K16,\"\")","v":""},{"$f":"IF(B16<>\"\",CONCATENATE(TEXT(TNL!$K$7,\"JJ\"),\"\"),IF(TNL!$K$7<>\"\",\"\",\"\"))","v":""},""]
[0,{"$f":"IF(C17<>\"\",15,\"\")","v":""},{"$f":"IF(TNL!E40<>\"\",TNL!E40&\", \"&TNL!E41,\"\")","v":""},{"$f":"IF(C17<>\"\",TNL!E40,\"\")","v":""},{"$f":"IF(C17<>\"\",TNL!E41,\"\")","v":""},{"$f":"IF(C17<>\"\",TEXT(TNL!I40,\"TT.MM.JJJJ\"),\"\")","v":""},{"$f":"IF(C17<>\"\",TNL!L40,\"\")","v":""},{"$f":"IF(C17<>\"\",TNL!L41,\"\")","v":""},{"$f":"IF(B17<>\"\",TEXT(TNL!$L$9,\"00 00 000\"),\"\")","v":""},"",{"$f":"IF(C17<>\"\",14,\"\")","v":""},{"$f":"IF(C17<>\"\",TNL!$Y$13+K17,\"\")","v":""},{"$f":"IF(B17<>\"\",CONCATENATE(TEXT(TNL!$K$7,\"JJ\"),\"\"),IF(TNL!$K$7<>\"\",\"\",\"\"))","v":""},""]
[0,{"$f":"IF(C18<>\"\",16,\"\")","v":""},{"$f":"IF(TNL!E42<>\"\",TNL!E42&\", \"&TNL!E43,\"\")","v":""},{"$f":"IF(C18<>\"\",TNL!E42,\"\")","v":""},{"$f":"IF(C18<>\"\",TNL!E43,\"\")","v":""},{"$f":"IF(C18<>\"\",TEXT(TNL!I42,\"TT.MM.JJJJ\"),\"\")","v":""},{"$f":"IF(C18<>\"\",TNL!L42,\"\")","v":""},{"$f":"IF(C18<>\"\",TNL!L43,\"\")","v":""},{"$f":"IF(B18<>\"\",TEXT(TNL!$L$9,\"00 00 000\"),\"\")","v":""},"",{"$f":"IF(C18<>\"\",15,\"\")","v":""},{"$f":"IF(C18<>\"\",TNL!$Y$13+K18,\"\")","v":""},{"$f":"IF(B18<>\"\",CONCATENATE(TEXT(TNL!$K$7,\"JJ\"),\"\"),IF(TNL!$K$7<>\"\",\"\",\"\"))","v":""},""]
[0,{"$f":"IF(C19<>\"\",17,\"\")","v":""},{"$f":"IF(TNL!E44<>\"\",TNL!E44&\", \"&TNL!E45,\"\")","v":""},{"$f":"IF(C19<>\"\",TNL!E44,\"\")","v":""},{"$f":"IF(C19<>\"\",TNL!E45,\"\")","v":""},{"$f":"IF(C19<>\"\",TEXT(TNL!I44,\"TT.MM.JJJJ\"),\"\")","v":""},{"$f":"IF(C19<>\"\",TNL!L44,\"\")","v":""},{"$f":"IF(C19<>\"\",TNL!L45,\"\")","v":""},{"$f":"IF(B19<>\"\",TEXT(TNL!$L$9,\"00 00 000\"),\"\")","v":""},"",{"$f":"IF(C19<>\"\",16,\"\")","v":""},{"$f":"IF(C19<>\"\",TNL!$Y$13+K19,\"\")","v":""},{"$f":"IF(B19<>\"\",CONCATENATE(TEXT(TNL!$K$7,\"JJ\"),\"\"),IF(TNL!$K$7<>\"\",\"\",\"\"))","v":""},""]
[0,{"$f":"IF(C20<>\"\",18,\"\")","v":""},{"$f":"IF(TNL!E46<>\"\",TNL!E46&\", \"&TNL!E47,\"\")","v":""},{"$f":"IF(C20<>\"\",TNL!E46,\"\")","v":""},{"$f":"IF(C20<>\"\",TNL!E47,\"\")","v":""},{"$f":"IF(C20<>\"\",TEXT(TNL!I46,\"TT.MM.JJJJ\"),\"\")","v":""},{"$f":"IF(C20<>\"\",TNL!L46,\"\")","v":""},{"$f":"IF(C20<>\"\",TNL!L47,\"\")","v":""},{"$f":"IF(B20<>\"\",TEXT(TNL!$L$9,\"00 00 000\"),\"\")","v":""},"",{"$f":"IF(C20<>\"\",17,\"\")","v":""},{"$f":"IF(C20<>\"\",TNL!$Y$13+K20,\"\")","v":""},{"$f":"IF(B20<>\"\",CONCATENATE(TEXT(TNL!$K$7,\"JJ\"),\"\"),IF(TNL!$K$7<>\"\",\"\",\"\"))","v":""},""]
{"$rows_left_out":2}