{"text_format":"1","workbook":"xlsx","n_sheets":19,"sheets":["Start","Doku","Tdb","DSGVO","TNL","UTN","D_H_A","Urkunde_1","Rs_1","Urkunde_2","Rs_2","TBG","TNB","TNB_2","Data_LD","Data_PD","Data_TNB","Data_UR","UR_Data"],"not_rendered":{"charts":0,"images":25,"macros":1,"external_links":0,"defined_names":13,"comments":0,"pivot_tables":0},"unopened":[],"bounds":{"document_bytes":16777216,"sheet_cells":100000,"rows_first":2000,"rows_last":500,"rows_between":2000,"halvings":0,"cell_chars":16384,"cell_head_chars":4096},"cells_cut":0,"cells_raw":0,"read":"whole","date_system":"1900"}

{"sheet":"Start","index":0,"n_rows":43,"n_cols":14,"rows_kept":43,"cut":false,"hidden":false,"merged":[[19,10,19,16],[17,10,17,11],[17,12,17,14],[15,10,15,16],[1,1,2,6],[11,8,11,18],[8,9,9,15],[10,8,10,18],[30,1,30,6],[27,9,27,10],[28,9,28,10],[27,11,27,12],[28,11,28,12],[27,13,27,15],[28,13,28,15],[13,10,13,16],[24,13,24,14],[24,9,24,12],[23,9,23,16],[21,10,21,16]]}
[]
[null,"Anwendungsprogramm zur Erstellung von Aus- und Fortbildungsnachweisen sowie Urkunden für die Gliederung."]
[]
[null,"Wichtige Informationen stehen unterhalb dieser Liste!",null,null,null,null,null,null,null,null,null,null,null," DHA = Dozent | Hospitation | Assistenz"]
[null,null,null,null,null,null,null,null,null,null,null,null,null," Bestätigungen Dozent | Hospitation | Assistenz"]
[null,null,null,"Achtung!   Gelbe Leiste beim öffnen.   Inhalte und Makros aktivieren!"]
[]
[]
[null,null,"Nr.","Lehrgangstitel und Lehrgangsart","Orga","Form",null,null,null,"   Welchen Lehrgang möchtest Du bearbeiten?\n   Wähle eine Nummer aus der Liste.\n"]
[null,null,{"$f":"IF(Data_LD!AA4<>\"\",Data_LD!AA4,\"\")","v":1},{"$f":"IF(C10<>\"\",VLOOKUP(C10,Data_LD!$AA$4:$AE$23,2,FALSE),\"\")","v":"Erste-Hilfe-Ausbildung – für betriebliche Ersthelfende | EH-Schulung gemäß § 19 FeV"},{"$f":"IF(C10<>\"\",VLOOKUP(C10,Data_LD!$A$4:$W$23,4,FALSE),\"\")","v":"DGUV"},{"$f":"IF(C10<>\"\",VLOOKUP(C10,Data_LD!$AA$4:$AE$23,5,FALSE),\"\")","v":"Ausbildung"}]
[null,null,{"$f":"IF(Data_LD!AA5<>\"\",Data_LD!AA5,\"\")","v":2},{"$f":"IF(C11<>\"\",VLOOKUP(C11,Data_LD!$A$4:$W$23,9,FALSE),\"\")","v":"Erste-Hilfe-Schulung – in Bildungs- und Betreuungseinrichtungen für Kinder"},{"$f":"IF(C11<>\"\",VLOOKUP(C11,Data_LD!$A$4:$W$23,4,FALSE),\"\")","v":"DGUV"},{"$f":"IF(C11<>\"\",VLOOKUP(C11,Data_LD!$A$4:$W$23,6,FALSE),\"\")","v":"Schulung"},null,null,{"$f":"IF(I9<>\"\",VLOOKUP(I9,Data_LD!$A$4:$W$23,7,FALSE),\"\")","v":""}]
[null,null,{"$f":"IF(Data_LD!AA6<>\"\",Data_LD!AA6,\"\")","v":3},{"$f":"IF(C12<>\"\",VLOOKUP(C12,Data_LD!$A$4:$W$23,9,FALSE),\"\")","v":"Erste-Hilfe-Fortbildung – Auffrischung der Kenntnisse in Erster Hilfe"},{"$f":"IF(C12<>\"\",VLOOKUP(C12,Data_LD!$A$4:$W$23,4,FALSE),\"\")","v":"DGUV"},{"$f":"IF(C12<>\"\",VLOOKUP(C12,Data_LD!$A$4:$W$23,6,FALSE),\"\")","v":"Fortbildung"},null,null,{"$f":"IF(I9<>\"\",VLOOKUP(I9,Data_LD!A4:W23,8,FALSE),\"\")","v":""}]
[null,null,{"$f":"IF(Data_LD!AA7<>\"\",Data_LD!AA7,\"\")","v":""},{"$f":"IF(C13<>\"\",VLOOKUP(C13,Data_LD!$A$4:$W$23,9,FALSE),\"\")","v":""},{"$f":"IF(C13<>\"\",VLOOKUP(C13,Data_LD!$A$4:$W$23,4,FALSE),\"\")","v":""},{"$f":"IF(C13<>\"\",VLOOKUP(C13,Data_LD!$A$4:$W$23,6,FALSE),\"\")","v":""}]
[null,null,{"$f":"IF(Data_LD!AA8<>\"\",Data_LD!AA8,\"\")","v":5},{"$f":"IF(C14<>\"\",VLOOKUP(C14,Data_LD!$A$4:$W$23,9,FALSE),\"\")","v":"Erste-Hilfe-Schulung – gemäß § 19 Fahrerlaubnis-Verordnung (FeV)"},{"$f":"IF(C14<>\"\",VLOOKUP(C14,Data_LD!$A$4:$W$23,4,FALSE),\"\")","v":"FeV"},{"$f":"IF(C14<>\"\",VLOOKUP(C14,Data_LD!$A$4:$W$23,6,FALSE),\"\")","v":"Schulung"},null,null,null,"Name d. Glieder.:"]
[null,null,{"$f":"IF(Data_LD!AA9<>\"\",Data_LD!AA9,\"\")","v":""},{"$f":"IF(C15<>\"\",VLOOKUP(C15,Data_LD!$A$4:$W$23,9,FALSE),\"\")","v":""},{"$f":"IF(C15<>\"\",VLOOKUP(C15,Data_LD!$A$4:$W$23,4,FALSE),\"\")","v":""},{"$f":"IF(C15<>\"\",VLOOKUP(C15,Data_LD!$A$4:$W$23,6,FALSE),\"\")","v":""}]
[null,null,{"$f":"IF(Data_LD!AA10<>\"\",Data_LD!AA10,\"\")","v":7},{"$f":"IF(C16<>\"\",VLOOKUP(C16,Data_LD!$A$4:$W$23,9,FALSE),\"\")","v":"Erste-Hilfe-Ausbildung – gemäß den Gemeinsamen Grundsätzen der BAGEH"},{"$f":"IF(C16<>\"\",VLOOKUP(C16,Data_LD!$A$4:$W$23,4,FALSE),\"\")","v":"DLRG"},{"$f":"IF(C16<>\"\",VLOOKUP(C16,Data_LD!$A$4:$W$23,6,FALSE),\"\")","v":"Ausbildung"},null,null,null,"Straße:"]
[null,null,{"$f":"IF(Data_LD!AA11<>\"\",Data_LD!AA11,\"\")","v":8},{"$f":"IF(C17<>\"\",VLOOKUP(C17,Data_LD!$A$4:$W$23,9,FALSE),\"\")","v":"Erste-Hilfe-Fortbildung – gemäß den Gemeinsamen Grundsätzen der BAGEH"},{"$f":"IF(C17<>\"\",VLOOKUP(C17,Data_LD!$A$4:$W$23,4,FALSE),\"\")","v":"DLRG"},{"$f":"IF(C17<>\"\",VLOOKUP(C17,Data_LD!$A$4:$W$23,6,FALSE),\"\")","v":"Fortbildung"}]
[null,null,{"$f":"IF(Data_LD!AA12<>\"\",Data_LD!AA12,\"\")","v":9},{"$f":"IF(C18<>\"\",VLOOKUP(C18,Data_LD!$A$4:$W$23,9,FALSE),\"\")","v":"Erste-Hilfe bei Kindernotfällen – Erste Hilfe leisten bei akuten Gefahren, Krankheiten und Notfällen"},{"$f":"IF(C18<>\"\",VLOOKUP(C18,Data_LD!$A$4:$W$23,4,FALSE),\"\")","v":"DLRG"},{"$f":"IF(C18<>\"\",VLOOKUP(C18,Data_LD!$A$4:$W$23,6,FALSE),\"\")","v":"Ausbildung"},null,null,null,"Postleitzahl:",null,null,"Gliederungs-Nr.: "]
[null,null,{"$f":"IF(Data_LD!AA13<>\"\",Data_LD!AA13,\"\")","v":10},{"$f":"IF(C19<>\"\",VLOOKUP(C19,Data_LD!$A$4:$W$23,9,FALSE),\"\")","v":"Erste-Hilfe-Fortbildung – Auffrischung der Kenntnisse Erste Hilfe bei Kindernotfällen"},{"$f":"IF(C19<>\"\",VLOOKUP(C19,Data_LD!$A$4:$W$23,4,FALSE),\"\")","v":"DLRG"},{"$f":"IF(C19<>\"\",VLOOKUP(C19,Data_LD!$A$4:$W$23,6,FALSE),\"\")","v":"Fortbildung"}]
[null,null,{"$f":"IF(Data_LD!AA14<>\"\",Data_LD!AA14,\"\")","v":""},{"$f":"IF(C20<>\"\",VLOOKUP(C20,Data_LD!$A$4:$W$23,9,FALSE),\"\")","v":""},{"$f":"IF(C20<>\"\",VLOOKUP(C20,Data_LD!$A$4:$W$23,4,FALSE),\"\")","v":""},{"$f":"IF(C20<>\"\",VLOOKUP(C20,Data_LD!$A$4:$W$23,6,FALSE),\"\")","v":""},null,null,null,"Ort der Gliederung:"]
[null,null,{"$f":"IF(Data_LD!AA15<>\"\",Data_LD!AA15,\"\")","v":12},{"$f":"IF(C21<>\"\",VLOOKUP(C21,Data_LD!$A$4:$W$23,9,FALSE),\"\")","v":"Sanitätsausbildung A – Sanitätshelfer"},{"$f":"IF(C21<>\"\",VLOOKUP(C21,Data_LD!$A$4:$W$23,4,FALSE),\"\")","v":"DLRG"},{"$f":"IF(C21<>\"\",VLOOKUP(C21,Data_LD!$A$4:$W$23,6,FALSE),\"\")","v":"Ausbildung"}]
[null,null,{"$f":"IF(Data_LD!AA16<>\"\",Data_LD!AA16,\"\")","v":13},{"$f":"IF(C22<>\"\",VLOOKUP(C22,Data_LD!$A$4:$W$23,9,FALSE),\"\")","v":"Sanitätsausbildung B – Sanitäter"},{"$f":"IF(C22<>\"\",VLOOKUP(C22,Data_LD!$A$4:$W$23,4,FALSE),\"\")","v":"DLRG"},{"$f":"IF(C22<>\"\",VLOOKUP(C22,Data_LD!$A$4:$W$23,6,FALSE),\"\")","v":"Ausbildung"},null,null,null,"Verantw. Arzt:"]
[null,null,{"$f":"IF(Data_LD!AA17<>\"\",Data_LD!AA17,\"\")","v":""},{"$f":"IF(C23<>\"\",VLOOKUP(C23,Data_LD!$A$4:$W$23,9,FALSE),\"\")","v":""},{"$f":"IF(C23<>\"\",VLOOKUP(C23,Data_LD!$A$4:$W$23,4,FALSE),\"\")","v":""},{"$f":"IF(C23<>\"\",VLOOKUP(C23,Data_LD!$A$4:$W$23,6,FALSE),\"\")","v":""}]
[null,null,{"$f":"IF(Data_LD!AA18<>\"\",Data_LD!AA18,\"\")","v":15},{"$f":"IF(C24<>\"\",VLOOKUP(C24,Data_LD!$A$4:$W$23,9,FALSE),\"\")","v":"RUND-Grundkurs – Erlernen von Darstellungen, Schminken von Verletzungen/Erkrankungen"},{"$f":"IF(C24<>\"\",VLOOKUP(C24,Data_LD!$A$4:$W$23,4,FALSE),\"\")","v":"DLRG"},{"$f":"IF(C24<>\"\",VLOOKUP(C24,Data_LD!$A$4:$W$23,6,FALSE),\"\")","v":"Ausbildung"},null,null,null,"Ermächtigte Stelle durch DGUV"]
[null,null,{"$f":"IF(Data_LD!AA19<>\"\",Data_LD!AA19,\"\")","v":16},{"$f":"IF(C25<>\"\",VLOOKUP(C25,Data_LD!$A$4:$W$23,9,FALSE),\"\")","v":"RUND-Aufbaukurs – Erweiterung/Vertiefung von Kenntnissen und Fertigkeiten des RUND-Grundkurses"},{"$f":"IF(C25<>\"\",VLOOKUP(C25,Data_LD!$A$4:$W$23,4,FALSE),\"\")","v":"DLRG"},{"$f":"IF(C25<>\"\",VLOOKUP(C25,Data_LD!$A$4:$W$23,6,FALSE),\"\")","v":"Ausbildung"},null,null,null,"QSEH-Kennziffer der ermächtigten Stelle : "]
[null,null,{"$f":"IF(Data_LD!AA20<>\"\",Data_LD!AA20,\"\")","v":""},{"$f":"IF(C26<>\"\",VLOOKUP(C26,Data_LD!$A$4:$W$23,9,FALSE),\"\")","v":""},{"$f":"IF(C26<>\"\",VLOOKUP(C26,Data_LD!$A$4:$W$23,4,FALSE),\"\")","v":""},{"$f":"IF(C26<>\"\",VLOOKUP(C26,Data_LD!$A$4:$W$23,6,FALSE),\"\")","v":""}]
[null,null,{"$f":"IF(Data_LD!AA21<>\"\",Data_LD!AA21,\"\")","v":18},{"$f":"IF(C27<>\"\",VLOOKUP(C27,Data_LD!$A$4:$W$23,9,FALSE),\"\")","v":"Sanitätsfortbildung – Auffrischung und Vertiefung der Kenntnisse aus dem Sanitätsdienst"},{"$f":"IF(C27<>\"\",VLOOKUP(C27,Data_LD!$A$4:$W$23,4,FALSE),\"\")","v":"DLRG"},{"$f":"IF(C27<>\"\",VLOOKUP(C27,Data_LD!$A$4:$W$23,6,FALSE),\"\")","v":"Fortbildung"},null,null,null,"Anerkannte Stelle gem. § 68 FEV – Erste Hilfe-Schulung"]
[null,null,{"$f":"IF(Data_LD!AA22<>\"\",Data_LD!AA22,\"\")","v":""},{"$f":"IF(C28<>\"\",VLOOKUP(C28,Data_LD!$A$4:$W$23,9,FALSE),\"\")","v":""},{"$f":"IF(C28<>\"\",VLOOKUP(C28,Data_LD!$A$4:$W$23,4,FALSE),\"\")","v":""},{"$f":"IF(C28<>\"\",VLOOKUP(C28,Data_LD!$A$4:$W$23,6,FALSE),\"\")","v":""}]
[null,null,{"$f":"IF(Data_LD!AA23<>\"\",Data_LD!AA23,\"\")","v":""},{"$f":"IF(C29<>\"\",VLOOKUP(C29,Data_LD!$A$4:$W$23,9,FALSE),\"\")","v":""},{"$f":"IF(C29<>\"\",VLOOKUP(C29,Data_LD!$A$4:$W$23,4,FALSE),\"\")","v":""},{"$f":"IF(C29<>\"\",VLOOKUP(C29,Data_LD!$A$4:$W$23,6,FALSE),\"\")","v":""},null,null,null,"Durch die Behörde",null,"Aktenzeichen",null,"Anerk.-Datum"]
[]
[]
[]
[null,"Lehrgangsdokumentation:"]
[]
[null,null,"  Dokumentationsblatt (Doku) – gehört zur Lehrgangsdokumentation gemäß DGUV Grundsatz 304-001 | FeV | DLRG"]
[]
[null,null,"  Teilnehmerdatenblatt (Tdb) – gehört zur Lehrgangsdokumentation gemäß DGUV Grundsatz 304-001 | FeV | DLRG"]
[]
[null,null,"  Teilnehmerliste (TNL) – zur Erfassung der Lehrgangsteilnehmer | gehört NICHT zur Lehrgangsdokumentation gemäß DGUV Grundsatz 304-001 oder FeV"]
[]
[null,null,"  Unterschriftenliste (UTN) – nur für DLRG-interne Zwecke  | gehört NICHT zur Lehrgangsdokumentation gemäß DGUV Grundsatz 304-001 oder FeV"]
[]
[null,null,"  Anmeldeformular (TBG) – zur Abrechnung von Lehrgangskosten | ein Dublikat zur Lehrgangsdokumentation beifügen (Empfehlung)"]

{"sheet":"Doku","index":1,"n_rows":63,"n_cols":114,"rows_kept":63,"cut":false,"hidden":true,"merged":[[60,2,60,41],[60,42,60,54],[60,55,60,67],[60,68,60,107],[61,2,61,107],[62,2,62,4],[62,5,62,37],[62,38,62,71],[62,72,62,104],[62,105,62,107],[44,56,44,107],[42,2,42,52],[43,2,43,52],[44,2,44,52],[49,2,51,107],[58,42,58,54],[58,55,58,67],[59,2,59,41],[59,42,59,54],[59,55,59,67],[59,68,59,107],[48,2,48,107],[52,2,52,107],[53,2,53,107],[56,2,58,41],[56,42,56,54],[56,55,56,67],[56,68,58,107],[57,42,57,54],[57,55,57,67],[54,2,55,107],[34,2,34,107],[35,2,35,107],[36,2,36,107],[41,53,41,55],[41,2,41,52],[41,56,41,107],[37,102,37,107],[37,2,37,29],[47,2,47,4],[47,5,47,104],[38,2,38,107],[39,2,39,107],[40,2,40,107],[45,53,45,55],[46,53,46,55],[46,56,46,107],[45,56,45,107],[45,2,45,52],[46,2,46,52],[42,53,42,55],[43,53,43,55],[44,53,44,55],[42,56,42,107],[43,56,43,107],[32,2,32,107],[33,2,33,23],[33,24,33,35],[33,36,33,39],[33,40,33,47],[33,48,33,51],[33,52,33,57],[33,58,33,79],[33,80,33,91],[33,92,33,95],[33,96,33,103],[33,104,33,107],[30,2,30,107],[31,2,31,23],[31,24,31,51],[31,52,31,57],[31,58,31,79],[31,80,31,107],[28,2,28,107],[29,2,29,23],[29,24,29,51],[29,52,29,57],[29,58,29,79],[29,80,29,107],[25,102,25,107],[26,2,26,107],[27,2,27,23],[27,24,27,51],[27,52,27,57],[27,58,27,79],[27,80,27,107],[22,2,22,107],[23,2,23,23],[23,24,23,107],[24,2,24,107],[25,2,25,23],[25,24,25,45],[25,46,25,51],[25,52,25,57],[25,58,25,79],[25,80,25,101],[16,2,16,107],[17,2,17,21],[17,22,17,51],[17,52,17,57],[17,58,17,68],[17,69,17,75],[17,77,17,107],[12,2,12,4],[12,5,12,104],[12,105,12,107],[13,2,13,107],[14,2,14,107],[15,2,15,21],[15,22,15,107],[18,2,18,107],[19,2,19,107],[20,2,20,4],[20,5,20,104],[20,105,20,107],[21,2,21,23],[21,24,21,76],[21,77,21,79],[21,80,21,95],[21,96,21,107],[9,77,9,107],[0,113,0,119],[6,2,6,107],[7,2,7,21],[4,2,4,4],[4,5,4,104],[4,105,4,107],[5,2,5,76],[5,77,5,79],[5,80,5,97],[5,98,5,107],[7,22,7,75],[7,77,7,107],[11,58,11,76],[11,77,11,107],[37,30,37,34],[37,69,37,101],[37,43,37,54],[37,55,37,60],[37,35,37,42],[37,61,37,68],[2,2,2,4],[2,5,2,104],[2,105,2,107],[3,2,3,4],[3,5,3,104],[3,105,3,107],[10,2,10,107],[11,2,11,23],[11,24,11,51],[11,52,11,57],[8,2,8,107],[9,2,9,21],[9,22,9,51],[9,52,9,57],[9,58,9,68],[9,69,9,75]]}
[{"$f":"Start!I9","v":0},null,null,null,null,null,null,null,null,null,null,null,null,null,null,null,null,null,null,null,null,null,null,null,null,null,null,null,null,null,null,null,null,null,null,null,null,null,null,null,null,null,null,null,null,null,null,null,null,null,null,null,null,null,null,null,null,null,null,null,null,null,null,null,null,null,null,null,null,null,null,null,null,null,null,null,null,null,null,null,null,null,null,null,null,null,null,null,null,null,null,null,null,null,null,null,null,null,null,null,null,null,null,null,null,null,null,null,null,null,null,null,null,{"$f":"SUM(Data_LD!B24)","v":0}]
[]
[null,null,null,null,null,"Lehrgangsdokumentation"]
[null,null,null,null,null,{"$f":"IF(DJ1<>0,VLOOKUP(DJ1,Data_LD!A4:Y23,5,FALSE),\"\")","v":""}]
[]
[null,null,{"$f":"IF(DJ1<>0,VLOOKUP(DJ1,Data_LD!A4:Y23,16,FALSE),\"\")","v":""}]
[]
[null,null,"Bezeichnung:",null,null,null,null,null,null,null,null,null,null,null,null,null,null,null,null,null,null,null,{"$f":"IF(Start!K14<>\"\",Start!K14,\"\")","v":""},null,null,null,null,null,null,null,null,null,null,null,null,null,null,null,null,null,null,null,null,null,null,null,null,null,null,null,null,null,null,null,null,null,null,null,null,null,null,null,null,null,null,null,null,null,null,null,null,null,null,null,null,null,null,"Leitung Medizin"]
[]
[null,null,"Straße & Hausnr.:",null,null,null,null,null,null,null,null,null,null,null,null,null,null,null,null,null,null,null,{"$f":"IF(Start!K16<>\"\",Start!K16,\"\")","v":""},null,null,null,null,null,null,null,null,null,null,null,null,null,null,null,null,null,null,null,null,null,null,null,null,null,null,null,null,null,null,null,null,null,null,null,"PLZ & Ort:",null,null,null,null,null,null,null,null,null,null,{"$f":"IF(Start!K18<>\"\",Start!K18,\"\")","v":""},null,null,null,null,null,null,null,{"$f":"IF(Start!K20<>\"\",Start!K20,\"\")","v":""}]
[]
[null,null,"Verantwortlicher Arzt:",null,null,null,null,null,null,null,null,null,null,null,null,null,null,null,null,null,null,null,null,null,{"$f":"IF(Start!K22<>\"\",Start!K22,\"\")","v":""},null,null,null,null,null,null,null,null,null,null,null,null,null,null,null,null,null,null,null,null,null,null,null,null,null,null,null,null,null,null,null,null,null,{"$f":"IF(DJ1<>0,VLOOKUP(DJ1,Data_LD!A4:Y23,13,FALSE),\"\")","v":""},null,null,null,null,null,null,null,null,null,null,null,null,null,null,null,null,null,null,{"$f":"IF(DJ1<>0,VLOOKUP(DJ1,Data_LD!A4:Y23,14,FALSE),\"\")","v":""}]
[]
[null,null,"Angaben zum Lehrgangsort"]
[]
[null,null,"Bezeichnung:"]
[]
[null,null,"Straße & Hausnr.:",null,null,null,null,null,null,null,null,null,null,null,null,null,null,null,null,null,null,null,null,null,null,null,null,null,null,null,null,null,null,null,null,null,null,null,null,null,null,null,null,null,null,null,null,null,null,null,null,null,null,null,null,null,null,null,"PLZ & Ort:"]
[]
[null,null,"Angaben zum Lehrgang"]
[]
[null,null,"Lehrgangstitel:",null,null,null,null,null,null,null,null,null,null,null,null,null,null,null,null,null,null,null,null,null,{"$f":"IF($DJ$1<>\"\",VLOOKUP($DJ$1,Data_LD!$A$3:$W$23,7,FALSE),\"\")","v":{"$error":"#N/A"}},null,null,null,null,null,null,null,null,null,null,null,null,null,null,null,null,null,null,null,null,null,null,null,null,null,null,null,null,null,null,null,null,null,null,null,null,null,null,null,null,null,null,null,null,null,null,null,null,null,null,null,null,null,null,null,"Lehrgangsform:",null,null,null,null,null,null,null,null,null,null,null,null,null,null,null,{"$f":"IF($DJ$1<>\"\",VLOOKUP($DJ$1,Data_LD!$A$3:$W$23,6,FALSE),\"\")","v":{"$error":"#N/A"}}]
[]
[null,null,"Lehrgangsthema:",null,null,null,null,null,null,null,null,null,null,null,null,null,null,null,null,null,null,null,null,null,{"$f":"IF($DJ$1<>\"\",VLOOKUP($DJ$1,Data_LD!$A$3:$W$23,8,FALSE),\"\")","v":{"$error":"#N/A"}}]
[]
[null,null,{"$f":"IF(DJ1<>0,VLOOKUP(DJ1,Data_LD!$A$4:$W$23,17,FALSE),\"\")","v":""}]
[]
[null,null,{"$f":"IF(DJ1<>0,VLOOKUP(DJ1,Data_LD!$A$4:$W$23,15,FALSE),\"\")","v":""},null,null,null,null,null,null,null,null,null,null,null,null,null,null,null,null,null,null,null,null,null,null,null,null,null,null,null,null,null,null,null,null,null,null,null,null,null,null,null,null,null,null,null,null,null,null,null,null,null,null,null,null,null,null,null,"Ausbilder Reg.-Nr.:"]
[]
[null,null,"Ausbildungshelfer:",null,null,null,null,null,null,null,null,null,null,null,null,null,null,null,null,null,null,null,null,null,null,null,null,null,null,null,null,null,null,null,null,null,null,null,null,null,null,null,null,null,null,null,null,null,null,null,null,null,null,null,null,null,null,null,"Hospitant/Assistent:"]
[]
[null,null,"Hospitant/Assistent:",null,null,null,null,null,null,null,null,null,null,null,null,null,null,null,null,null,null,null,null,null,null,null,null,null,null,null,null,null,null,null,null,null,null,null,null,null,null,null,null,null,null,null,null,null,null,null,null,null,null,null,null,null,null,null,"Masken-Charge:"]
[]
[null,null,"Lehrgangsbeginn:",null,null,null,null,null,null,null,null,null,null,null,null,null,null,null,null,null,null,null,null,null,null,null,null,null,null,null,null,null,null,null,null,null,null,null,null,null,null,null,null,null,null,null,null,null,"Uhr",null,null,null,null,null,null,null,null,null,"Lehrgangsende:",null,null,null,null,null,null,null,null,null,null,null,null,null,null,null,null,null,null,null,null,null,null,null,null,null,null,null,null,null,null,null,null,null,null,null,null,null,null,null,null,null,null,null,null,null,"Uhr"]
[]
[null,null,"Anzahl der Teilnehmer (entspricht der Anzahl der Teilnehmerdatenblätter)"]
[]
[null,null,"Gesamtzahl der Teilnehmer:",null,null,null,null,null,null,null,null,null,null,null,null,null,null,null,null,null,null,null,null,null,null,null,null,null,null,null,{"$f":"IF(A1<>0,MAX(TNL!D37:G56),\"\")","v":""},null,null,null,null,null,null,null,null,null,null,null,null,{"$f":"IF(DJ1<>0,VLOOKUP(A1,Data_LD!A4:Y23,12,FALSE),\"\")","v":""},null,null,null,null,null,null,null,null,null,null,null,{"$f":"IF(A1<=3,TNL!FO56,\"\")","v":0},null,null,null,null,null,null,null,null,null,null,null,null,null,"davon erfolgreich abgeschlossen:",null,null,null,null,null,null,null,null,null,null,null,null,null,null,null,null,null,null,null,null,null,null,null,null,null,null,null,null,null,null,null,null,{"$f":"IF(TNL!FO28<>0,TNL!FO28,\"\")","v":""}]
[]
[null,null,{"$f":"IF(A1<>0,VLOOKUP(A1,Data_LD!$A$29:$T$48,7,FALSE),\"\")","v":""}]
[]
[null,null,{"$f":"IF(A1<>0,VLOOKUP(A1,Data_LD!A29:T48,8,FALSE),\"\")","v":""},null,null,null,null,null,null,null,null,null,null,null,null,null,null,null,null,null,null,null,null,null,null,null,null,null,null,null,null,null,null,null,null,null,null,null,null,null,null,null,null,null,null,null,null,null,null,null,null,null,null,null,null,null,{"$f":"IF(A1<>0,VLOOKUP(A1,Data_LD!A29:T48,14,FALSE),\"\")","v":""}]
[null,null,{"$f":"IF(A1<>0,VLOOKUP(A1,Data_LD!A29:T48,9,FALSE),\"\")","v":""},null,null,null,null,null,null,null,null,null,null,null,null,null,null,null,null,null,null,null,null,null,null,null,null,null,null,null,null,null,null,null,null,null,null,null,null,null,null,null,null,null,null,null,null,null,null,null,null,null,null,null,null,null,{"$f":"IF(A1<>0,VLOOKUP(A1,Data_LD!A29:T48,15,FALSE),\"\")","v":""}]
[null,null,{"$f":"IF(A1<>0,VLOOKUP(A1,Data_LD!A29:T48,10,FALSE),\"\")","v":""},null,null,null,null,null,null,null,null,null,null,null,null,null,null,null,null,null,null,null,null,null,null,null,null,null,null,null,null,null,null,null,null,null,null,null,null,null,null,null,null,null,null,null,null,null,null,null,null,null,null,null,null,null,{"$f":"IF(A1<>0,VLOOKUP(A1,Data_LD!A29:T48,16,FALSE),\"\")","v":""}]
[null,null,{"$f":"IF(A1<>0,VLOOKUP(A1,Data_LD!A29:T48,11,FALSE),\"\")","v":""},null,null,null,null,null,null,null,null,null,null,null,null,null,null,null,null,null,null,null,null,null,null,null,null,null,null,null,null,null,null,null,null,null,null,null,null,null,null,null,null,null,null,null,null,null,null,null,null,null,null,null,null,null,{"$f":"IF(A1<>0,VLOOKUP(A1,Data_LD!A29:T48,17,FALSE),\"\")","v":""}]
[null,null,{"$f":"IF(A1<>0,VLOOKUP(A1,Data_LD!A29:T48,12,FALSE),\"\")","v":""},null,null,null,null,null,null,null,null,null,null,null,null,null,null,null,null,null,null,null,null,null,null,null,null,null,null,null,null,null,null,null,null,null,null,null,null,null,null,null,null,null,null,null,null,null,null,null,null,null,null,null,null,null,{"$f":"IF(A1<>0,VLOOKUP(A1,Data_LD!A29:T48,18,FALSE),\"\")","v":""}]
[null,null,{"$f":"IF(A1<>0,VLOOKUP(A1,Data_LD!A29:T48,13,FALSE),\"\")","v":""},null,null,null,null,null,null,null,null,null,null,null,null,null,null,null,null,null,null,null,null,null,null,null,null,null,null,null,null,null,null,null,null,null,null,null,null,null,null,null,null,null,null,null,null,null,null,null,null,null,null,null,null,null,{"$f":"IF(A1<>0,VLOOKUP(A1,Data_LD!A29:T48,19,FALSE),\"\")","v":""}]
[]
[null,null,"Anlagen"]
[null,null,"Hinweise zum Datenschutz befinden sich auf den Teilnehmerdatenblätter. Diese Dokumentation ist zusammen mit den ausgefüllten Teilnehmerdatenblätter und dem zeitlichen Ablaufplan fünf Jahre aufzubewahren und auf Anforderung vorzulegen."]
[]
[]
[]
[null,null,"Für die Richtigkeit der Angaben:"]
[]
[]
[]
[]
[]
[null,null,{"$f":"IF(Y34<>\"\",CONCATENATE(BZ18,\", \",TEXT(CC34,\"TT.MM.JJJJ\"),\"\"))","v":false},null,null,null,null,null,null,null,null,null,null,null,null,null,null,null,null,null,null,null,null,null,null,null,null,null,null,null,null,null,null,null,null,null,null,null,null,null,null,null,null,null,null,null,null,null,null,null,null,null,null,null,null,null,null,null,null,null,null,null,null,null,null,null,null,null,{"$f":"IF(Y34<>\"\",CONCATENATE(BZ10,\", \",TEXT(CC34+2,\"TT.MM.JJJJ\"),\"\"))","v":false}]
[null,null,"Ort, Datum – Unterschrift Lehrgangsleitung",null,null,null,null,null,null,null,null,null,null,null,null,null,null,null,null,null,null,null,null,null,null,null,null,null,null,null,null,null,null,null,null,null,null,null,null,null,null,null,null,null,null,null,null,null,null,null,null,null,null,null,null,null,null,null,null,null,null,null,null,null,null,null,null,null,"Ort, Datum – Stempel | Unterschrift Ausbildungsstelle"]
[]
[null,null,null,null,null,"dlrg.de"]

{"sheet":"Tdb","index":2,"n_rows":58,"n_cols":118,"rows_kept":58,"cut":false,"hidden":true,"merged":[[53,2,53,4],[51,36,51,38],[24,2,24,109],[25,2,25,24],[57,2,57,4],[57,107,57,109],[57,73,57,106],[57,5,57,38],[57,39,57,72],[51,78,51,95],[51,75,51,77],[51,58,51,74],[51,39,51,57],[56,2,56,109],[54,2,54,109],[53,6,53,109],[55,2,55,4],[55,6,55,109],[18,2,18,29],[18,30,18,109],[17,2,17,109],[52,2,52,109],[45,2,45,109],[40,42,43,55],[44,2,44,41],[44,42,44,69],[40,56,43,69],[47,2,47,109],[48,2,48,109],[50,2,50,109],[51,2,51,21],[51,22,51,35],[3,112,4,112],[43,2,43,41],[43,70,43,109],[29,2,30,109],[31,2,31,109],[32,2,35,108],[27,2,27,24],[25,25,25,109],[26,2,26,109],[27,25,27,109],[28,2,28,109],[40,2,42,41],[40,70,42,109],[12,31,12,34],[12,35,12,43],[12,44,12,109],[13,2,13,109],[12,18,12,30],[12,2,12,17],[11,2,11,109],[2,2,2,109],[3,2,3,109],[4,2,4,109],[5,2,6,109],[7,2,7,109],[8,2,8,109],[9,2,9,109],[10,2,10,14],[10,54,10,57],[10,15,10,53],[10,58,10,68],[10,69,10,109],[51,96,51,109],[44,70,44,109],[37,2,39,109],[46,2,46,109],[49,2,49,12],[49,13,49,109],[14,2,14,109],[15,2,15,109],[36,2,36,38],[36,39,36,109],[21,2,21,109],[20,2,20,29],[20,30,20,109],[22,2,22,109],[23,2,23,109],[19,2,19,109],[16,2,16,29],[16,30,16,109]]}
[{"$f":"IF(Data_PD!A4<>\"\",Data_PD!A4,0)","v":0},null,null,null,null,null,null,null,null,null,null,null,null,null,null,null,null,null,null,null,null,null,null,null,null,null,null,null,null,null,null,null,null,null,null,null,null,null,null,null,null,null,null,null,null,null,null,null,null,null,null,null,null,null,null,null,null,null,null,null,null,null,null,null,null,null,null,null,null,null,null,null,null,null,null,null,null,null,null,null,null,null,null,null,null,null,null,null,null,null,null,null,null,null,null,null,null,null,null,null,null,null,null,null,null,null,null,null,null,null,null,null,{"$f":"SUM(Start!I9)","v":0}]
[{"$f":"IF(Data_PD!A5<>\"\",Data_PD!A5,0)","v":0}]
[{"$f":"IF(Data_PD!A6<>\"\",Data_PD!A6,0)","v":0},null,{"$f":"IF($DI$1<>0,VLOOKUP(DI1,Data_LD!A55:T74,5,FALSE),\"\")","v":""}]
[{"$f":"IF(Data_PD!A7<>\"\",Data_PD!A7,0)","v":0},null,{"$f":"IF($DI$1<>0,VLOOKUP(DI1,Data_LD!$A$55:$T$74,6,FALSE),\"\")","v":""}]
[{"$f":"IF(Data_PD!A8<>\"\",Data_PD!A8,0)","v":0}]
[{"$f":"IF(Data_PD!A9<>\"\",Data_PD!A9,0)","v":0},null,"Der Datenschutz ist uns wichtig! Deshalb erhält jeder Teilnehmer ein separates Datenblatt, auf dem die persönlichen Daten eingetragen werden (*Pflichtangaben)."]
[{"$f":"IF(Data_PD!A10<>\"\",Data_PD!A10,0)","v":0}]
[{"$f":"IF(Data_PD!A11<>\"\",Data_PD!A11,0)","v":0}]
[{"$f":"IF(Data_PD!A12<>\"\",Data_PD!A12,0)","v":0},null,"Angaben zum Teilnehmer"]
[{"$f":"IF(Data_PD!A13<>\"\",Data_PD!A13,0)","v":0}]
[{"$f":"IF(Data_PD!A14<>\"\",Data_PD!A14,0)","v":0},null,"Nachname*:",null,null,null,null,null,null,null,null,null,null,null,null,{"$f":"IF(DI4<>\"\",IF($DI$1<>0,VLOOKUP($DI$4,Data_PD!$A$4:$U$23,2,FALSE),\"\"),\"\")","v":""},null,null,null,null,null,null,null,null,null,null,null,null,null,null,null,null,null,null,null,null,null,null,null,null,null,null,null,null,null,null,null,null,null,null,null,null,null,null,null,null,null,null,"Vorname*:",null,null,null,null,null,null,null,null,null,null,{"$f":"IF(DI4<>\"\",IF($DI$1<>0,VLOOKUP($DI$4,Data_PD!$A$4:$U$23,3,FALSE),\"\"),\"\")","v":""}]
[{"$f":"IF(Data_PD!A15<>\"\",Data_PD!A15,0)","v":0}]
[{"$f":"IF(Data_PD!A16<>\"\",Data_PD!A16,0)","v":0},null,"Geburtsdatum*:",null,null,null,null,null,null,null,null,null,null,null,null,null,null,null,{"$f":"IF(DI4<>\"\",IF($DI$1<>0,VLOOKUP($DI$4,Data_PD!$A$4:$U$23,5,FALSE),\"\"),\"\")","v":""},null,null,null,null,null,null,null,null,null,null,null,null,null,null,null,null,{"$f":"IF(DI1>=4,VLOOKUP(DI1,Data_LD!$A$55:$T$74,16,FALSE),\"\")","v":""},null,null,null,null,null,null,null,null,{"$f":"IF(DI1>=4,VLOOKUP($DI$4,Data_PD!$A$4:$U$23,12,FALSE),\"\")","v":""}]
[{"$f":"IF(Data_PD!A17<>\"\",Data_PD!A17,0)","v":0}]
[{"$f":"IF(Data_PD!A18<>\"\",Data_PD!A18,0)","v":0},null,{"$f":"IF($DI$1<>0,VLOOKUP(DI1,Data_LD!$A$55:$P$74,8,FALSE),\"\")","v":""}]
[{"$f":"IF(Data_PD!A19<>\"\",Data_PD!A19,0)","v":0},null,null,null,null,null,null,null,null,null,null,null,null,null,null,null,null,null,null,null,null,null,null,null,null,null,null,null,null,null,null,null,null,null,null,null,null,null,null,null,null,null,null,null,null,null,null,null,null,null,null,null,null,null,null,null,null,null,null,null,null,null,null,null,null,null,null,null,null,null,null,null,null,null,null,null,null,null,null,null,null,null,null,null,null,null,null,null,null,null,null,null,null,null,null,null,null,null,null,null,null,null,null,null,null,null,null,null,null,null,null,null,null,null,null,null,null,""]
[{"$f":"IF(Data_PD!A20<>\"\",Data_PD!A20,0)","v":0},null,{"$f":"IF($DI$1<>0,VLOOKUP(DI1,Data_LD!$A$55:$P$74,9,FALSE))","v":false},null,null,null,null,null,null,null,null,null,null,null,null,null,null,null,null,null,null,null,null,null,null,null,null,null,null,null,{"$f":"IF(DI4<>\"\",IF($DI$1<>0,IF(VLOOKUP($DI$4,Data_PD!$A$4:$U$23,19,FALSE)=0,\"\",VLOOKUP($DI$4,Data_PD!$A$4:$U$23,19,FALSE)),\"\"),\"\")","v":""}]
[{"$f":"IF(Data_PD!A21<>\"\",Data_PD!A21,0)","v":0}]
[{"$f":"IF(Data_PD!A22<>\"\",Data_PD!A22,0)","v":0},null,{"$f":"IF($DI$1<>0,VLOOKUP($DI$1,Data_LD!$A$55:$P$74,10,FALSE))","v":false},null,null,null,null,null,null,null,null,null,null,null,null,null,null,null,null,null,null,null,null,null,null,null,null,null,null,null,{"$f":"IF(DI4<>\"\",IF($DI$1<>0,IF(VLOOKUP($DI$4,Data_PD!$A$4:$U$23,20,FALSE)=0,\"\",VLOOKUP($DI$4,Data_PD!$A$4:$U$23,20,FALSE)),\"\"),\"\")","v":""}]
[{"$f":"IF(Data_PD!A23<>\"\",Data_PD!A23,0)","v":0}]
[null,null,{"$f":"IF($DI$1<>0,VLOOKUP($DI$1,Data_LD!$A$55:$P$74,11,FALSE))","v":false},null,null,null,null,null,null,null,null,null,null,null,null,null,null,null,null,null,null,null,null,null,null,null,null,null,null,null,{"$f":"IF(DI4<>\"\",IF($DI$1<>0,IF(VLOOKUP($DI$4,Data_PD!$A$4:$U$23,21,FALSE)=0,\"\",VLOOKUP($DI$4,Data_PD!$A$4:$U$23,21,FALSE)),\"\"),\"\")","v":""}]
[null,null,{"$f":"IF($DI$1<>0,VLOOKUP($DI$1,Data_LD!$A$55:$P$74,12,FALSE),\"\")","v":""}]
[]
[null,null,"Adresse des Teilnehmers (Angaben nur nötig bei Privatrechnung):"]
[]
[null,null,"Straße, Hausnummer:",null,null,null,null,null,null,null,null,null,null,null,null,null,null,null,null,null,null,null,null,null,null,{"$f":"IF(DI4<>\"\",IF(AE17<>\"\",\"\",VLOOKUP($DI$4,Data_PD!$A$4:$U$23,10,FALSE)),\"\")","v":""}]
[]
[null,null,"PLZ und Wohnort:",null,null,null,null,null,null,null,null,null,null,null,null,null,null,null,null,null,null,null,null,null,null,{"$f":"IF(DI4<>\"\",IF(AE19<>\"\",\"\",VLOOKUP($DI$4,Data_PD!$A$4:$U$23,11,FALSE)),\"\")","v":""}]
[]
[null,null,"Datenschutzerklärung gemäß Datenschutzgrundverordnung (EU-DSGVO)\n§ 24 Abs. 1 Nr. 2 BDSG-neu bzw. Artikel 6 EU-DSGVO EU-2016/679"]
[]
[]
[null,null,"Die durch die DLRG erhobenen Daten werden für die Lehrgangsdokumentation erfasst und dienen zur Erstellung der Teilnahmebescheinigung. Die Daten werden ggf. digital verarbeitet und fünf Jahre gespeichert. Mit der Teilnahme am Lehrgang und der Unterschrift des Teilnehmers auf diesem Teilnehmerdatenblatt wird die Datenschutzerklärung akzeptiert. "]
[]
[]
[]
[null,null,"Weitere Informationen zum Datenschutz:",null,null,null,null,null,null,null,null,null,null,null,null,null,null,null,null,null,null,null,null,null,null,null,null,null,null,null,null,null,null,null,null,null,null,null,null,"https://www.dlrg.de/impressumpostadresse/datenschutzerklaerung.html"]
[null,null,"Alternativ kann die Datenschutzerklärung bei der Lehrgangsleitung angefordert werden. \nMit der Unterschrift des Teilnehmers auf diesem Teilnehmerdatenblatt erklärt, der Teilnehmer die Datenschutzerklärung zur Kenntnis genommen und am Lehrgang teilgenommen zu haben."]
[]
[]
[]
[]
[]
[null,null,{"$f":"IF(TNL!AY5<>0,CONCATENATE(TNL!AY5,\", \",TEXT(TNL!T5,\"TT.MM.JJJJ\"),\"\"))","v":", "}]
[null,null,"Ort, Datum",null,null,null,null,null,null,null,null,null,null,null,null,null,null,null,null,null,null,null,null,null,null,null,null,null,null,null,null,null,null,null,null,null,null,null,null,null,null,null,null,null,null,null,null,null,null,null,null,null,null,null,null,null,null,null,null,null,null,null,null,null,null,null,null,null,null,null,"Unterschrift des Teilnehmers"]
[]
[]
[null,null,"Von der Ausbildungsstelle auszufüllen!"]
[]
[null,null,"Lehrgang:",null,null,null,null,null,null,null,null,null,null,{"$f":"IF(TNL!C3<>\"\",TNL!C3,\"\")","v":""}]
[]
[null,null,"Lehrgangsnummer:",null,null,null,null,null,null,null,null,null,null,null,null,null,null,null,null,null,null,null,{"$f":"IF(DI1<>0,VLOOKUP(DI1,Data_LD!$A$55:$T$74,17,FALSE),\"\")","v":""},null,null,null,null,null,null,null,null,null,null,null,null,null,null,null,null,{"$f":"IF(DI1<>0,VLOOKUP(DI1,Data_LD!$A$55:$T$74,14,FALSE),\"\")","v":""},null,null,null,null,null,null,null,null,null,null,null,null,null,null,null,null,null,null,{"$f":"IF(DI1<>0,VLOOKUP(DI1,Data_LD!$A$55:$T$74,15,FALSE),\"\")","v":""},null,null,null,null,null,null,null,null,null,null,null,null,null,null,null,null,null,null,null,"Lehrgangsbeginn:",null,null,null,null,null,null,null,null,null,null,null,null,null,null,null,null,null,{"$f":"IF(TNL!T5<>\"\",TEXT(Doku!Y34,\"TT.MM.JJJJ\"),\"\")","v":""}]
[]
[null,null,null,null,null,null,"Der zuvor genannte Teilnehmer hat den Lehrgang erfolgreich abgeschlossen."]
[]
[null,null,null,null,null,null,"Der zuvor genannte Teilnehmer hat den Lehrgang nicht erfolgreich abgeschlossen."]
[]
[null,null,null,null,null,"dlrg.de"]

{"sheet":"DSGVO","index":3,"n_rows":63,"n_cols":118,"rows_kept":63,"cut":false,"hidden":true,"merged":[[3,112,4,112],[4,2,4,109],[5,2,5,109],[6,2,6,3],[22,2,22,3],[23,2,23,3],[24,2,24,3],[15,2,15,3],[16,2,16,3],[17,2,17,3],[11,2,11,109],[10,2,10,109],[6,4,7,109],[19,2,19,3],[20,2,20,3],[21,2,21,3],[20,4,20,6],[12,2,12,109],[13,2,13,3],[14,2,14,3],[13,4,13,6],[14,4,14,6],[13,7,14,109],[15,7,16,109],[2,2,2,109],[3,2,3,109],[7,2,7,3],[8,2,8,3],[9,2,9,3],[8,4,8,109],[9,4,9,109],[61,2,61,109],[62,2,62,4],[62,5,62,38],[62,39,62,72],[62,73,62,106],[62,107,62,109],[56,2,56,3],[57,2,57,3],[52,2,52,3],[52,4,52,6],[52,7,53,109],[53,2,53,3],[46,2,46,109],[42,2,42,3],[31,2,31,109],[28,2,28,3],[29,2,29,3],[18,7,19,109],[20,7,21,109],[15,4,15,6],[16,4,16,6],[17,4,17,6],[18,4,18,6],[19,4,19,6],[17,7,17,109],[18,2,18,3],[32,2,32,3],[33,2,33,3],[34,2,34,3],[27,4,30,109],[32,4,33,109],[25,2,25,109],[27,2,27,3],[21,4,21,6],[22,4,22,6],[23,4,23,6],[24,4,24,6],[30,2,30,3],[26,2,26,109],[22,7,24,109],[35,2,35,3],[36,2,36,3],[37,2,37,3],[34,4,36,109],[37,4,43,109],[44,4,45,109],[38,2,38,3],[39,2,39,3],[40,2,40,3],[41,2,41,3],[54,2,54,3],[53,4,53,6],[54,4,54,6],[54,7,55,109],[55,2,55,3],[55,4,55,6],[43,2,43,3],[44,2,44,3],[45,2,45,3],[47,2,47,3],[47,4,51,109],[48,2,48,3],[49,2,49,3],[50,2,50,3],[51,2,51,3],[59,2,59,3],[59,4,59,6],[60,2,60,3],[60,4,60,6],[59,7,59,109],[60,7,60,109],[56,4,56,6],[57,4,57,6],[56,7,58,109],[58,2,58,3],[58,4,58,6]]}
[{"$f":"IF(Data_PD!A4<>\"\",Data_PD!A4,0)","v":0}]
[{"$f":"IF(Data_PD!A5<>\"\",Data_PD!A5,0)","v":0}]
[{"$f":"IF(Data_PD!A6<>\"\",Data_PD!A6,0)","v":0},null,"Datenschutzerklärung gemäß Datenschutzgrundverordnung (EU-DSGVO)"]
[{"$f":"IF(Data_PD!A7<>\"\",Data_PD!A7,0)","v":0},null,"§ 24 Abs. 1 Nr. 2 BDSG-neu bzw. Artikel 6 EU-DSGVO EU-2016/679"]
[{"$f":"IF(Data_PD!A8<>\"\",Data_PD!A8,0)","v":0}]
[{"$f":"IF(Data_PD!A9<>\"\",Data_PD!A9,0)","v":0},null,"§ 24 BDSG- neu Abs. 1 Nr. 2 – Verarbeitung zu anderen Zwecken durch nicht öffentliche Stellen"]
[{"$f":"IF(Data_PD!A10<>\"\",Data_PD!A10,0)","v":0},null,"1.",null,"Die Verarbeitung personenbezogener Daten zu einem anderen Zweck als zu demjenigen, zu dem die Daten erhoben wurden, durch nicht öffentliche Stellen ist zulässig, wenn"]
[{"$f":"IF(Data_PD!A11<>\"\",Data_PD!A11,0)","v":0}]
[{"$f":"IF(Data_PD!A12<>\"\",Data_PD!A12,0)","v":0},null,null,null,"(2) sie zur Geltendmachung, Ausübung oder Verteidigung zivilrechtlicher Ansprüche erforderlich ist,"]
[{"$f":"IF(Data_PD!A13<>\"\",Data_PD!A13,0)","v":0},null,null,null,"sofern nicht die Interessen der betroff enen Person an dem Ausschluss der Verarbeitung überwiegen."]
[{"$f":"IF(Data_PD!A14<>\"\",Data_PD!A14,0)","v":0}]
[{"$f":"IF(Data_PD!A15<>\"\",Data_PD!A15,0)","v":0},null,"Art. 6 DSGVO – Rechtmäßigkeit der Verarbeitung"]
[{"$f":"IF(Data_PD!A16<>\"\",Data_PD!A16,0)","v":0},null,"1. Die Verarbeitung ist nur rechtmäßig, wenn mindestens eine der nachstehenden Bedingungen erfüllt ist:"]
[{"$f":"IF(Data_PD!A17<>\"\",Data_PD!A17,0)","v":0},null,null,null,"a)",null,null,"Die betroffene Person hat ihre Einwilligung zu der Verarbeitung der sie betreffenden personenbezogenen Daten für einen oder mehrere bestimmte Zwecke gegeben;"]
[{"$f":"IF(Data_PD!A18<>\"\",Data_PD!A18,0)","v":0}]
[{"$f":"IF(Data_PD!A19<>\"\",Data_PD!A19,0)","v":0},null,null,null,"b)",null,null,"die Verarbeitung ist für die Erfüllung eines Vertrags, dessen Vertragspartei die betroffene Person ist, oder zur Durchführung vorvertraglicher Maßnahmen erforderlich, die auf Anfrage der betroffenen Person erfolgen;",null,null,null,null,null,null,null,null,null,null,null,null,null,null,null,null,null,null,null,null,null,null,null,null,null,null,null,null,null,null,null,null,null,null,null,null,null,null,null,null,null,null,null,null,null,null,null,null,null,null,null,null,null,null,null,null,null,null,null,null,null,null,null,null,null,null,null,null,null,null,null,null,null,null,null,null,null,null,null,null,null,null,null,null,null,null,null,null,null,null,null,null,null,null,null,null,null,null,null,null,null,null,null,null,null,null,null,null,null,""]
[{"$f":"IF(Data_PD!A20<>\"\",Data_PD!A20,0)","v":0}]
[{"$f":"IF(Data_PD!A21<>\"\",Data_PD!A21,0)","v":0},null,null,null,"c)",null,null,"die Verarbeitung ist zur Erfüllung einer rechtlichen Verpflichtung erforderlich, der der Verantwortliche unterliegt;"]
[{"$f":"IF(Data_PD!A22<>\"\",Data_PD!A22,0)","v":0},null,null,null,"d)",null,null,"die Verarbeitung ist erforderlich, um lebenswichtige Interessen der betroffenen Person oder einer anderen natürlichen Person zu schützen;"]
[{"$f":"IF(Data_PD!A23<>\"\",Data_PD!A23,0)","v":0}]
[null,null,null,null,"e)",null,null,"die Verarbeitung ist für die Wahrnehmung einer Aufgabe erforderlich, die im öffentlichen Interesse liegt oder in Ausübung öffentlicher Gewalt erfolgt, die dem Verantwortlichen übertragen wurde;"]
[]
[null,null,null,null,"f)",null,null,"die Verarbeitung ist zur Wahrung der berechtigten Interessen des Verantwortlichen oder eines Dritten erforderlich, sofern nicht die Interessen oder Grundrechte und Grundfreiheiten der betroff enen Person, die den Schutz personenbezogener Daten erfordern, überwiegen, insbesondere dann, wenn es sich bei der betroffenen Person um ein Kind handelt."]
[]
[]
[null,null,"Unterabsatz 1 Buchstabe f gilt nicht für die von Behörden in Erfüllung ihrer Aufgaben vorgenommene Verarbeitung."]
[]
[null,null,"2.",null,"Die Mitgliedstaaten können spezifischere Bestimmungen zur Anpassung der Anwendung der Vorschriften dieser Verordnung in Bezug auf die Verarbeitung zur Erfüllung von Absatz 1 Buchstaben c und e beibehalten oder einführen, indem sie spezifische Anforderungen für die Verarbeitung sowie sonstige Maßnahmen präziser bestimmen, um eine rechtmäßig und nach Treu und Glauben erfolgende Verarbeitung zu gewährleisten, einschließlich für andere besondere Verarbeitungssituationen gemäß Kapitel IX."]
[]
[]
[]
[]
[null,null,"3.",null,"1 Die Rechtsgrundlage für die Verarbeitungen gemäß Absatz 1 Buchstaben c und e wird festgelegt durch Unionsrecht oder das Recht der Mitgliedstaaten, dem der Verantwortliche unterliegt."]
[]
[null,null,null,null,"2 Der Zweck der Verarbeitung muss in dieser Rechtsgrundlage festgelegt oder hinsichtlich der Verarbeitung gemäß Absatz 1 Buchstabe e für die Erfüllung einer Aufgabe erforderlich sein, die im öffentlichen Interesse liegt oder in Ausübung öffentlicher Gewalt erfolgt, die dem Verantwortlichen übertragen wurde."]
[]
[]
[null,null,null,null,"3 Diese Rechtsgrundlage kann spezifische Bestimmungen zur Anpassung der Anwendung der Vorschriften dieser Verordnung enthalten, unter anderem Bestimmungen darüber, welche allgemeinen Bedingungen für die Regelung der Rechtmäßigkeit der Verarbeitung durch den Verantwortlichen gelten, welche Arten von Daten verarbeitet werden, welche Personen betroffen sind, an welche Einrichtungen und für welche Zwecke die personenbezogenen Daten offengelegt werden dürfen, welcher Zweckbindung sie unterliegen, wie lange sie gespeichert werden dürfen und welche Verarbeitungsvorgänge und -verfahren angewandt werden dürfen, einschließlich Maßnahmen zur Gewährleistung einer rechtmäßig und nach Treu und Glauben erfolgenden Verarbeitung, wie solche für sonstige besondere Verarbeitungssituationen gemäß Kapitel IX."]
[]
[]
[]
[]
[]
[]
[null,null,null,null,"4 Das Unionsrecht oder das Recht der Mitgliedstaaten müssen ein im öffentlichen Interesse liegendes Ziel verfolgen und in einem angemessenen Verhältnis zu dem verfolgten legitimen Zweck stehen."]
[]
[]
[null,null,"4.",null,"Beruht die Verarbeitung zu einem anderen Zweck als zu demjenigen, zu dem die personenbezogenen Daten erhoben wurden, nicht auf der Einwilligung der betroffenen Person oder auf einer Rechtsvorschrift der Union oder der Mitgliedstaaten, die in einer demokratischen Gesellschaft eine notwendige und verhältnismäßige Maßnahme zum Schutz der in Artikel 23 Absatz 1 genannten Ziele darstellt, so berücksichtigt der Verantwortliche – um festzustellen, ob die Verarbeitung zu einem anderen Zweck mit demjenigen, zu dem die personenbezogenen Daten ursprünglich erhoben wurden, vereinbar ist – unter anderem"]
[]
[]
[]
[]
[null,null,null,null,"a)",null,null,"jede Verbindung zwischen den Zwecken, für die die personenbezogenen Daten erhoben wurden, und den Zwecken der beabsichtigten Weiterverarbeitung,"]
[]
[null,null,null,null,"b)",null,null,"den Zusammenhang, in dem die personenbezogenen Daten erhoben wurden, insbesondere hinsichtlich des Verhältnisses zwischen den betroffenen Personen und dem Verantwortlichen,"]
[]
[null,null,null,null,"c)",null,null,"die Art der personenbezogenen Daten, insbesondere ob besondere Kategorien personenbezogener Daten gemäß Artikel 9 verarbeitet werden oder ob personenbezogene Daten über strafrechtliche Verurteilungen und Straftaten gemäß Artikel 10 verarbeitet werden,"]
[]
[]
[null,null,null,null,"d)",null,null,"die möglichen Folgen der beabsichtigten Weiterverarbeitung für die betroff enen Personen,"]
[null,null,null,null,"e)",null,null,"das Vorhandensein geeigneter Garantien, wozu Verschlüsselung oder Pseudonymisierung gehören kann."]
[]
[null,null,null,null,null,"dlrg.de"]

{"sheet":"TNL","index":4,"n_rows":57,"n_cols":174,"rows_kept":57,"cut":false,"hidden":true,"merged":[[3,171,4,176],[39,73,39,98],[40,73,40,98],[41,73,41,98],[42,73,42,98],[43,73,43,98],[44,73,44,98],[45,73,45,98],[46,73,46,98],[36,73,36,98],[35,101,35,130],[36,101,36,130],[35,133,35,151],[36,133,36,151],[37,101,37,130],[37,133,37,151],[38,101,38,130],[38,133,38,151],[37,73,37,98],[38,73,38,98],[35,73,35,98],[5,141,5,154],[4,50,4,135],[5,136,5,140],[45,133,45,151],[46,101,46,130],[46,133,46,151],[47,101,47,130],[47,133,47,151],[48,101,48,130],[48,133,48,151],[39,101,39,130],[39,133,39,151],[40,101,40,130],[40,133,40,151],[41,101,41,130],[41,133,41,151],[42,101,42,130],[42,133,42,151],[43,101,43,130],[43,133,43,151],[44,101,44,130],[44,133,44,151],[45,101,45,130],[26,41,26,70],[26,72,26,85],[25,9,25,38],[28,2,28,163],[28,164,28,168],[23,41,23,70],[23,72,23,85],[23,3,23,6],[21,126,21,162],[22,126,22,162],[23,126,23,162],[24,126,24,162],[23,9,23,38],[21,165,21,167],[22,165,22,167],[23,165,23,167],[24,165,24,167],[25,87,25,123],[21,87,21,123],[29,2,29,4],[29,166,29,168],[29,112,29,165],[29,5,29,57],[29,58,29,111],[24,9,24,38],[24,41,24,70],[24,72,24,85],[26,126,26,162],[27,126,27,162],[27,87,27,123],[26,87,26,123],[24,3,24,6],[27,9,27,38],[27,41,27,70],[27,72,27,85],[26,9,26,38],[27,165,27,167],[25,41,25,70],[25,72,25,85],[26,3,26,6],[27,3,27,6],[25,165,25,167],[26,165,26,167],[19,9,19,38],[19,41,19,70],[19,72,19,85],[19,3,19,6],[20,3,20,6],[22,9,22,38],[22,41,22,70],[22,72,22,85],[21,9,21,38],[21,41,21,70],[21,72,21,85],[21,3,21,6],[22,3,22,6],[7,9,7,38],[7,41,7,70],[7,164,7,168],[7,87,7,123],[7,126,7,162],[14,9,14,38],[14,41,14,70],[14,72,14,85],[13,9,13,38],[13,41,13,70],[13,72,13,85],[12,41,12,70],[12,72,12,85],[11,9,11,38],[11,41,11,70],[11,72,11,85],[8,165,8,167],[9,165,9,167],[10,165,10,167],[11,165,11,167],[12,165,12,167],[8,9,8,38],[8,41,8,70],[8,72,8,85],[37,41,37,70],[38,9,38,38],[38,41,38,70],[2,2,2,168],[3,2,3,168],[5,2,5,15],[5,16,5,18],[5,19,5,32],[4,2,4,15],[4,16,4,18],[4,19,4,32],[4,33,5,38],[6,2,6,168],[7,2,7,7],[7,72,7,85],[4,49,5,49],[4,161,4,168],[5,161,5,168],[4,155,5,160],[4,39,4,48],[5,39,5,48],[4,141,4,154],[4,136,4,140],[5,50,5,135],[43,153,43,167],[44,153,44,167],[45,153,45,167],[46,153,46,167],[34,2,34,168],[35,2,35,7],[35,9,35,38],[35,41,35,70],[36,9,36,38],[36,41,36,70],[36,3,36,6],[37,3,37,6],[38,3,38,6],[37,9,37,38],[45,3,45,6],[46,3,46,6],[41,3,41,6],[39,3,39,6],[40,3,40,6],[44,3,44,6],[41,9,41,38],[41,41,41,70],[42,9,42,38],[42,41,42,70],[45,9,45,38],[45,41,45,70],[46,9,46,38],[46,41,46,70],[48,9,48,38],[48,41,48,70],[49,9,49,38],[49,41,49,70],[50,9,50,38],[51,9,51,38],[51,41,51,70],[52,9,52,38],[52,41,52,70],[51,3,51,6],[52,3,52,6],[47,9,47,38],[47,41,47,70],[49,101,49,130],[50,101,50,130],[51,101,51,130],[52,101,52,130],[49,3,49,6],[50,3,50,6],[47,3,47,6],[48,3,48,6],[48,73,48,98],[49,73,49,98],[50,73,50,98],[51,73,51,98],[52,73,52,98],[47,73,47,98],[39,9,39,38],[39,41,39,70],[40,9,40,38],[42,3,42,6],[43,9,43,38],[43,41,43,70],[44,9,44,38],[44,41,44,70],[43,3,43,6],[40,41,40,70],[57,2,57,4],[57,5,57,57],[57,58,57,111],[57,112,57,165],[55,9,55,38],[55,41,55,70],[56,2,56,4],[53,9,53,38],[53,41,53,70],[54,9,54,38],[54,41,54,70],[55,3,55,6],[56,72,56,103],[53,3,53,6],[54,3,54,6],[53,101,53,130],[53,133,53,151],[54,101,54,130],[55,101,55,130],[55,133,55,151],[53,73,53,98],[54,73,54,98],[55,73,55,98],[33,2,33,15],[33,16,33,18],[33,19,33,32],[33,39,33,48],[33,50,33,135],[33,136,33,140],[33,141,33,154],[33,161,33,168],[32,2,32,15],[32,16,32,18],[32,19,32,32],[32,33,33,38],[32,39,32,48],[32,49,33,49],[32,50,32,135],[32,136,32,140],[32,141,32,154],[8,87,8,123],[8,126,8,162],[8,3,8,6],[10,9,10,38],[10,41,10,70],[10,72,10,85],[9,9,9,38],[9,41,9,70],[9,72,9,85],[9,3,9,6],[10,3,10,6],[9,87,9,123],[10,87,10,123],[17,165,17,167],[17,87,17,123],[20,87,20,123],[18,126,18,162],[19,126,19,162],[20,126,20,162],[30,2,30,168],[31,2,31,168],[17,126,17,162],[25,3,25,6],[18,165,18,167],[19,165,19,167],[20,165,20,167],[18,9,18,38],[18,41,18,70],[18,72,18,85],[17,9,17,38],[17,41,17,70],[17,72,17,85],[17,3,17,6],[18,3,18,6],[20,9,20,38],[20,41,20,70],[20,72,20,85],[13,3,13,6],[14,3,14,6],[16,9,16,38],[16,41,16,70],[13,165,13,167],[14,165,14,167],[15,165,15,167],[9,126,9,162],[10,126,10,162],[16,165,16,167],[12,9,12,38],[16,72,16,85],[15,9,15,38],[15,41,15,70],[15,72,15,85],[15,3,15,6],[16,3,16,6],[48,153,48,167],[49,153,49,167],[50,153,50,167],[51,153,51,167],[11,3,11,6],[12,3,12,6],[25,126,25,162],[11,126,11,162],[12,126,12,162],[13,126,13,162],[14,126,14,162],[15,126,15,162],[16,126,16,162],[18,87,18,123],[22,87,22,123],[23,87,23,123],[24,87,24,123],[11,87,11,123],[12,87,12,123],[13,87,13,123],[14,87,14,123],[15,87,15,123],[16,87,16,123],[19,87,19,123],[52,153,52,167],[53,153,53,167],[54,153,54,167],[55,153,55,167],[60,68,60,70],[32,155,33,160],[32,161,32,168],[50,41,50,70],[57,166,57,168],[56,166,56,168],[35,153,35,167],[36,153,36,167],[37,153,37,167],[38,153,38,167],[39,153,39,167],[40,153,40,167],[41,153,41,167],[42,153,42,167],[49,133,49,151],[50,133,50,151],[51,133,51,151],[52,133,52,151],[54,133,54,151],[47,153,47,167]]}
[{"$f":"SUM(Data_LD!B24)","v":0}]
[]
[null,null,{"$f":"IF(Start!I9<>\"\",VLOOKUP(Start!I9,Data_LD!A4:W23,9,FALSE),\"\")","v":""},null,null,null,null,null,null,null,null,null,null,null,null,null,null,null,null,null,null,null,null,null,null,null,null,null,null,null,null,null,null,null,null,null,null,null,null,null,null,null,null,null,null,null,null,null,null,null,null,null,null,null,null,null,null,null,null,null,null,null,null,null,null,null,null,null,null,null,null,null,null,null,null,null,null,null,null,null,null,null,null,null,null,null,null,null,null,null,null,null,null,null,null,null,null,null,null,null,null,null,null,null,null,null,null,null,null,null,null,null,null,null,null,null,null,null,null,null,null,null,null,null,null,null,null,null,null,null,null,null,null,null,null,null,null,null,null,null,null,null,null,null,null,null,null,null,null,null,null,null,null,null,null,null,null,null,null,null,null,null,null,null,null,null,null,null,null,null,null,"Die Teilnehmerliste hat eine Vorder- und Rückseite!"]
[null,null,null,null,null,null,null,null,null,null,null,null,null,null,null,null,null,null,null,null,null,null,null,null,null,null,null,null,null,null,null,null,null,null,null,null,null,null,null,null,null,null,null,null,null,null,null,null,null,null,null,null,null,null,null,null,null,null,null,null,null,null,null,null,null,null,null,null,null,null,null,null,null,null,null,null,null,null,null,null,null,null,null,null,null,null,null,null,null,null,null,null,null,null,null,null,null,null,null,null,null,null,null,null,null,null,null,null,null,null,null,null,null,null,null,null,null,null,null,null,null,null,null,null,null,null,null,null,null,null,null,null,null,null,null,null,null,null,null,null,null,null,null,null,null,null,null,null,null,null,null,null,null,null,null,null,null,null,null,null,null,null,null,null,null,null,null,null,null,null,null,"Unterhalb dieser Liste befindet sich die Rückseite, die ebenfalls bearbeitet werden muss."]
[null,null,{"$f":"IF(Doku!Y34<>\"\",Doku!Y34,\"\")","v":""},null,null,null,null,null,null,null,null,null,null,null,null,null,null,null,null,{"$f":"IF(Doku!CC34<>\"\",Doku!CC34,\"\")","v":""},null,null,null,null,null,null,null,null,null,null,null,null,null,null,null,null,null,null,null,{"$f":"IF(Doku!BR18<>\"\",Doku!BR18,\"\")","v":""},null,null,null,null,null,null,null,null,null,null,{"$f":"IF(Doku!BZ18<>\"\",Doku!BZ18,\"\")","v":""},null,null,null,null,null,null,null,null,null,null,null,null,null,null,null,null,null,null,null,null,null,null,null,null,null,null,null,null,null,null,null,null,null,null,null,null,null,null,null,null,null,null,null,null,null,null,null,null,null,null,null,null,null,null,null,null,null,null,null,null,null,null,null,null,null,null,null,null,null,null,null,null,null,null,null,null,null,null,null,null,null,null,null,null,null,null,null,null,null,null,{"$f":"IF(Start!I9<>0,Doku!$Y$26,\"\")","v":""},null,null,null,null,null,null,null,null,null,null,null,null,null,null,null,null,null,null,null,"1 | 2"]
[null,null,"Lehrgang vom",null,null,null,null,null,null,null,null,null,null,null,null,null,null,null,null,"Lehrgang bis",null,null,null,null,null,null,null,null,null,null,null,null,null,null,null,null,null,null,null,"Postleitzahl",null,null,null,null,null,null,null,null,null,null,"Lehrgangsort",null,null,null,null,null,null,null,null,null,null,null,null,null,null,null,null,null,null,null,null,null,null,null,null,null,null,null,null,null,null,null,null,null,null,null,null,null,null,null,null,null,null,null,null,null,null,null,null,null,null,null,null,null,null,null,null,null,null,null,null,null,null,null,null,null,null,null,null,null,null,null,null,null,null,null,null,null,null,null,null,null,null,null,null,null,null,null,null,null,null,"Lehrgangsnummer",null,null,null,null,null,null,null,null,null,null,null,null,null,null,null,null,null,null,null,"Seite"]
[]
[null,null,"Nr.",null,null,null,null,null,null,"Nachname",null,null,null,null,null,null,null,null,null,null,null,null,null,null,null,null,null,null,null,null,null,null,null,null,null,null,null,null,null,null,null,"Vorname",null,null,null,null,null,null,null,null,null,null,null,null,null,null,null,null,null,null,null,null,null,null,null,null,null,null,null,null,null,null,"Geb.-am",null,null,null,null,null,null,null,null,null,null,null,null,null,null,"Straße",null,null,null,null,null,null,null,null,null,null,null,null,null,null,null,null,null,null,null,null,null,null,null,null,null,null,null,null,null,null,null,null,null,null,null,null,null,null,"Wohnort",null,null,null,null,null,null,null,null,null,null,null,null,null,null,null,null,null,null,null,null,null,null,null,null,null,null,null,null,null,null,null,null,null,null,null,null,null,"B",null,null,null,null,null,null,"B = Der Teilnehmer hat den Lehrgang erfolgreich abgeschlossen!"]
[null,null,null,{"$f":"IF(J9<>\"\",1,\"\")","v":""}]
[null,null,null,{"$f":"IF(J10<>\"\",2,\"\")","v":""}]
[null,null,null,{"$f":"IF(J11<>\"\",3,\"\")","v":""}]
[null,null,null,{"$f":"IF(J12<>\"\",4,\"\")","v":""}]
[null,null,null,{"$f":"IF(J13<>\"\",5,\"\")","v":""}]
[null,null,null,{"$f":"IF(J14<>\"\",6,\"\")","v":""}]
[null,null,null,{"$f":"IF(J15<>\"\",7,\"\")","v":""}]
[null,null,null,{"$f":"IF(J16<>\"\",8,\"\")","v":""}]
[null,null,null,{"$f":"IF(J17<>\"\",9,\"\")","v":""}]
[null,null,null,{"$f":"IF(J18<>\"\",10,\"\")","v":""}]
[null,null,null,{"$f":"IF(J19<>\"\",11,\"\")","v":""}]
[null,null,null,{"$f":"IF(J20<>\"\",12,\"\")","v":""}]
[null,null,null,{"$f":"IF(J21<>\"\",13,\"\")","v":""}]
[null,null,null,{"$f":"IF(J22<>\"\",14,\"\")","v":""}]
[null,null,null,{"$f":"IF(J23<>\"\",15,\"\")","v":""}]
[null,null,null,{"$f":"IF(J24<>\"\",16,\"\")","v":""}]
[null,null,null,{"$f":"IF(J25<>\"\",17,\"\")","v":""}]
[null,null,null,{"$f":"IF(J26<>\"\",18,\"\")","v":""}]
[null,null,null,{"$f":"IF(J27<>\"\",19,\"\")","v":""}]
[null,null,null,{"$f":"IF(J28<>\"\",20,\"\")","v":""},null,null,null,null,null,null,null,null,null,null,null,null,null,null,null,null,null,null,null,null,null,null,null,null,null,null,null,null,null,null,null,null,null,null,null,null,null,null,null,null,null,null,null,null,null,null,null,null,null,null,null,null,null,null,null,null,null,null,null,null,null,null,null,null,null,null,null,null,null,null,null,null,null,null,null,null,null,null,null,null,null,null,null,null,null,null,null,null,null,null,null,null,null,null,null,null,null,null,null,null,null,null,null,null,null,null,null,null,null,null,null,null,null,null,null,null,null,null,null,null,null,null,null,null,null,null,null,null,null,null,null,null,null,null,null,null,null,null,null,null,null,null,null,null,null,null,null,null,null,null,null,null,null,null,null,null,null,null,null,null,null,null,null,null,null,null,{"$f":"COUNTA(FJ9:FJ28)","v":0}]
[null,null,null,null,null,null,null,null,null,null,null,null,null,null,null,null,null,null,null,null,null,null,null,null,null,null,null,null,null,null,null,null,null,null,null,null,null,null,null,null,null,null,null,null,null,null,null,null,null,null,null,null,null,null,null,null,null,null,null,null,null,null,null,null,null,null,null,null,null,null,null,null,null,null,null,null,null,null,null,null,null,null,null,null,null,null,null,null,null,null,null,null,null,null,null,null,null,null,null,null,null,null,null,null,null,null,null,null,null,null,null,null,null,null,null,null,null,null,null,null,null,null,null,null,null,null,null,null,null,null,null,null,null,null,null,null,null,null,null,null,null,null,null,null,null,null,null,null,null,null,null,null,null,null,null,null,null,null,null,null,null,null,null,null,null,null,null,null,null,null,{"$f":"COUNTA(FJ9:FL28)","v":0}]
[null,null,null,null,null,"dlrg.de"]
[null,null,{"$f":"IF(C3<>\"\",C3,\"\")","v":""}]
[]
[null,null,{"$f":"IF(C5<>\"\",C5,\"\")","v":""},null,null,null,null,null,null,null,null,null,null,null,null,null,null,null,null,{"$f":"IF(T5<>\"\",T5,\"\")","v":""},null,null,null,null,null,null,null,null,null,null,null,null,null,null,null,null,null,null,null,{"$f":"IF(AN5<>\"\",AN5,\"\")","v":""},null,null,null,null,null,null,null,null,null,null,{"$f":"IF(AY5<>\"\",AY5,\"\")","v":""},null,null,null,null,null,null,null,null,null,null,null,null,null,null,null,null,null,null,null,null,null,null,null,null,null,null,null,null,null,null,null,null,null,null,null,null,null,null,null,null,null,null,null,null,null,null,null,null,null,null,null,null,null,null,null,null,null,null,null,null,null,null,null,null,null,null,null,null,null,null,null,null,null,null,null,null,null,null,null,null,null,null,null,null,null,null,null,null,null,null,{"$f":"IF(EL5<>0,EL5,\"\")","v":""},null,null,null,null,null,null,null,null,null,null,null,null,null,null,null,null,null,null,null,"2 | 2"]
[null,null,"Lehrgang vom",null,null,null,null,null,null,null,null,null,null,null,null,null,null,null,null,"Lehrgang bis",null,null,null,null,null,null,null,null,null,null,null,null,null,null,null,null,null,null,null,"Postleitzahl",null,null,null,null,null,null,null,null,null,null,"Lehrgangsort",null,null,null,null,null,null,null,null,null,null,null,null,null,null,null,null,null,null,null,null,null,null,null,null,null,null,null,null,null,null,null,null,null,null,null,null,null,null,null,null,null,null,null,null,null,null,null,null,null,null,null,null,null,null,null,null,null,null,null,null,null,null,null,null,null,null,null,null,null,null,null,null,null,null,null,null,null,null,null,null,null,null,null,null,null,null,null,null,null,null,"Lehrgangsnummer",null,null,null,null,null,null,null,null,null,null,null,null,null,null,null,null,null,null,null,"Seite"]
[]
[null,null,"Nr.",null,null,null,null,null,null,"Name",null,null,null,null,null,null,null,null,null,null,null,null,null,null,null,null,null,null,null,null,null,null,null,null,null,null,null,null,null,null,null,"E-Mail-Adresse",null,null,null,null,null,null,null,null,null,null,null,null,null,null,null,null,null,null,null,null,null,null,null,null,null,null,null,null,null,null,null,"Reg.-Nr.:",null,null,null,null,null,null,null,null,null,null,null,null,null,null,null,null,null,null,null,null,null,null,null,null,null,null,null,{"$f":"IF(A1<=3,Data_PD!S3,\"\")","v":"Name Arbeitgeber"},null,null,null,null,null,null,null,null,null,null,null,null,null,null,null,null,null,null,null,null,null,null,null,null,null,null,null,null,null,null,null,{"$f":"IF(A1<=3,Data_PD!T3,\"\")","v":"PLZ & Firmenort"},null,null,null,null,null,null,null,null,null,null,null,null,null,null,null,null,null,null,null,{"$f":"IF(A1<=3,Data_PD!U3,\"\")","v":"UVT"},null,null,null,null,null,null,null,null,null,null,null,null,null,null,null,null,null,"Beginn mit der laufenden Nummer:"]
[null,null,null,{"$f":"IF(J37<>\"\",1,\"\")","v":""},null,null,null,null,null,{"$f":"IF(J9<>\"\",CONCATENATE(J9,\", \",AP9),\"\")","v":""},null,null,null,null,null,null,null,null,null,null,null,null,null,null,null,null,null,null,null,null,null,null,null,null,null,null,null,null,null,null,null,null,null,null,null,null,null,null,null,null,null,null,null,null,null,null,null,null,null,null,null,null,null,null,null,null,null,null,null,null,null,null,null,{"$f":"IF(D37<>\"\",VLOOKUP(D37,Data_PD!$A$4:$O$23,14,FALSE),\"\")","v":""},null,null,null,null,null,null,null,null,null,null,null,null,null,null,null,null,null,null,null,null,null,null,null,null,null,null,null,null,null,null,null,null,null,null,null,null,null,null,null,null,null,null,null,null,null,null,null,null,null,null,null,null,null,null,null,null,null,null,null,null,null,null,null,null,null,null,null,null,null,null,null,null,null,null,null,null,null,null,null,null,null,null,null,null,null,null,null,null,null,null,null,null,null,null,null,null,0,1,"bis",{"$f":"IF(FP37<>\"\",MAX(Data_PD!AF4:AF23),\"\")","v":20}]
[null,null,null,{"$f":"IF(J38<>\"\",2,\"\")","v":""},null,null,null,null,null,{"$f":"IF(J10<>\"\",CONCATENATE(J10,\", \",AP10),\"\")","v":""},null,null,null,null,null,null,null,null,null,null,null,null,null,null,null,null,null,null,null,null,null,null,null,null,null,null,null,null,null,null,null,null,null,null,null,null,null,null,null,null,null,null,null,null,null,null,null,null,null,null,null,null,null,null,null,null,null,null,null,null,null,null,null,{"$f":"IF(D38<>\"\",VLOOKUP(D38,Data_PD!$A$4:$O$23,14,FALSE),\"\")","v":""},null,null,null,null,null,null,null,null,null,null,null,null,null,null,null,null,null,null,null,null,null,null,null,null,null,null,null,null,null,null,null,null,null,null,null,null,null,null,null,null,null,null,null,null,null,null,null,null,null,null,null,null,null,null,null,null,null,null,null,null,null,null,null,null,null,null,null,null,null,null,null,null,null,null,null,null,null,null,null,null,null,null,null,null,null,null,null,null,null,null,null,null,null,null,null,null,1]
[null,null,null,{"$f":"IF(J39<>\"\",3,\"\")","v":""},null,null,null,null,null,"",null,null,null,null,null,null,null,null,null,null,null,null,null,null,null,null,null,null,null,null,null,null,null,null,null,null,null,null,null,null,null,null,null,null,null,null,null,null,null,null,null,null,null,null,null,null,null,null,null,null,null,null,null,null,null,null,null,null,null,null,null,null,null,{"$f":"IF(D39<>\"\",VLOOKUP(D39,Data_PD!$A$4:$O$23,14,FALSE),\"\")","v":""}]
[null,null,null,{"$f":"IF(J40<>\"\",4,\"\")","v":""},null,null,null,null,null,"",null,null,null,null,null,null,null,null,null,null,null,null,null,null,null,null,null,null,null,null,null,null,null,null,null,null,null,null,null,null,null,null,null,null,null,null,null,null,null,null,null,null,null,null,null,null,null,null,null,null,null,null,null,null,null,null,null,null,null,null,null,null,null,{"$f":"IF(D40<>\"\",VLOOKUP(D40,Data_PD!$A$4:$O$23,14,FALSE),\"\")","v":""}]
[null,null,null,{"$f":"IF(J41<>\"\",5,\"\")","v":""},null,null,null,null,null,"",null,null,null,null,null,null,null,null,null,null,null,null,null,null,null,null,null,null,null,null,null,null,null,null,null,null,null,null,null,null,null,null,null,null,null,null,null,null,null,null,null,null,null,null,null,null,null,null,null,null,null,null,null,null,null,null,null,null,null,null,null,null,null,{"$f":"IF(D41<>\"\",VLOOKUP(D41,Data_PD!$A$4:$O$23,14,FALSE),\"\")","v":""}]
[null,null,null,{"$f":"IF(J42<>\"\",6,\"\")","v":""},null,null,null,null,null,"",null,null,null,null,null,null,null,null,null,null,null,null,null,null,null,null,null,null,null,null,null,null,null,null,null,null,null,null,null,null,null,null,null,null,null,null,null,null,null,null,null,null,null,null,null,null,null,null,null,null,null,null,null,null,null,null,null,null,null,null,null,null,null,{"$f":"IF(D42<>\"\",VLOOKUP(D42,Data_PD!$A$4:$O$23,14,FALSE),\"\")","v":""}]
[null,null,null,{"$f":"IF(J43<>\"\",7,\"\")","v":""},null,null,null,null,null,"",null,null,null,null,null,null,null,null,null,null,null,null,null,null,null,null,null,null,null,null,null,null,null,null,null,null,null,null,null,null,null,null,null,null,null,null,null,null,null,null,null,null,null,null,null,null,null,null,null,null,null,null,null,null,null,null,null,null,null,null,null,null,null,{"$f":"IF(D43<>\"\",VLOOKUP(D43,Data_PD!$A$4:$O$23,14,FALSE),\"\")","v":""}]
[null,null,null,{"$f":"IF(J44<>\"\",8,\"\")","v":""},null,null,null,null,null,"",null,null,null,null,null,null,null,null,null,null,null,null,null,null,null,null,null,null,null,null,null,null,null,null,null,null,null,null,null,null,null,null,null,null,null,null,null,null,null,null,null,null,null,null,null,null,null,null,null,null,null,null,null,null,null,null,null,null,null,null,null,null,null,{"$f":"IF(D44<>\"\",VLOOKUP(D44,Data_PD!$A$4:$O$23,14,FALSE),\"\")","v":""}]
[null,null,null,{"$f":"IF(J45<>\"\",9,\"\")","v":""},null,null,null,null,null,"",null,null,null,null,null,null,null,null,null,null,null,null,null,null,null,null,null,null,null,null,null,null,null,null,null,null,null,null,null,null,null,null,null,null,null,null,null,null,null,null,null,null,null,null,null,null,null,null,null,null,null,null,null,null,null,null,null,null,null,null,null,null,null,{"$f":"IF(D45<>\"\",VLOOKUP(D45,Data_PD!$A$4:$O$23,14,FALSE),\"\")","v":""}]
[null,null,null,{"$f":"IF(J46<>\"\",10,\"\")","v":""},null,null,null,null,null,"",null,null,null,null,null,null,null,null,null,null,null,null,null,null,null,null,null,null,null,null,null,null,null,null,null,null,null,null,null,null,null,null,null,null,null,null,null,null,null,null,null,null,null,null,null,null,null,null,null,null,null,null,null,null,null,null,null,null,null,null,null,null,null,{"$f":"IF(D46<>\"\",VLOOKUP(D46,Data_PD!$A$4:$O$23,14,FALSE),\"\")","v":""}]
[null,null,null,{"$f":"IF(J47<>\"\",11,\"\")","v":""},null,null,null,null,null,"",null,null,null,null,null,null,null,null,null,null,null,null,null,null,null,null,null,null,null,null,null,null,null,null,null,null,null,null,null,null,null,null,null,null,null,null,null,null,null,null,null,null,null,null,null,null,null,null,null,null,null,null,null,null,null,null,null,null,null,null,null,null,null,{"$f":"IF(D47<>\"\",VLOOKUP(D47,Data_PD!$A$4:$O$23,14,FALSE),\"\")","v":""}]
[null,null,null,{"$f":"IF(J48<>\"\",12,\"\")","v":""},null,null,null,null,null,"",null,null,null,null,null,null,null,null,null,null,null,null,null,null,null,null,null,null,null,null,null,null,null,null,null,null,null,null,null,null,null,null,null,null,null,null,null,null,null,null,null,null,null,null,null,null,null,null,null,null,null,null,null,null,null,null,null,null,null,null,null,null,null,{"$f":"IF(D48<>\"\",VLOOKUP(D48,Data_PD!$A$4:$O$23,14,FALSE),\"\")","v":""}]
[null,null,null,{"$f":"IF(J49<>\"\",13,\"\")","v":""},null,null,null,null,null,"",null,null,null,null,null,null,null,null,null,null,null,null,null,null,null,null,null,null,null,null,null,null,null,null,null,null,null,null,null,null,null,null,null,null,null,null,null,null,null,null,null,null,null,null,null,null,null,null,null,null,null,null,null,null,null,null,null,null,null,null,null,null,null,{"$f":"IF(D49<>\"\",VLOOKUP(D49,Data_PD!$A$4:$O$23,14,FALSE),\"\")","v":""}]
[null,null,null,{"$f":"IF(J50<>\"\",14,\"\")","v":""},null,null,null,null,null,"",null,null,null,null,null,null,null,null,null,null,null,null,null,null,null,null,null,null,null,null,null,null,null,null,null,null,null,null,null,null,null,null,null,null,null,null,null,null,null,null,null,null,null,null,null,null,null,null,null,null,null,null,null,null,null,null,null,null,null,null,null,null,null,{"$f":"IF(D50<>\"\",VLOOKUP(D50,Data_PD!$A$4:$O$23,14,FALSE),\"\")","v":""}]
[null,null,null,{"$f":"IF(J51<>\"\",15,\"\")","v":""},null,null,null,null,null,"",null,null,null,null,null,null,null,null,null,null,null,null,null,null,null,null,null,null,null,null,null,null,null,null,null,null,null,null,null,null,null,null,null,null,null,null,null,null,null,null,null,null,null,null,null,null,null,null,null,null,null,null,null,null,null,null,null,null,null,null,null,null,null,{"$f":"IF(D51<>\"\",VLOOKUP(D51,Data_PD!$A$4:$O$23,14,FALSE),\"\")","v":""}]
[null,null,null,{"$f":"IF(J52<>\"\",16,\"\")","v":""},null,null,null,null,null,"",null,null,null,null,null,null,null,null,null,null,null,null,null,null,null,null,null,null,null,null,null,null,null,null,null,null,null,null,null,null,null,null,null,null,null,null,null,null,null,null,null,null,null,null,null,null,null,null,null,null,null,null,null,null,null,null,null,null,null,null,null,null,null,{"$f":"IF(D52<>\"\",VLOOKUP(D52,Data_PD!$A$4:$O$23,14,FALSE),\"\")","v":""}]
[null,null,null,{"$f":"IF(J53<>\"\",17,\"\")","v":""},null,null,null,null,null,"",null,null,null,null,null,null,null,null,null,null,null,null,null,null,null,null,null,null,null,null,null,null,null,null,null,null,null,null,null,null,null,null,null,null,null,null,null,null,null,null,null,null,null,null,null,null,null,null,null,null,null,null,null,null,null,null,null,null,null,null,null,null,null,{"$f":"IF(D53<>\"\",VLOOKUP(D53,Data_PD!$A$4:$O$23,14,FALSE),\"\")","v":""}]
[null,null,null,{"$f":"IF(J54<>\"\",18,\"\")","v":""},null,null,null,null,null,{"$f":"IF(J26<>\"\",CONCATENATE(J26,\", \",AP26),\"\")","v":""},null,null,null,null,null,null,null,null,null,null,null,null,null,null,null,null,null,null,null,null,null,null,null,null,null,null,null,null,null,null,null,null,null,null,null,null,null,null,null,null,null,null,null,null,null,null,null,null,null,null,null,null,null,null,null,null,null,null,null,null,null,null,null,{"$f":"IF(D54<>\"\",VLOOKUP(D54,Data_PD!$A$4:$O$23,14,FALSE),\"\")","v":""}]
[null,null,null,{"$f":"IF(J55<>\"\",19,\"\")","v":""},null,null,null,null,null,{"$f":"IF(J27<>\"\",CONCATENATE(J27,\", \",AP27),\"\")","v":""},null,null,null,null,null,null,null,null,null,null,null,null,null,null,null,null,null,null,null,null,null,null,null,null,null,null,null,null,null,null,null,null,null,null,null,null,null,null,null,null,null,null,null,null,null,null,null,null,null,null,null,null,null,null,null,null,null,null,null,null,null,null,null,{"$f":"IF(D55<>\"\",VLOOKUP(D55,Data_PD!$A$4:$O$23,14,FALSE),\"\")","v":""}]
[null,null,null,{"$f":"IF(J56<>\"\",20,\"\")","v":""},null,null,null,null,null,"",null,null,null,null,null,null,null,null,null,null,null,null,null,null,null,null,null,null,null,null,null,null,null,null,null,null,null,null,null,null,null,null,null,null,null,null,null,null,null,null,null,null,null,null,null,null,null,null,null,null,null,null,null,null,null,null,null,null,null,null,null,null,null,{"$f":"IF(D56<>\"\",VLOOKUP(D56,Data_PD!$A$4:$O$23,14,FALSE),\"\")","v":""},null,null,null,null,null,null,null,null,null,null,null,null,null,null,null,null,null,null,null,null,null,null,null,null,null,null,null,null,null,null,null,null,null,null,null,null,null,null,null,null,null,null,null,null,null,null,null,null,null,null,null,null,null,null,null,null,null,null,null,null,null,null,null,null,null,null,null,null,null,null,null,null,null,null,null,null,null,null,null,null,null,null,null,null,null,null,null,null,null,null,null,null,null,null,null,null,{"$f":"COUNTA(CX37:EA56)","v":0}]
[null,null,null,null,null,null,null,null,null,null,null,null,null,null,null,null,null,null,null,null,null,null,null,null,null,null,null,null,null,null,null,null,null,null,null,null,null,null,null,null,null,null,null,null,null,null,null,null,null,null,null,null,null,null,null,null,null,null,null,null,null,null,null,null,null,null,null,null,null,null,null,null,{"$f":"COUNTA(BV37:CY56)","v":20}]

{"sheet":"UTN","index":5,"n_rows":79,"n_cols":75,"rows_kept":79,"cut":false,"hidden":true,"merged":[[3,2,3,109],[10,74,11,108],[10,35,11,35],[10,34,11,34],[10,7,11,7],[10,2,11,6],[10,62,11,62],[12,8,14,33],[12,7,14,7],[13,64,13,66],[13,69,13,71],[14,63,14,67],[12,63,12,67],[12,68,12,72],[14,68,14,72],[12,73,14,109],[10,73,11,73],[5,2,5,109],[15,7,17,7],[15,8,17,33],[7,2,7,109],[10,8,11,33],[10,36,11,61],[10,63,10,72],[11,63,11,67],[12,35,14,35],[12,34,14,34],[12,62,14,62],[11,68,11,72],[15,63,15,67],[15,68,15,72],[15,73,17,109],[16,64,16,66],[16,69,16,71],[17,63,17,67],[17,68,17,72],[15,34,17,34],[15,35,17,35],[15,36,17,61],[15,62,17,62],[12,36,14,61],[18,63,18,67],[18,68,18,72],[18,73,20,109],[19,64,19,66],[19,69,19,71],[20,63,20,67],[20,68,20,72],[18,7,20,7],[18,8,20,33],[18,34,20,34],[18,35,20,35],[18,36,20,61],[18,62,20,62],[21,63,21,67],[21,68,21,72],[21,73,23,109],[22,64,22,66],[22,69,22,71],[23,63,23,67],[23,68,23,72],[21,7,23,7],[21,8,23,33],[21,34,23,34],[21,35,23,35],[21,36,23,61],[21,62,23,62],[24,63,24,67],[24,68,24,72],[24,73,26,109],[25,64,25,66],[25,69,25,71],[26,63,26,67],[26,68,26,72],[24,7,26,7],[24,8,26,33],[24,34,26,34],[24,35,26,35],[24,36,26,61],[24,62,26,62],[27,63,27,67],[27,68,27,72],[27,73,29,109],[28,64,28,66],[28,69,28,71],[29,63,29,67],[29,68,29,72],[27,7,29,7],[27,8,29,33],[27,34,29,34],[27,35,29,35],[27,36,29,61],[27,62,29,62],[30,63,30,67],[30,68,30,72],[30,73,32,109],[31,64,31,66],[31,69,31,71],[32,63,32,67],[32,68,32,72],[30,7,32,7],[30,8,32,33],[30,34,32,34],[30,35,32,35],[30,36,32,61],[30,62,32,62],[33,63,33,67],[33,68,33,72],[33,73,35,109],[34,64,34,66],[34,69,34,71],[35,63,35,67],[35,68,35,72],[33,7,35,7],[33,8,35,33],[33,34,35,34],[33,35,35,35],[33,36,35,61],[33,62,35,62],[36,62,38,62],[36,63,36,67],[36,68,36,72],[36,73,38,109],[37,64,37,66],[37,69,37,71],[38,63,38,67],[38,68,38,72],[36,7,38,7],[36,8,38,33],[36,34,38,34],[36,35,38,35],[36,36,38,61],[39,62,41,62],[39,63,39,67],[39,68,39,72],[39,73,41,109],[40,64,40,66],[40,69,40,71],[41,63,41,67],[41,68,41,72],[39,7,41,7],[39,8,41,33],[39,34,41,34],[39,35,41,35],[39,36,41,61],[42,62,44,62],[42,63,42,67],[42,68,42,72],[42,73,44,109],[43,64,43,66],[43,69,43,71],[44,63,44,67],[44,68,44,72],[42,7,44,7],[42,8,44,33],[42,34,44,34],[42,35,44,35],[42,36,44,61],[45,62,47,62],[45,63,45,67],[45,68,45,72],[45,73,47,109],[46,64,46,66],[46,69,46,71],[47,63,47,67],[47,68,47,72],[45,7,47,7],[45,8,47,33],[45,34,47,34],[45,35,47,35],[45,36,47,61],[48,62,50,62],[48,63,48,67],[48,68,48,72],[48,73,50,109],[49,64,49,66],[49,69,49,71],[50,63,50,67],[50,68,50,72],[48,7,50,7],[48,8,50,33],[48,34,50,34],[48,35,50,35],[48,36,50,61],[51,62,53,62],[51,63,51,67],[51,68,51,72],[51,73,53,109],[52,64,52,66],[52,69,52,71],[53,63,53,67],[53,68,53,72],[51,7,53,7],[51,8,53,33],[51,34,53,34],[51,35,53,35],[51,36,53,61],[54,62,56,62],[54,63,54,67],[54,68,54,72],[54,73,56,109],[55,64,55,66],[55,69,55,71],[56,63,56,67],[56,68,56,72],[54,7,56,7],[54,8,56,33],[54,34,56,34],[54,35,56,35],[54,36,56,61],[57,2,59,5],[60,62,62,62],[60,63,60,67],[60,68,60,72],[60,73,62,109],[61,64,61,66],[61,69,61,71],[62,63,62,67],[62,68,62,72],[60,7,62,7],[57,62,59,62],[57,63,57,67],[57,68,57,72],[57,73,59,109],[58,64,58,66],[58,69,58,71],[59,63,59,67],[59,68,59,72],[57,7,59,7],[57,8,59,33],[57,34,59,34],[57,35,59,35],[57,36,59,61],[60,8,62,33],[60,34,62,34],[60,35,62,35],[60,36,62,61],[63,62,65,62],[63,63,63,67],[63,68,63,72],[63,2,65,5],[66,2,68,5],[66,63,66,67],[66,68,66,72],[60,2,62,5],[63,73,65,109],[64,64,64,66],[64,69,64,71],[65,63,65,67],[65,68,65,72],[63,7,65,7],[63,8,65,33],[63,34,65,34],[63,35,65,35],[63,36,65,61],[66,73,68,109],[67,64,67,66],[67,69,67,71],[68,63,68,67],[68,68,68,72],[66,7,68,7],[66,8,68,33],[66,34,68,34],[66,35,68,35],[66,36,68,61],[48,2,50,5],[51,2,53,5],[54,2,56,5],[78,76,78,106],[78,107,78,109],[78,2,78,4],[8,2,8,109],[9,2,9,109],[76,2,76,41],[75,2,75,41],[69,62,71,62],[69,63,69,67],[69,68,69,72],[69,73,71,109],[70,64,70,66],[70,69,70,71],[71,63,71,67],[71,68,71,72],[69,7,71,7],[69,8,71,33],[69,34,71,34],[69,35,71,35],[69,36,71,61],[66,62,68,62],[21,2,23,5],[24,2,26,5],[27,2,29,5],[30,2,32,5],[33,2,35,5],[36,2,38,5],[39,2,41,5],[42,2,44,5],[45,2,47,5],[77,2,77,109],[6,2,6,17],[6,18,6,29],[6,30,6,32],[6,33,6,43],[6,44,6,109],[73,2,73,41],[2,2,2,109],[4,2,4,7],[4,8,4,19],[4,20,4,25],[4,26,4,37],[4,38,4,40],[4,41,4,44],[4,45,4,109],[74,2,74,41],[69,2,71,5],[72,2,72,41],[76,70,76,109],[72,70,75,109],[72,42,76,69],[12,2,14,5],[15,2,17,5],[18,2,20,5]]}
[]
[]
[null,null,{"$f":"IF(Start!I9<>\"\",VLOOKUP(Start!I9,Data_LD!A4:W23,9,FALSE),\"\")","v":""}]
[]
[null,null,"Vom:",null,null,null,null,null,{"$f":"IF(Doku!Y34<>\"\",TEXT(Doku!Y34,\"TT.MM.JJJJ\"),\"\")","v":""},null,null,null,null,null,null,null,null,null,null,null,"bis:",null,null,null,null,null,{"$f":"IF(Doku!CC34<>\"\",TEXT(Doku!CC34,\"TT.MM.JJJJ\"),\"\")","v":""},null,null,null,null,null,null,null,null,null,null,null,null,null,null,"in:",null,null,null,{"$f":"CONCATENATE(Doku!BR18,\" \",Doku!BZ18,\", \",Doku!W18)","v":" , "}]
[]
[null,null,"Lehrgangs-Nr.:",null,null,null,null,null,null,null,null,null,null,null,null,null,null,null,{"$f":"IF(Start!I9<>\"\",Doku!Y26,\"\")","v":""},null,null,null,null,null,null,null,null,null,null,null,null,null,null,"Hinweis:",null,null,null,null,null,null,null,null,null,null,"Diese Liste wird nur zu DLRG-internen Zwecken benötigt!"]
[]
[null,null,"Unterschriften der Teilnehmer (Bestätigung der Teilnahme am Lehrgang)"]
[]
[null,null,"Lfd.\nNr.",null,null,null,null,null,"Nachname",null,null,null,null,null,null,null,null,null,null,null,null,null,null,null,null,null,null,null,null,null,null,null,null,null,null,null,"Vorname",null,null,null,null,null,null,null,null,null,null,null,null,null,null,null,null,null,null,null,null,null,null,null,null,null,null,"Tdb (*)",null,null,null,null,null,null,null,null,null,null,"Unterschrift"]
[null,null,null,null,null,null,null,null,null,null,null,null,null,null,null,null,null,null,null,null,null,null,null,null,null,null,null,null,null,null,null,null,null,null,null,null,null,null,null,null,null,null,null,null,null,null,null,null,null,null,null,null,null,null,null,null,null,null,null,null,null,null,null,"Ja",null,null,null,null,"Nein"]
[null,null,{"$f":"IF(I13<>\"\",1,\"\")","v":""},null,null,null,null,null,{"$f":"IF(Data_PD!B4<>\"\",Data_PD!B4,\"\")","v":""},null,null,null,null,null,null,null,null,null,null,null,null,null,null,null,null,null,null,null,null,null,null,null,null,null,null,null,{"$f":"IF(Data_PD!C4<>\"\",Data_PD!C4,\"\")","v":""}]
[null,null,null,null,null,null,null,null,null,null,null,null,null,null,null,null,null,null,null,null,null,null,null,null,null,null,null,null,null,null,null,null,null,null,null,null,null,null,null,null,null,null,null,null,null,null,null,null,null,null,null,null,null,null,null,null,null,null,null,null,null,null,null,null,{"$f":"IF(I13<>\"\",\"X\",\"\")","v":""}]
[]
[null,null,{"$f":"IF(I16<>\"\",2,\"\")","v":""},null,null,null,null,null,{"$f":"IF(Data_PD!B5<>\"\",Data_PD!B5,\"\")","v":""},null,null,null,null,null,null,null,null,null,null,null,null,null,null,null,null,null,null,null,null,null,null,null,null,null,null,null,{"$f":"IF(Data_PD!C5<>\"\",Data_PD!C5,\"\")","v":""}]
[null,null,null,null,null,null,null,null,null,null,null,null,null,null,null,null,null,null,null,null,null,null,null,null,null,null,null,null,null,null,null,null,null,null,null,null,null,null,null,null,null,null,null,null,null,null,null,null,null,null,null,null,null,null,null,null,null,null,null,null,null,null,null,null,{"$f":"IF(I16<>\"\",\"X\",\"\")","v":""}]
[]
[null,null,{"$f":"IF(I19<>\"\",3,\"\")","v":""},null,null,null,null,null,{"$f":"IF(Data_PD!B6<>\"\",Data_PD!B6,\"\")","v":""},null,null,null,null,null,null,null,null,null,null,null,null,null,null,null,null,null,null,null,null,null,null,null,null,null,null,null,{"$f":"IF(Data_PD!C6<>\"\",Data_PD!C6,\"\")","v":""}]
[null,null,null,null,null,null,null,null,null,null,null,null,null,null,null,null,null,null,null,null,null,null,null,null,null,null,null,null,null,null,null,null,null,null,null,null,null,null,null,null,null,null,null,null,null,null,null,null,null,null,null,null,null,null,null,null,null,null,null,null,null,null,null,null,{"$f":"IF(I19<>\"\",\"X\",\"\")","v":""}]
[]
[null,null,{"$f":"IF(I22<>\"\",4,\"\")","v":""},null,null,null,null,null,{"$f":"IF(Data_PD!B7<>\"\",Data_PD!B7,\"\")","v":""},null,null,null,null,null,null,null,null,null,null,null,null,null,null,null,null,null,null,null,null,null,null,null,null,null,null,null,{"$f":"IF(Data_PD!C7<>\"\",Data_PD!C7,\"\")","v":""}]
[null,null,null,null,null,null,null,null,null,null,null,null,null,null,null,null,null,null,null,null,null,null,null,null,null,null,null,null,null,null,null,null,null,null,null,null,null,null,null,null,null,null,null,null,null,null,null,null,null,null,null,null,null,null,null,null,null,null,null,null,null,null,null,null,{"$f":"IF(I22<>\"\",\"X\",\"\")","v":""}]
[]
[null,null,{"$f":"IF(I25<>\"\",5,\"\")","v":""},null,null,null,null,null,{"$f":"IF(Data_PD!B8<>\"\",Data_PD!B8,\"\")","v":""},null,null,null,null,null,null,null,null,null,null,null,null,null,null,null,null,null,null,null,null,null,null,null,null,null,null,null,{"$f":"IF(Data_PD!C8<>\"\",Data_PD!C8,\"\")","v":""}]
[null,null,null,null,null,null,null,null,null,null,null,null,null,null,null,null,null,null,null,null,null,null,null,null,null,null,null,null,null,null,null,null,null,null,null,null,null,null,null,null,null,null,null,null,null,null,null,null,null,null,null,null,null,null,null,null,null,null,null,null,null,null,null,null,{"$f":"IF(I25<>\"\",\"X\",\"\")","v":""}]
[]
[null,null,{"$f":"IF(I28<>\"\",6,\"\")","v":""},null,null,null,null,null,{"$f":"IF(Data_PD!B9<>\"\",Data_PD!B9,\"\")","v":""},null,null,null,null,null,null,null,null,null,null,null,null,null,null,null,null,null,null,null,null,null,null,null,null,null,null,null,{"$f":"IF(Data_PD!C9<>\"\",Data_PD!C9,\"\")","v":""}]
[null,null,null,null,null,null,null,null,null,null,null,null,null,null,null,null,null,null,null,null,null,null,null,null,null,null,null,null,null,null,null,null,null,null,null,null,null,null,null,null,null,null,null,null,null,null,null,null,null,null,null,null,null,null,null,null,null,null,null,null,null,null,null,null,{"$f":"IF(I28<>\"\",\"X\",\"\")","v":""}]
[]
[null,null,{"$f":"IF(I31<>\"\",7,\"\")","v":""},null,null,null,null,null,{"$f":"IF(Data_PD!B10<>\"\",Data_PD!B10,\"\")","v":""},null,null,null,null,null,null,null,null,null,null,null,null,null,null,null,null,null,null,null,null,null,null,null,null,null,null,null,{"$f":"IF(Data_PD!C10<>\"\",Data_PD!C10,\"\")","v":""}]
[null,null,null,null,null,null,null,null,null,null,null,null,null,null,null,null,null,null,null,null,null,null,null,null,null,null,null,null,null,null,null,null,null,null,null,null,null,null,null,null,null,null,null,null,null,null,null,null,null,null,null,null,null,null,null,null,null,null,null,null,null,null,null,null,{"$f":"IF(I31<>\"\",\"X\",\"\")","v":""}]
[]
[null,null,{"$f":"IF(I34<>\"\",8,\"\")","v":""},null,null,null,null,null,{"$f":"IF(Data_PD!B11<>\"\",Data_PD!B11,\"\")","v":""},null,null,null,null,null,null,null,null,null,null,null,null,null,null,null,null,null,null,null,null,null,null,null,null,null,null,null,{"$f":"IF(Data_PD!C11<>\"\",Data_PD!C11,\"\")","v":""}]
[null,null,null,null,null,null,null,null,null,null,null,null,null,null,null,null,null,null,null,null,null,null,null,null,null,null,null,null,null,null,null,null,null,null,null,null,null,null,null,null,null,null,null,null,null,null,null,null,null,null,null,null,null,null,null,null,null,null,null,null,null,null,null,null,{"$f":"IF(I34<>\"\",\"X\",\"\")","v":""}]
[]
[null,null,{"$f":"IF(I37<>\"\",9,\"\")","v":""},null,null,null,null,null,{"$f":"IF(Data_PD!B12<>\"\",Data_PD!B12,\"\")","v":""},null,null,null,null,null,null,null,null,null,null,null,null,null,null,null,null,null,null,null,null,null,null,null,null,null,null,null,{"$f":"IF(Data_PD!C12<>\"\",Data_PD!C12,\"\")","v":""}]
[null,null,null,null,null,null,null,null,null,null,null,null,null,null,null,null,null,null,null,null,null,null,null,null,null,null,null,null,null,null,null,null,null,null,null,null,null,null,null,null,null,null,null,null,null,null,null,null,null,null,null,null,null,null,null,null,null,null,null,null,null,null,null,null,{"$f":"IF(I37<>\"\",\"X\",\"\")","v":""}]
[]
[null,null,{"$f":"IF(I40<>\"\",10,\"\")","v":""},null,null,null,null,null,{"$f":"IF(Data_PD!B13<>\"\",Data_PD!B13,\"\")","v":""},null,null,null,null,null,null,null,null,null,null,null,null,null,null,null,null,null,null,null,null,null,null,null,null,null,null,null,{"$f":"IF(Data_PD!C13<>\"\",Data_PD!C13,\"\")","v":""}]
[null,null,null,null,null,null,null,null,null,null,null,null,null,null,null,null,null,null,null,null,null,null,null,null,null,null,null,null,null,null,null,null,null,null,null,null,null,null,null,null,null,null,null,null,null,null,null,null,null,null,null,null,null,null,null,null,null,null,null,null,null,null,null,null,{"$f":"IF(I40<>\"\",\"X\",\"\")","v":""}]
[]
[null,null,{"$f":"IF(I43<>\"\",11,\"\")","v":""},null,null,null,null,null,{"$f":"IF(Data_PD!B14<>\"\",Data_PD!B14,\"\")","v":""},null,null,null,null,null,null,null,null,null,null,null,null,null,null,null,null,null,null,null,null,null,null,null,null,null,null,null,{"$f":"IF(Data_PD!C14<>\"\",Data_PD!C14,\"\")","v":""}]
[null,null,null,null,null,null,null,null,null,null,null,null,null,null,null,null,null,null,null,null,null,null,null,null,null,null,null,null,null,null,null,null,null,null,null,null,null,null,null,null,null,null,null,null,null,null,null,null,null,null,null,null,null,null,null,null,null,null,null,null,null,null,null,null,{"$f":"IF(I43<>\"\",\"X\",\"\")","v":""}]
[]
[null,null,{"$f":"IF(I46<>\"\",12,\"\")","v":""},null,null,null,null,null,{"$f":"IF(Data_PD!B15<>\"\",Data_PD!B15,\"\")","v":""},null,null,null,null,null,null,null,null,null,null,null,null,null,null,null,null,null,null,null,null,null,null,null,null,null,null,null,{"$f":"IF(Data_PD!C15<>\"\",Data_PD!C15,\"\")","v":""}]
[null,null,null,null,null,null,null,null,null,null,null,null,null,null,null,null,null,null,null,null,null,null,null,null,null,null,null,null,null,null,null,null,null,null,null,null,null,null,null,null,null,null,null,null,null,null,null,null,null,null,null,null,null,null,null,null,null,null,null,null,null,null,null,null,{"$f":"IF(I46<>\"\",\"X\",\"\")","v":""}]
[]
[null,null,{"$f":"IF(I49<>\"\",13,\"\")","v":""},null,null,null,null,null,{"$f":"IF(Data_PD!B16<>\"\",Data_PD!B16,\"\")","v":""},null,null,null,null,null,null,null,null,null,null,null,null,null,null,null,null,null,null,null,null,null,null,null,null,null,null,null,{"$f":"IF(Data_PD!C16<>\"\",Data_PD!C16,\"\")","v":""}]
[null,null,null,null,null,null,null,null,null,null,null,null,null,null,null,null,null,null,null,null,null,null,null,null,null,null,null,null,null,null,null,null,null,null,null,null,null,null,null,null,null,null,null,null,null,null,null,null,null,null,null,null,null,null,null,null,null,null,null,null,null,null,null,null,{"$f":"IF(I49<>\"\",\"X\",\"\")","v":""}]
[]
[null,null,{"$f":"IF(I52<>\"\",14,\"\")","v":""},null,null,null,null,null,{"$f":"IF(Data_PD!B17<>\"\",Data_PD!B17,\"\")","v":""},null,null,null,null,null,null,null,null,null,null,null,null,null,null,null,null,null,null,null,null,null,null,null,null,null,null,null,{"$f":"IF(Data_PD!C17<>\"\",Data_PD!C17,\"\")","v":""}]
[null,null,null,null,null,null,null,null,null,null,null,null,null,null,null,null,null,null,null,null,null,null,null,null,null,null,null,null,null,null,null,null,null,null,null,null,null,null,null,null,null,null,null,null,null,null,null,null,null,null,null,null,null,null,null,null,null,null,null,null,null,null,null,null,{"$f":"IF(I52<>\"\",\"X\",\"\")","v":""}]
[]
[null,null,{"$f":"IF(I55<>\"\",15,\"\")","v":""},null,null,null,null,null,{"$f":"IF(Data_PD!B18<>\"\",Data_PD!B18,\"\")","v":""},null,null,null,null,null,null,null,null,null,null,null,null,null,null,null,null,null,null,null,null,null,null,null,null,null,null,null,{"$f":"IF(Data_PD!C18<>\"\",Data_PD!C18,\"\")","v":""}]
[null,null,null,null,null,null,null,null,null,null,null,null,null,null,null,null,null,null,null,null,null,null,null,null,null,null,null,null,null,null,null,null,null,null,null,null,null,null,null,null,null,null,null,null,null,null,null,null,null,null,null,null,null,null,null,null,null,null,null,null,null,null,null,null,{"$f":"IF(I55<>\"\",\"X\",\"\")","v":""}]
[]
[null,null,{"$f":"IF(I58<>\"\",16,\"\")","v":""},null,null,null,null,null,{"$f":"IF(Data_PD!B19<>\"\",Data_PD!B19,\"\")","v":""},null,null,null,null,null,null,null,null,null,null,null,null,null,null,null,null,null,null,null,null,null,null,null,null,null,null,null,{"$f":"IF(Data_PD!C19<>\"\",Data_PD!C19,\"\")","v":""}]
[null,null,null,null,null,null,null,null,null,null,null,null,null,null,null,null,null,null,null,null,null,null,null,null,null,null,null,null,null,null,null,null,null,null,null,null,null,null,null,null,null,null,null,null,null,null,null,null,null,null,null,null,null,null,null,null,null,null,null,null,null,null,null,null,{"$f":"IF(I58<>\"\",\"X\",\"\")","v":""}]
[]
[null,null,{"$f":"IF(I61<>\"\",17,\"\")","v":""},null,null,null,null,null,{"$f":"IF(Data_PD!B20<>\"\",Data_PD!B20,\"\")","v":""},null,null,null,null,null,null,null,null,null,null,null,null,null,null,null,null,null,null,null,null,null,null,null,null,null,null,null,{"$f":"IF(Data_PD!C20<>\"\",Data_PD!C20,\"\")","v":""}]
[null,null,null,null,null,null,null,null,null,null,null,null,null,null,null,null,null,null,null,null,null,null,null,null,null,null,null,null,null,null,null,null,null,null,null,null,null,null,null,null,null,null,null,null,null,null,null,null,null,null,null,null,null,null,null,null,null,null,null,null,null,null,null,null,{"$f":"IF(I61<>\"\",\"X\",\"\")","v":""}]
[]
[null,null,{"$f":"IF(I64<>\"\",18,\"\")","v":""},null,null,null,null,null,{"$f":"IF(Data_PD!B21<>\"\",Data_PD!B21,\"\")","v":""},null,null,null,null,null,null,null,null,null,null,null,null,null,null,null,null,null,null,null,null,null,null,null,null,null,null,null,{"$f":"IF(Data_PD!C21<>\"\",Data_PD!C21,\"\")","v":""}]
[null,null,null,null,null,null,null,null,null,null,null,null,null,null,null,null,null,null,null,null,null,null,null,null,null,null,null,null,null,null,null,null,null,null,null,null,null,null,null,null,null,null,null,null,null,null,null,null,null,null,null,null,null,null,null,null,null,null,null,null,null,null,null,null,{"$f":"IF(I64<>\"\",\"X\",\"\")","v":""}]
[]
[null,null,{"$f":"IF(I67<>\"\",19,\"\")","v":""},null,null,null,null,null,{"$f":"IF(Data_PD!B22<>\"\",Data_PD!B22,\"\")","v":""},null,null,null,null,null,null,null,null,null,null,null,null,null,null,null,null,null,null,null,null,null,null,null,null,null,null,null,{"$f":"IF(Data_PD!C22<>\"\",Data_PD!C22,\"\")","v":""}]
[null,null,null,null,null,null,null,null,null,null,null,null,null,null,null,null,null,null,null,null,null,null,null,null,null,null,null,null,null,null,null,null,null,null,null,null,null,null,null,null,null,null,null,null,null,null,null,null,null,null,null,null,null,null,null,null,null,null,null,null,null,null,null,null,{"$f":"IF(I67<>\"\",\"X\",\"\")","v":""}]
[]
[null,null,{"$f":"IF(I70<>\"\",20,\"\")","v":""},null,null,null,null,null,{"$f":"IF(Data_PD!B21<>\"\",Data_PD!B21,\"\")","v":""},null,null,null,null,null,null,null,null,null,null,null,null,null,null,null,null,null,null,null,null,null,null,null,null,null,null,null,{"$f":"IF(Data_PD!C23<>\"\",Data_PD!C23,\"\")","v":""}]
[null,null,null,null,null,null,null,null,null,null,null,null,null,null,null,null,null,null,null,null,null,null,null,null,null,null,null,null,null,null,null,null,null,null,null,null,null,null,null,null,null,null,null,null,null,null,null,null,null,null,null,null,null,null,null,null,null,null,null,null,null,null,null,null,{"$f":"IF(I70<>\"\",\"X\",\"\")","v":""}]
[]
[null,null,"(*) Tdb = Teilnehmerdatenblatt ausgefüllt?"]
[]
[]
[null,null,{"$f":"IF(Doku!Y34<>\"\",CONCATENATE(Doku!BZ10,\", \",TEXT(Doku!Y34,\"TT.MM.JJJJ\"),\"\"))","v":false}]
[null,null,"Ort, Datum",null,null,null,null,null,null,null,null,null,null,null,null,null,null,null,null,null,null,null,null,null,null,null,null,null,null,null,null,null,null,null,null,null,null,null,null,null,null,null,null,null,null,null,null,null,null,null,null,null,null,null,null,null,null,null,null,null,null,null,null,null,null,null,null,null,null,null,"Stempel | Unterschrift der Lehrgangsleitung"]
[null,null,{"$f":"CONCATENATE(Doku!$W$8,\" • \",Doku!$BZ$8,\" • \",Doku!$W$10,\" • \",Doku!$BR$10,\" \",Doku!$BZ$10)","v":" • Leitung Medizin •  •  "}]
[null,null,null,null,null,"dlrg.de"]

{"sheet":"D_H_A","index":6,"n_rows":87,"n_cols":34,"rows_kept":87,"cut":false,"hidden":true,"merged":[[17,2,17,4],[18,2,18,4],[19,2,19,4],[20,2,20,4],[34,2,34,4],[35,2,35,4],[36,2,36,4],[37,2,37,4],[38,2,38,4],[21,2,21,4],[22,2,22,4],[23,2,23,4],[24,2,24,4],[25,2,25,4],[26,2,26,4],[27,2,27,4],[28,2,28,4],[29,2,29,4],[30,2,30,4],[31,2,31,4],[32,2,32,4],[33,2,33,4],[3,33,3,35],[4,5,4,29],[5,5,5,29],[18,5,18,8],[18,9,18,29],[6,5,6,29],[7,5,7,29],[8,5,8,29],[9,5,9,29],[10,5,10,29],[11,5,11,29],[1,3,1,29],[2,5,2,29],[3,5,3,29],[2,2,2,4],[3,2,3,4],[4,2,4,4],[5,2,5,4],[6,2,6,4],[7,2,7,4],[8,2,8,4],[9,2,9,4],[10,2,10,4],[11,2,11,4],[19,5,19,29],[25,5,25,29],[22,5,22,29],[23,5,23,29],[12,5,12,29],[13,5,13,29],[14,5,14,29],[15,5,15,29],[16,5,16,29],[17,5,17,29],[20,5,20,29],[21,5,21,8],[21,9,21,29],[24,5,24,11],[24,12,24,29],[12,2,12,4],[13,2,13,4],[14,2,14,4],[15,2,15,4],[16,2,16,4],[28,5,28,29],[27,5,27,29],[35,5,35,14],[35,15,35,19],[35,20,35,29],[34,5,34,14],[34,15,34,19],[34,20,34,29],[36,5,36,29],[32,5,32,14],[33,5,33,14],[33,15,33,19],[32,20,32,29],[33,20,33,29],[29,5,29,29],[30,5,30,29],[31,5,31,29],[37,5,37,29],[38,5,38,29],[39,5,39,29],[40,2,87,2],[40,3,40,27],[40,28,40,30],[41,3,42,27],[41,28,41,30],[42,28,42,30],[47,3,47,27],[47,28,47,30],[48,3,48,27],[48,28,48,30],[49,3,49,27],[49,28,49,30],[43,3,43,27],[43,28,43,30],[44,3,44,27],[44,28,44,30],[45,3,45,27],[46,3,46,27],[46,28,46,30],[53,3,53,27],[53,28,53,30],[54,3,54,27],[54,28,54,30],[55,3,55,27],[55,28,55,30],[50,3,50,27],[50,28,50,30],[51,3,51,27],[51,28,51,30],[52,3,52,27],[52,28,52,30],[59,3,60,27],[59,28,59,30],[60,28,60,30],[61,3,61,27],[62,3,62,27],[62,28,62,30],[56,3,56,27],[56,28,56,30],[57,3,57,27],[57,28,57,30],[58,3,58,27],[58,28,58,30],[66,3,66,27],[66,28,66,30],[67,3,67,27],[67,28,67,30],[68,3,68,27],[68,28,68,30],[63,3,63,27],[63,28,63,30],[64,3,64,27],[64,28,64,30],[65,3,65,27],[65,28,65,30],[72,3,72,27],[72,28,72,30],[73,3,73,27],[73,28,73,30],[74,3,74,27],[74,28,74,30],[69,3,69,27],[69,28,69,30],[70,3,70,27],[70,28,70,30],[71,3,71,27],[71,28,71,30],[78,3,78,27],[78,28,78,30],[79,3,79,27],[79,28,79,30],[80,3,80,27],[80,28,80,30],[75,3,75,27],[75,28,75,30],[76,3,76,27],[76,28,76,30],[77,3,77,27],[77,28,77,30],[84,3,85,27],[84,28,84,30],[85,28,85,30],[86,3,86,27],[86,28,86,30],[87,3,87,27],[87,28,87,30],[81,3,81,27],[81,28,81,30],[82,3,82,27],[82,28,82,30],[83,3,83,27],[83,28,83,30]]}
[{"$f":"IF(Data_PD!A4<>\"\",Data_PD!A4,0)","v":0},null,null,null,null,null,null,null,null,null,null,null,null,null,null,null,null,null,null,null,null,null,null,null,null,null,null,null,null,null,null,null,{"$f":"IF(OR(Data_LD!B24=1,Data_LD!B24=2,Data_LD!B24=3,Data_LD!B24=5,Data_LD!B24=7,Data_LD!B24=8,Data_LD!B24=9,Data_LD!B24=10,Data_LD!B24=12,Data_LD!B24=13,Data_LD!B24=15,Data_LD!B24=16,Data_LD!B24=18),Data_LD!B24,0)","v":0}]
[{"$f":"IF(Data_PD!A5<>\"\",Data_PD!A5,0)","v":0}]
[{"$f":"IF(Data_PD!A6<>\"\",Data_PD!A6,0)","v":0}]
[{"$f":"IF(Data_PD!A7<>\"\",Data_PD!A7,0)","v":0},null,null,null,null,{"$f":"IF(AG1<>0,VLOOKUP(AG4,Data_UR!A56:AS59,3,FALSE),\"\")","v":""},null,null,null,null,null,null,null,null,null,null,null,null,null,null,null,null,null,null,null,null,null,null,null,null,null,null,3,"  Lfd-Nr. für den Einzekdruck\n  Nummer aus der Teilnehmerliste"]
[{"$f":"IF(Data_PD!A8<>\"\",Data_PD!A8,0)","v":0}]
[{"$f":"IF(Data_PD!A9<>\"\",Data_PD!A9,0)","v":0}]
[{"$f":"IF(Data_PD!A10<>\"\",Data_PD!A10,0)","v":0},null,null,null,null,{"$f":"IF(AG1<>0,CONCATENATE(VLOOKUP(AG4,Data_UR!A56:AS59,4,FALSE)),\"\")","v":""}]
[{"$f":"IF(Data_PD!A11<>\"\",Data_PD!A11,0)","v":0}]
[{"$f":"IF(Data_PD!A12<>\"\",Data_PD!A12,0)","v":0},null,null,null,null,{"$f":"IF(AG1<>0,CONCATENATE(VLOOKUP(AG4,Data_UR!A56:AS59,5,FALSE)),\"\")","v":""}]
[{"$f":"IF(Data_PD!A13<>\"\",Data_PD!A13,0)","v":0}]
[{"$f":"IF(Data_PD!A14<>\"\",Data_PD!A14,0)","v":0},null,null,null,null,{"$f":"IF(AG1<>0,CONCATENATE(VLOOKUP(AG4,Data_UR!A56:AS59,6,FALSE)),\"\")","v":""}]
[{"$f":"IF(Data_PD!A15<>\"\",Data_PD!A15,0)","v":0},null,null,null,null,{"$f":"IF(AG1<>0,CONCATENATE(VLOOKUP(AG4,Data_UR!A56:AS59,7,FALSE)),\"\")","v":""}]
[{"$f":"IF(Data_PD!A16<>\"\",Data_PD!A16,0)","v":0}]
[{"$f":"IF(Data_PD!A17<>\"\",Data_PD!A17,0)","v":0},null,null,null,null,{"$f":"CONCATENATE(\"vom \",TEXT(Doku!Y34,\"TT.MM.JJJJ\"),\" bis \",TEXT(Doku!CC34,\"TT.MM.JJJJ\"),\" in \",Doku!BZ18)","v":"vom 00.01.1900 bis 00.01.1900 in "}]
[{"$f":"IF(Data_PD!A18<>\"\",Data_PD!A18,0)","v":0}]
[{"$f":"IF(Data_PD!A19<>\"\",Data_PD!A19,0)","v":0},null,null,null,null,{"$f":"CONCATENATE(\"für den \",Start!K14)","v":"für den "}]
[{"$f":"IF(Data_PD!A20<>\"\",Data_PD!A20,0)","v":0}]
[{"$f":"IF(Data_PD!A21<>\"\",Data_PD!A21,0)","v":0}]
[{"$f":"IF(Data_PD!A22<>\"\",Data_PD!A22,0)","v":0},null,null,null,null,{"$f":"IF(AG1<>0,\"Inhalte:\",\"\")","v":""}]
[{"$f":"IF(Data_PD!A23<>\"\",Data_PD!A23,0)","v":0},null,null,null,null,{"$f":"IF(AG1<>0,\"Gemäß den Ausbildungsvorschriften der DLRG\",\"\")","v":""}]
[]
[null,null,null,null,null,{"$f":"IF(AG1<>0,\"Umfang:\",\"\")","v":""},null,null,null,{"$f":"IF(AG1<>0,CONCATENATE(VLOOKUP(AG4,Data_UR!A56:AS59,10,FALSE)),\"\")","v":""}]
[null,null,null,null,null,{"$f":"IF(AG1<>0,CONCATENATE(VLOOKUP(AG4,Data_UR!A56:AS59,9,FALSE)),\"\")","v":""}]
[]
[null,null,null,null,null,{"$f":"IF(AG1<>0,\"Lehrgangsform:\",\"\")","v":""}]
[null,null,null,null,null,{"$f":"IF(AG1<>0,CONCATENATE(VLOOKUP(AG4,Data_UR!A56:AS59,11,FALSE),\" – \",Data_UR!$L$55,VLOOKUP(AG4,Data_UR!A56:AS59,12,FALSE)),\"\")","v":""}]
[]
[]
[null,null,null,null,null,{"$f":"IF(AG1<>0,CONCATENATE(VLOOKUP(AG4,Data_UR!A56:AS59,13,FALSE)),\"\")","v":""}]
[]
[]
[]
[]
[]
[]
[null,null,null,null,null,{"$f":"IF(AG1<>0,\"Unterschrift Lehrgangsleitung\",\"\")","v":""},null,null,null,null,null,null,null,null,null,null,null,null,null,null,{"$f":"IF(AG1<>0,\"Unterschrift Landesverband\",\"\")","v":""}]
[]
[]
[]
[]
[]
[null,null,null,{"$f":"IF($AG$1<>0,VLOOKUP($AG$1,Data_UR!$A$30:$AS$49,7,FALSE),\"\")","v":""}]
[]
[]
[null,null,null,"Voraussetzungen (gesonderte Nachweise)"]
[]
[null,null,null,{"$f":"IF($AG$1<>0,VLOOKUP($AG$1,Data_UR!$A$30:$AQ$49,9,FALSE),\"\")","v":""}]
[null,null,null,{"$f":"IF($AG$1<>0,VLOOKUP($AG$1,Data_UR!$A$30:$AQ$49,10,FALSE),\"\")","v":""}]
[null,null,null,{"$f":"IF($AG$1<>0,VLOOKUP($AG$1,Data_UR!$A$30:$AQ$49,11,FALSE),\"\")","v":""}]
[null,null,null,{"$f":"IF($AG$1<>0,VLOOKUP($AG$1,Data_UR!$A$30:$AQ$49,12,FALSE),\"\")","v":""}]
[null,null,null,{"$f":"IF($AG$1<>0,VLOOKUP($AG$1,Data_UR!$A$30:$AQ$49,13,FALSE),\"\")","v":""}]
[null,null,null,{"$f":"IF($AG$1<>0,VLOOKUP($AG$1,Data_UR!$A$30:$AQ$49,14,FALSE),\"\")","v":""}]
[null,null,null,{"$f":"IF($AG$1<>0,VLOOKUP($AG$1,Data_UR!$A$30:$AQ$49,15,FALSE),\"\")","v":""}]
[null,null,null,{"$f":"IF($AG$1<>0,VLOOKUP($AG$1,Data_UR!$A$30:$AQ$49,16,FALSE),\"\")","v":""}]
[null,null,null,{"$f":"IF($AG$1<>0,VLOOKUP($AG$1,Data_UR!$A$30:$AQ$49,17,FALSE),\"\")","v":""}]
[null,null,null,{"$f":"IF($AG$1<>0,VLOOKUP($AG$1,Data_UR!$A$30:$AQ$49,18,FALSE),\"\")","v":""}]
[null,null,null,{"$f":"IF($AG$1<>0,VLOOKUP($AG$1,Data_UR!$A$30:$AQ$49,19,FALSE),\"\")","v":""}]
[null,null,null,{"$f":"IF($AG$1<>0,VLOOKUP($AG$1,Data_UR!$A$30:$AQ$49,20,FALSE),\"\")","v":""}]
[]
[null,null,null,{"$f":"IF($AG$1<>0,VLOOKUP($AG$1,Data_UR!$A$30:$AQ$49,22,FALSE),\"\")","v":""}]
[]
[]
[null,null,null,{"$f":"IF($AG$1<>0,VLOOKUP($AG$1,Data_UR!$A$30:$AQ$49,23,FALSE),\"\")","v":""}]
[null,null,null,{"$f":"IF($AG$1<>0,VLOOKUP($AG$1,Data_UR!$A$30:$AQ$49,24,FALSE),\"\")","v":""}]
[null,null,null,{"$f":"IF($AG$1<>0,VLOOKUP($AG$1,Data_UR!$A$30:$AQ$49,25,FALSE),\"\")","v":""}]
[null,null,null,{"$f":"IF($AG$1<>0,VLOOKUP($AG$1,Data_UR!$A$30:$AQ$49,26,FALSE),\"\")","v":""}]
[null,null,null,{"$f":"IF($AG$1<>0,VLOOKUP($AG$1,Data_UR!$A$30:$AQ$49,27,FALSE),\"\")","v":""}]
[null,null,null,{"$f":"IF($AG$1<>0,VLOOKUP($AG$1,Data_UR!$A$30:$AQ$49,28,FALSE),\"\")","v":""}]
[null,null,null,{"$f":"IF($AG$1<>0,VLOOKUP($AG$1,Data_UR!$A$30:$AQ$49,29,FALSE),\"\")","v":""}]
[null,null,null,{"$f":"IF($AG$1<>0,VLOOKUP($AG$1,Data_UR!$A$30:$AQ$49,30,FALSE),\"\")","v":""}]
[null,null,null,{"$f":"IF($AG$1<>0,VLOOKUP($AG$1,Data_UR!$A$30:$AQ$49,31,FALSE),\"\")","v":""}]
[null,null,null,{"$f":"IF($AG$1<>0,VLOOKUP($AG$1,Data_UR!$A$30:$AQ$49,32,FALSE),\"\")","v":""}]
[null,null,null,{"$f":"IF($AG$1<>0,VLOOKUP($AG$1,Data_UR!$A$30:$AQ$49,33,FALSE),\"\")","v":""}]
[null,null,null,{"$f":"IF($AG$1<>0,VLOOKUP($AG$1,Data_UR!$A$30:$AQ$49,34,FALSE),\"\")","v":""}]
[null,null,null,{"$f":"IF($AG$1<>0,VLOOKUP($AG$1,Data_UR!$A$30:$AQ$49,35,FALSE),\"\")","v":""}]
[null,null,null,{"$f":"IF($AG$1<>0,VLOOKUP($AG$1,Data_UR!$A$30:$AQ$49,36,FALSE),\"\")","v":""}]
[null,null,null,{"$f":"IF($AG$1<>0,VLOOKUP($AG$1,Data_UR!$A$30:$AQ$49,37,FALSE),\"\")","v":""}]
[null,null,null,{"$f":"IF($AG$1<>0,VLOOKUP($AG$1,Data_UR!$A$30:$AQ$49,38,FALSE),\"\")","v":""}]
[null,null,null,{"$f":"IF($AG$1<>0,VLOOKUP($AG$1,Data_UR!$A$30:$AQ$49,39,FALSE),\"\")","v":""}]
[null,null,null,{"$f":"IF($AG$1<>0,VLOOKUP($AG$1,Data_UR!$A$30:$AQ$49,40,FALSE),\"\")","v":""}]
[null,null,null,{"$f":"IF($AG$1<>0,VLOOKUP($AG$1,Data_UR!$A$30:$AQ$49,41,FALSE),\"\")","v":""}]
[null,null,null,{"$f":"IF($AG$1<>0,VLOOKUP($AG$1,Data_UR!$A$30:$AQ$49,42,FALSE),\"\")","v":""}]
[]
[]
[null,null,null,{"$f":"IF($AG$1<>0,VLOOKUP($AG$1,Data_UR!$A$30:$AQ$49,43,FALSE),\"\")","v":""}]
[]
[null,null,null,{"$f":"IF(AG1<>0,CONCATENATE(Doku!$W$8,\" • \",Doku!$W$10,\" • \",Doku!$BR$10,\" \",Doku!$BZ$10),\"\")","v":""}]

{"sheet":"Urkunde_1","index":7,"n_rows":87,"n_cols":34,"rows_kept":87,"cut":false,"hidden":true,"merged":[[84,3,85,27],[86,3,86,27],[44,3,44,27],[62,3,62,27],[63,3,63,27],[64,3,64,27],[65,3,65,27],[66,3,66,27],[67,3,67,27],[68,3,68,27],[69,3,69,27],[45,3,45,27],[61,3,61,27],[54,3,54,27],[55,3,55,27],[56,3,56,27],[57,3,57,27],[70,3,70,27],[58,3,58,27],[59,3,60,27],[73,3,73,27],[74,3,74,27],[75,3,75,27],[76,3,76,27],[42,2,87,2],[42,3,42,27],[43,3,43,27],[47,3,47,27],[82,3,82,27],[83,3,83,27],[51,28,51,30],[52,28,52,30],[82,28,82,30],[83,28,83,30],[84,28,84,30],[85,28,85,30],[86,28,86,30],[87,28,87,30],[80,28,80,30],[81,28,81,30],[78,28,78,30],[79,28,79,30],[64,28,64,30],[65,28,65,30],[79,3,79,27],[80,3,80,27],[81,3,81,27],[87,3,87,27],[66,28,66,30],[75,28,75,30],[76,28,76,30],[77,28,77,30],[73,28,73,30],[74,28,74,30],[67,28,67,30],[68,28,68,30],[69,28,69,30],[70,28,70,30],[71,28,71,30],[72,28,72,30],[59,28,59,30],[60,28,60,30],[62,28,62,30],[63,28,63,30],[42,28,42,30],[43,28,43,30],[44,28,44,30],[46,28,46,30],[47,28,47,30],[48,28,48,30],[49,28,49,30],[50,28,50,30],[54,28,54,30],[55,28,55,30],[56,28,56,30],[57,28,57,30],[27,25,27,29],[26,20,26,24],[27,20,27,24],[26,5,26,19],[27,5,27,19],[36,5,36,29],[37,5,37,29],[53,28,53,30],[58,28,58,30],[38,5,38,29],[39,5,39,29],[40,5,40,29],[41,5,41,29],[34,5,34,14],[35,5,35,14],[35,15,35,19],[35,20,35,29],[34,15,34,19],[34,20,34,29],[13,5,13,29],[14,5,14,29],[15,5,15,29],[16,5,16,29],[6,5,6,29],[33,20,33,29],[28,5,28,29],[31,5,31,16],[30,5,30,16],[29,5,29,16],[29,18,29,29],[30,18,30,29],[31,18,31,29],[33,5,33,19],[18,5,18,29],[19,5,19,29],[20,5,20,29],[21,5,21,29],[22,5,22,29],[32,5,32,29],[23,5,23,29],[24,5,24,29],[25,5,25,29],[26,25,26,29],[3,33,3,35],[1,3,1,29],[77,3,77,27],[78,3,78,27],[46,3,46,27],[48,3,48,27],[49,3,49,27],[50,3,50,27],[51,3,51,27],[52,3,52,27],[53,3,53,27],[71,3,71,27],[72,3,72,27],[2,5,2,29],[3,5,3,29],[4,5,4,29],[5,5,5,29],[7,5,7,29],[8,5,8,29],[9,5,9,29],[10,5,10,29],[17,5,17,29],[11,5,11,29],[12,5,12,29]]}
[{"$f":"IF(Data_PD!A4<>\"\",Data_PD!A4,0)","v":0},null,null,null,null,null,null,null,null,null,null,null,null,null,null,null,null,null,null,null,null,null,null,null,null,null,null,null,null,null,null,null,{"$f":"IF(OR(Data_LD!B24=12,Data_LD!B24=13,Data_LD!B24=15,Data_LD!B24=16),Data_LD!B24,0)","v":0}]
[{"$f":"IF(Data_PD!A5<>\"\",Data_PD!A5,0)","v":0}]
[{"$f":"IF(Data_PD!A6<>\"\",Data_PD!A6,0)","v":0}]
[{"$f":"IF(Data_PD!A7<>\"\",Data_PD!A7,0)","v":0},null,null,null,null,{"$f":"IF($AG$1<>0,VLOOKUP($AG$1,Data_UR!$A$4:$AO$23,3,FALSE),\"\")","v":""},null,null,null,null,null,null,null,null,null,null,null,null,null,null,null,null,null,null,null,null,null,null,null,null,null,null,1,"  Lfd-Nr. für den Einzeldruck\n  Nummer aus der Teilnehmerliste"]
[{"$f":"IF(Data_PD!A8<>\"\",Data_PD!A8,0)","v":0}]
[{"$f":"IF(Data_PD!A9<>\"\",Data_PD!A9,0)","v":0},null,null,null,null,{"$f":"IF($AG$1<>0,VLOOKUP($AG$1,Data_UR!$A$4:$AO$23,4,FALSE),\"\")","v":""}]
[{"$f":"IF(Data_PD!A10<>\"\",Data_PD!A10,0)","v":0},null,null,null,null,{"$f":"IF($AG$1<>0,VLOOKUP($AG$1,Data_UR!$A$30:$AQ$49,5,FALSE),\"\")","v":""}]
[{"$f":"IF(Data_PD!A11<>\"\",Data_PD!A11,0)","v":0}]
[{"$f":"IF(Data_PD!A12<>\"\",Data_PD!A12,0)","v":0},null,null,null,null,{"$f":"IF($AG$1<>0,IF(AG4<>\"\",VLOOKUP($AG$1,Data_UR!$A$4:$AO$23,6,FALSE),\"\"),\"\")","v":""}]
[{"$f":"IF(Data_PD!A13<>\"\",Data_PD!A13,0)","v":0}]
[{"$f":"IF(Data_PD!A14<>\"\",Data_PD!A14,0)","v":0},null,null,null,null,{"$f":"IF(AG1<>0,IF(AG4<>\"\",VLOOKUP(AG4,Data_PD!A4:U23,2,FALSE),\"\"),\"\")","v":""}]
[{"$f":"IF(Data_PD!A15<>\"\",Data_PD!A15,0)","v":0},null,null,null,null,{"$f":"IF(AG1<>0,\"Nachname\",\"\")","v":""}]
[{"$f":"IF(Data_PD!A16<>\"\",Data_PD!A16,0)","v":0}]
[{"$f":"IF(Data_PD!A17<>\"\",Data_PD!A17,0)","v":0},null,null,null,null,{"$f":"IF(AG1<>0,IF(AG4<>\"\",VLOOKUP(AG4,Data_PD!A4:U23,3,FALSE),\"\"),\"\")","v":""}]
[{"$f":"IF(Data_PD!A18<>\"\",Data_PD!A18,0)","v":0},null,null,null,null,{"$f":"IF(AG1<>0,\"Vorname\",\"\")","v":""}]
[{"$f":"IF(Data_PD!A19<>\"\",Data_PD!A19,0)","v":0}]
[{"$f":"IF(Data_PD!A20<>\"\",Data_PD!A20,0)","v":0},null,null,null,null,{"$f":"IF(AG1<>0,IF(AG4<>\"\",VLOOKUP(AG4,Data_PD!A4:U23,5,FALSE),\"\"),\"\")","v":""}]
[{"$f":"IF(Data_PD!A21<>\"\",Data_PD!A21,0)","v":0},null,null,null,null,{"$f":"IF(AG1<>0,\"Geburtsdatum\",\"\")","v":""}]
[{"$f":"IF(Data_PD!A22<>\"\",Data_PD!A22,0)","v":0}]
[{"$f":"IF(Data_PD!A23<>\"\",Data_PD!A23,0)","v":0},null,null,null,null,{"$f":"IF($AG$1<>0,VLOOKUP($AG$1,Data_UR!$A$4:$AO$23,8,FALSE),\"\")","v":""}]
[null,null,null,null,null,{"$f":"IF($AG$1<>0,VLOOKUP($AG$1,Data_UR!$A$4:$AO$23,9,FALSE),\"\")","v":""}]
[null,null,null,null,null,{"$f":"IF($AG$1<>0,VLOOKUP($AG$1,Data_UR!$A$4:$AO$23,10,FALSE),\"\")","v":""}]
[null,null,null,null,null,{"$f":"IF($AG$1<>0,VLOOKUP($AG$1,Data_UR!$A$4:$AO$23,11,FALSE),\"\")","v":""}]
[null,null,null,null,null,{"$f":"IF($AG$1<>0,VLOOKUP($AG$1,Data_UR!$A$4:$AO$23,12,FALSE),\"\")","v":""}]
[null,null,null,null,null,{"$f":"IF($AG$1<>0,VLOOKUP($AG$1,Data_UR!$A$4:$AO$23,13,FALSE),\"\")","v":""}]
[]
[null,null,null,null,null,{"$f":"IF(AG1<>0,IF(Doku!BZ18<>\"\",CONCATENATE(Doku!BR18,\" \",Doku!BZ18),\"\"),\"\")","v":""},null,null,null,null,null,null,null,null,null,null,null,null,null,null,{"$f":"IF(AG1<>0,IF(Doku!Y34<>\"\",Doku!Y34,\"\"),\"\")","v":""},null,null,null,null,{"$f":"IF(AG1<>0,IF(Doku!CC34<>\"\",Doku!CC34,\"\"),\"\")","v":""}]
[null,null,null,null,null,{"$f":"IF($AG$1<>0,VLOOKUP($AG$1,Data_UR!$A$4:$AO$23,14,FALSE),\"\")","v":""},null,null,null,null,null,null,null,null,null,null,null,null,null,null,{"$f":"IF($AG$1<>0,VLOOKUP($AG$1,Data_UR!$A$4:$AO$23,15,FALSE),\"\")","v":""},null,null,null,null,{"$f":"IF($AG$1<>0,VLOOKUP($AG$1,Data_UR!$A$4:$AO$23,16,FALSE),\"\")","v":""}]
[]
[null,null,null,null,null,{"$f":"IF(AG1<>0,IF(Doku!Y28<>\"\",Doku!Y28,\"\"),\"\")","v":""}]
[null,null,null,null,null,{"$f":"IF(AG1<>0,IF(Doku!CC28<>\"\",Doku!CC28,\"\"),\"\")","v":""}]
[null,null,null,null,null,{"$f":"IF($AG$1<>0,VLOOKUP($AG$1,Data_UR!$A$4:$AO$23,17,FALSE),\"\")","v":""},null,null,null,null,null,null,null,null,null,null,null,null,{"$f":"IF($AG$1<>0,VLOOKUP($AG$1,Data_UR!$A$4:$AO$23,18,FALSE),\"\")","v":""}]
[]
[null,null,null,null,null,{"$f":"IF(AG1<>0,IF(Doku!W8<>\"\",Doku!W8,\"\"),\"\")","v":""}]
[null,null,null,null,null,{"$f":"IF(AG1<>0,IF(Doku!BZ8<>\"\",Doku!BZ8,\"\"),\"\")","v":""},null,null,null,null,null,null,null,null,null,{"$f":"IF(Z27<>\"\",Z27+1,\"\")","v":""}]
[null,null,null,null,null,{"$f":"IF($AG$1<>0,VLOOKUP($AG$1,Data_UR!$A$4:$AO$23,19,FALSE),\"\")","v":""},null,null,null,null,null,null,null,null,null,{"$f":"IF($AG$1<>0,\"Datum\",\"\")","v":""},null,null,null,null,{"$f":"IF($AG$1<>0,VLOOKUP($AG$1,Data_UR!$A$4:$AO$23,20,FALSE),\"\")","v":""}]
[]
[null,null,null,null,null,{"$f":"IF($AG$1<>0,VLOOKUP($AG$1,Data_UR!$A$4:$AO$23,21,FALSE),\"\")","v":""}]
[null,null,null,null,null,{"$f":"IF($AG$1<>0,VLOOKUP($AG$1,Data_UR!$A$4:$AO$23,22,FALSE),\"\")","v":""}]
[null,null,null,null,null,{"$f":"IF($AG$1<>0,VLOOKUP($AG$1,Data_UR!$A$4:$AO$23,23,FALSE),\"\")","v":""}]
[]
[]
[]
[]
[null,null,null,"Voraussetzungen (gesonderte Nachweise)"]
[]
[null,null,null,{"$f":"IF($AG$1<>0,VLOOKUP($AG$1,Data_UR!$A$30:$AQ$49,9,FALSE),\"\")","v":""}]
[null,null,null,{"$f":"IF($AG$1<>0,VLOOKUP($AG$1,Data_UR!$A$30:$AQ$49,10,FALSE),\"\")","v":""}]
[null,null,null,{"$f":"IF($AG$1<>0,VLOOKUP($AG$1,Data_UR!$A$30:$AQ$49,11,FALSE),\"\")","v":""}]
[null,null,null,{"$f":"IF($AG$1<>0,VLOOKUP($AG$1,Data_UR!$A$30:$AQ$49,12,FALSE),\"\")","v":""}]
[null,null,null,{"$f":"IF($AG$1<>0,VLOOKUP($AG$1,Data_UR!$A$30:$AQ$49,13,FALSE),\"\")","v":""}]
[null,null,null,{"$f":"IF($AG$1<>0,VLOOKUP($AG$1,Data_UR!$A$30:$AQ$49,14,FALSE),\"\")","v":""}]
[null,null,null,{"$f":"IF($AG$1<>0,VLOOKUP($AG$1,Data_UR!$A$30:$AQ$49,15,FALSE),\"\")","v":""}]
[null,null,null,{"$f":"IF($AG$1<>0,VLOOKUP($AG$1,Data_UR!$A$30:$AQ$49,16,FALSE),\"\")","v":""}]
[null,null,null,{"$f":"IF($AG$1<>0,VLOOKUP($AG$1,Data_UR!$A$30:$AQ$49,17,FALSE),\"\")","v":""}]
[null,null,null,{"$f":"IF($AG$1<>0,VLOOKUP($AG$1,Data_UR!$A$30:$AQ$49,18,FALSE),\"\")","v":""}]
[null,null,null,{"$f":"IF($AG$1<>0,VLOOKUP($AG$1,Data_UR!$A$30:$AQ$49,19,FALSE),\"\")","v":""}]
[null,null,null,{"$f":"IF($AG$1<>0,VLOOKUP($AG$1,Data_UR!$A$30:$AQ$49,20,FALSE),\"\")","v":""}]
[]
[null,null,null,{"$f":"IF($AG$1<>0,VLOOKUP($AG$1,Data_UR!$A$30:$AQ$49,22,FALSE),\"\")","v":""}]
[]
[]
[null,null,null,{"$f":"IF($AG$1<>0,VLOOKUP($AG$1,Data_UR!$A$30:$AQ$49,23,FALSE),\"\")","v":""}]
[null,null,null,{"$f":"IF($AG$1<>0,VLOOKUP($AG$1,Data_UR!$A$30:$AQ$49,24,FALSE),\"\")","v":""}]
[null,null,null,{"$f":"IF($AG$1<>0,VLOOKUP($AG$1,Data_UR!$A$30:$AQ$49,25,FALSE),\"\")","v":""}]
[null,null,null,{"$f":"IF($AG$1<>0,VLOOKUP($AG$1,Data_UR!$A$30:$AQ$49,26,FALSE),\"\")","v":""}]
[null,null,null,{"$f":"IF($AG$1<>0,VLOOKUP($AG$1,Data_UR!$A$30:$AQ$49,27,FALSE),\"\")","v":""}]
[null,null,null,{"$f":"IF($AG$1<>0,VLOOKUP($AG$1,Data_UR!$A$30:$AQ$49,28,FALSE),\"\")","v":""}]
[null,null,null,{"$f":"IF($AG$1<>0,VLOOKUP($AG$1,Data_UR!$A$30:$AQ$49,29,FALSE),\"\")","v":""}]
[null,null,null,{"$f":"IF($AG$1<>0,VLOOKUP($AG$1,Data_UR!$A$30:$AQ$49,30,FALSE),\"\")","v":""}]
[null,null,null,{"$f":"IF($AG$1<>0,VLOOKUP($AG$1,Data_UR!$A$30:$AQ$49,31,FALSE),\"\")","v":""}]
[null,null,null,{"$f":"IF($AG$1<>0,VLOOKUP($AG$1,Data_UR!$A$30:$AQ$49,32,FALSE),\"\")","v":""}]
[null,null,null,{"$f":"IF($AG$1<>0,VLOOKUP($AG$1,Data_UR!$A$30:$AQ$49,33,FALSE),\"\")","v":""}]
[null,null,null,{"$f":"IF($AG$1<>0,VLOOKUP($AG$1,Data_UR!$A$30:$AQ$49,34,FALSE),\"\")","v":""}]
[null,null,null,{"$f":"IF($AG$1<>0,VLOOKUP($AG$1,Data_UR!$A$30:$AQ$49,35,FALSE),\"\")","v":""}]
[null,null,null,{"$f":"IF($AG$1<>0,VLOOKUP($AG$1,Data_UR!$A$30:$AQ$49,36,FALSE),\"\")","v":""}]
[null,null,null,{"$f":"IF($AG$1<>0,VLOOKUP($AG$1,Data_UR!$A$30:$AQ$49,37,FALSE),\"\")","v":""}]
[null,null,null,{"$f":"IF($AG$1<>0,VLOOKUP($AG$1,Data_UR!$A$30:$AQ$49,38,FALSE),\"\")","v":""}]
[null,null,null,{"$f":"IF($AG$1<>0,VLOOKUP($AG$1,Data_UR!$A$30:$AQ$49,39,FALSE),\"\")","v":""}]
[null,null,null,{"$f":"IF($AG$1<>0,VLOOKUP($AG$1,Data_UR!$A$30:$AQ$49,40,FALSE),\"\")","v":""}]
[null,null,null,{"$f":"IF($AG$1<>0,VLOOKUP($AG$1,Data_UR!$A$30:$AQ$49,41,FALSE),\"\")","v":""}]
[null,null,null,{"$f":"IF($AG$1<>0,VLOOKUP($AG$1,Data_UR!$A$30:$AQ$49,42,FALSE),\"\")","v":""}]
[]
[]
[null,null,null,{"$f":"IF($AG$1<>0,VLOOKUP($AG$1,Data_UR!$A$30:$AQ$49,43,FALSE),\"\")","v":""}]
[]
[null,null,null,{"$f":"IF(AG1<>0,CONCATENATE(Doku!$W$8,\" • \",Doku!$W$10,\" • \",Doku!$BR$10,\" \",Doku!$BZ$10),\"\")","v":""}]

{"sheet":"Rs_1","index":8,"n_rows":47,"n_cols":34,"rows_kept":47,"cut":false,"hidden":true,"merged":[[9,3,11,27],[3,28,3,29],[2,3,2,29],[3,3,4,27],[5,3,5,27],[8,3,8,27],[6,3,7,27],[4,28,4,29],[5,28,5,29],[6,28,6,29],[7,28,7,29],[8,28,8,29],[9,28,9,29],[10,28,10,29],[11,28,11,29],[12,3,14,27],[15,3,17,27],[14,28,14,29],[15,28,15,29],[16,28,16,29],[17,28,17,29],[12,28,12,29],[13,28,13,29],[27,28,27,29],[28,28,28,29],[29,28,29,29],[18,3,20,27],[21,3,23,27],[18,28,18,29],[19,28,19,29],[20,28,20,29],[21,28,21,29],[22,28,22,29],[23,28,23,29],[46,3,46,27],[42,3,42,27],[43,3,43,27],[44,28,44,29],[45,28,45,29],[46,28,46,29],[3,32,4,32],[3,33,4,35],[44,3,45,27],[33,3,35,27],[36,3,38,27],[39,3,41,27],[30,3,32,27],[30,28,30,29],[31,28,31,29],[32,28,32,29],[33,28,33,29],[24,3,26,27],[27,3,29,27],[24,28,24,29],[25,28,25,29],[26,28,26,29],[34,28,34,29],[35,28,35,29],[36,28,36,29],[37,28,37,29],[38,28,38,29],[39,28,39,29],[40,28,40,29],[41,28,41,29],[42,28,42,29],[43,28,43,29]]}
[{"$f":"IF(Data_PD!A4<>\"\",Data_PD!A4,0)","v":0},null,null,null,null,null,null,null,null,null,null,null,null,null,null,null,null,null,null,null,null,null,null,null,null,null,null,null,null,null,null,null,{"$f":"IF(OR(Data_LD!B24=12,Data_LD!B24=13,Data_LD!B24=15,Data_LD!B24=16),Data_LD!B24,0)","v":0}]
[{"$f":"IF(Data_PD!A5<>\"\",Data_PD!A5,0)","v":0}]
[{"$f":"IF(Data_PD!A6<>\"\",Data_PD!A6,0)","v":0}]
[{"$f":"IF(Data_PD!A7<>\"\",Data_PD!A7,0)","v":0},null,null,{"$f":"IF($AG$1<>0,IF($AG$4<>0,VLOOKUP($AG$4,Data_PD!A4:U23,18,FALSE),\"\"),\"\")","v":""},null,null,null,null,null,null,null,null,null,null,null,null,null,null,null,null,null,null,null,null,null,null,null,null,null,null,null,null,1,"  Lfd-Nr. für den Einzeldruck\n  Nummer aus der Teilnehmerliste"]
[{"$f":"IF(Data_PD!A8<>\"\",Data_PD!A8,0)","v":0}]
[{"$f":"IF(Data_PD!A9<>\"\",Data_PD!A9,0)","v":0}]
[{"$f":"IF(Data_PD!A10<>\"\",Data_PD!A10,0)","v":0},null,null,{"$f":"IF($AG$1<>0,VLOOKUP($AG$1,Data_UR!$A$30:$AQ$49,8,FALSE),\"\")","v":""}]
[{"$f":"IF(Data_PD!A11<>\"\",Data_PD!A11,0)","v":0}]
[{"$f":"IF(Data_PD!A12<>\"\",Data_PD!A12,0)","v":0}]
[{"$f":"IF(Data_PD!A13<>\"\",Data_PD!A13,0)","v":0},null,null,{"$f":"IF($AG$1<>0,VLOOKUP($AG$1,Data_UR!$A$30:$AQ$49,9,FALSE),\"\")","v":""}]
[{"$f":"IF(Data_PD!A14<>\"\",Data_PD!A14,0)","v":0}]
[{"$f":"IF(Data_PD!A15<>\"\",Data_PD!A15,0)","v":0}]
[{"$f":"IF(Data_PD!A16<>\"\",Data_PD!A16,0)","v":0},null,null,{"$f":"IF($AG$1<>0,VLOOKUP($AG$1,Data_UR!$A$30:$AQ$49,10,FALSE),\"\")","v":""}]
[{"$f":"IF(Data_PD!A17<>\"\",Data_PD!A17,0)","v":0}]
[{"$f":"IF(Data_PD!A18<>\"\",Data_PD!A18,0)","v":0}]
[{"$f":"IF(Data_PD!A19<>\"\",Data_PD!A19,0)","v":0},null,null,{"$f":"IF($AG$1<>0,VLOOKUP($AG$1,Data_UR!$A$30:$AQ$49,11,FALSE),\"\")","v":""}]
[{"$f":"IF(Data_PD!A20<>\"\",Data_PD!A20,0)","v":0}]
[{"$f":"IF(Data_PD!A21<>\"\",Data_PD!A21,0)","v":0}]
[{"$f":"IF(Data_PD!A22<>\"\",Data_PD!A22,0)","v":0},null,null,{"$f":"IF($AG$1<>0,VLOOKUP($AG$1,Data_UR!$A$30:$AQ$49,12,FALSE),\"\")","v":""}]
[{"$f":"IF(Data_PD!A23<>\"\",Data_PD!A23,0)","v":0}]
[]
[null,null,null,{"$f":"IF($AG$1<>0,VLOOKUP($AG$1,Data_UR!$A$30:$AQ$49,13,FALSE),\"\")","v":""}]
[]
[]
[null,null,null,{"$f":"IF($AG$1<>0,VLOOKUP($AG$1,Data_UR!$A$30:$AQ$49,14,FALSE),\"\")","v":""}]
[]
[]
[null,null,null,{"$f":"IF($AG$1<>0,VLOOKUP($AG$1,Data_UR!$A$30:$AQ$49,15,FALSE),\"\")","v":""}]
[]
[]
[null,null,null,{"$f":"IF($AG$1<>0,VLOOKUP($AG$1,Data_UR!$A$30:$AQ$49,16,FALSE),\"\")","v":""}]
[]
[]
[null,null,null,{"$f":"IF($AG$1<>0,VLOOKUP($AG$1,Data_UR!$A$30:$AQ$49,17,FALSE),\"\")","v":""}]
[]
[]
[null,null,null,{"$f":"IF($AG$1<>0,VLOOKUP($AG$1,Data_UR!$A$30:$AQ$49,18,FALSE),\"\")","v":""}]
[]
[]
[null,null,null,{"$f":"IF($AG$1<>0,VLOOKUP($AG$1,Data_UR!$A$30:$AQ$49,19,FALSE),\"\")","v":""}]
[]
[]
[]
[]
[null,null,null,{"$f":"IF($AG$1<>0,VLOOKUP($AG$1,Data_UR!$A$30:$AQ$49,41,FALSE),\"\")","v":""}]
[]
[null,null,null,{"$f":"IF(AG1<>0,CONCATENATE(Doku!$W$8,\" • \",Doku!$W$10,\" • \",Doku!$BR$10,\" \",Doku!$BZ$10),\"\")","v":""}]

{"sheet":"Urkunde_2","index":9,"n_rows":40,"n_cols":34,"rows_kept":40,"cut":false,"hidden":true,"merged":[[41,5,41,29],[42,5,42,29],[36,5,36,29],[37,5,37,29],[38,5,38,29],[39,5,39,29],[40,5,40,29],[35,5,35,14],[35,15,35,19],[35,20,35,29],[28,5,28,29],[29,5,29,16],[29,18,29,29],[30,5,30,16],[30,18,30,29],[32,5,32,29],[33,5,33,19],[33,20,33,29],[34,5,34,14],[34,15,34,19],[34,20,34,29],[26,25,26,29],[27,5,27,19],[27,20,27,24],[27,25,27,29],[31,5,31,16],[31,18,31,29],[26,5,26,19],[26,20,26,24],[22,5,22,29],[23,5,23,29],[24,5,24,29],[25,5,25,29],[16,5,16,29],[17,5,17,29],[18,5,18,29],[19,5,19,29],[20,5,20,29],[21,5,21,29],[3,33,3,35],[2,5,2,29],[3,5,3,29],[4,5,4,29],[5,5,5,29],[13,5,13,29],[6,5,6,29],[7,5,7,29],[14,5,14,29],[15,5,15,29],[8,5,8,29],[9,5,9,29],[10,5,10,29],[11,5,11,29],[12,5,12,29]]}
[{"$f":"IF(Data_PD!A4<>\"\",Data_PD!A4,0)","v":0},null,null,null,null,null,null,null,null,null,null,null,null,null,null,null,null,null,null,null,null,null,null,null,null,null,null,null,null,null,null,null,{"$f":"IF(Data_LD!B24=18,Data_LD!B24,0)","v":0}]
[{"$f":"IF(Data_PD!A5<>\"\",Data_PD!A5,0)","v":0}]
[{"$f":"IF(Data_PD!A6<>\"\",Data_PD!A6,0)","v":0}]
[{"$f":"IF(Data_PD!A7<>\"\",Data_PD!A7,0)","v":0},null,null,null,null,{"$f":"IF($AG$1<>0,VLOOKUP($AG$1,Data_UR!$A$4:$AO$23,3,FALSE),\"\")","v":""},null,null,null,null,null,null,null,null,null,null,null,null,null,null,null,null,null,null,null,null,null,null,null,null,null,null,1,"  Lfd-Nr. für den Einzeldruck\n  Nummer aus der Teilnehmerliste"]
[{"$f":"IF(Data_PD!A8<>\"\",Data_PD!A8,0)","v":0}]
[{"$f":"IF(Data_PD!A9<>\"\",Data_PD!A9,0)","v":0},null,null,null,null,{"$f":"IF($AG$1<>0,VLOOKUP($AG$1,Data_UR!$A$4:$AO$23,4,FALSE),\"\")","v":""}]
[{"$f":"IF(Data_PD!A10<>\"\",Data_PD!A10,0)","v":0},null,null,null,null,{"$f":"IF($AG$1<>0,VLOOKUP($AG$1,Data_UR!$A$4:$AO$23,5,FALSE),\"\")","v":""}]
[{"$f":"IF(Data_PD!A11<>\"\",Data_PD!A11,0)","v":0}]
[{"$f":"IF(Data_PD!A12<>\"\",Data_PD!A12,0)","v":0},null,null,null,null,{"$f":"IF($AG$1<>0,VLOOKUP($AG$1,Data_UR!$A$4:$AO$23,7,FALSE),\"\")","v":""}]
[{"$f":"IF(Data_PD!A13<>\"\",Data_PD!A13,0)","v":0}]
[{"$f":"IF(Data_PD!A14<>\"\",Data_PD!A14,0)","v":0},null,null,null,null,{"$f":"IF(AG1<>0,VLOOKUP(AG4,Data_PD!A4:U23,2,FALSE),\"\")","v":""}]
[{"$f":"IF(Data_PD!A15<>\"\",Data_PD!A15,0)","v":0},null,null,null,null,{"$f":"IF(AG1<>0,\"Nachname\",\"\")","v":""}]
[{"$f":"IF(Data_PD!A16<>\"\",Data_PD!A16,0)","v":0}]
[{"$f":"IF(Data_PD!A17<>\"\",Data_PD!A17,0)","v":0},null,null,null,null,{"$f":"IF(AG1<>0,VLOOKUP(AG4,Data_PD!A4:U23,3,FALSE),\"\")","v":""}]
[{"$f":"IF(Data_PD!A18<>\"\",Data_PD!A18,0)","v":0},null,null,null,null,{"$f":"IF(AG1<>0,\"Vorname\",\"\")","v":""}]
[{"$f":"IF(Data_PD!A19<>\"\",Data_PD!A19,0)","v":0}]
[{"$f":"IF(Data_PD!A20<>\"\",Data_PD!A20,0)","v":0},null,null,null,null,{"$f":"IF(AG1<>0,VLOOKUP(AG4,Data_PD!A4:U23,5,FALSE),\"\")","v":""}]
[{"$f":"IF(Data_PD!A21<>\"\",Data_PD!A21,0)","v":0},null,null,null,null,{"$f":"IF(AG1<>0,\"Geburtsdatum\",\"\")","v":""}]
[{"$f":"IF(Data_PD!A22<>\"\",Data_PD!A22,0)","v":0}]
[{"$f":"IF(Data_PD!A23<>\"\",Data_PD!A23,0)","v":0},null,null,null,null,{"$f":"IF($AG$1<>0,VLOOKUP($AG$1,Data_UR!$A$4:$AO$23,8,FALSE),\"\")","v":""}]
[null,null,null,null,null,{"$f":"IF($AG$1<>0,VLOOKUP($AG$1,Data_UR!$A$4:$AO$23,9,FALSE),\"\")","v":""}]
[null,null,null,null,null,{"$f":"IF($AG$1<>0,VLOOKUP($AG$1,Data_UR!$A$4:$AO$23,10,FALSE),\"\")","v":""}]
[null,null,null,null,null,{"$f":"IF($AG$1<>0,VLOOKUP($AG$1,Data_UR!$A$4:$AO$23,11,FALSE),\"\")","v":""}]
[null,null,null,null,null,{"$f":"IF($AG$1<>0,VLOOKUP($AG$1,Data_UR!$A$4:$AO$23,12,FALSE),\"\")","v":""}]
[null,null,null,null,null,{"$f":"IF($AG$1<>0,VLOOKUP($AG$1,Data_UR!$A$4:$AO$23,13,FALSE),\"\")","v":""}]
[]
[null,null,null,null,null,{"$f":"IF(AG1<>0,IF(Doku!BZ18<>\"\",Doku!BZ18,\"\"),\"\")","v":""},null,null,null,null,null,null,null,null,null,null,null,null,null,null,{"$f":"IF(AG1<>0,IF(Doku!Y34<>\"\",Doku!Y34,\"\"),\"\")","v":""},null,null,null,null,{"$f":"IF(AG1<>0,IF(Doku!CC34<>\"\",Doku!CC34,\"\"),\"\")","v":""}]
[null,null,null,null,null,{"$f":"IF($AG$1<>0,VLOOKUP($AG$1,Data_UR!$A$4:$AO$23,14,FALSE),\"\")","v":""},null,null,null,null,null,null,null,null,null,null,null,null,null,null,{"$f":"IF($AG$1<>0,VLOOKUP($AG$1,Data_UR!$A$4:$AO$23,15,FALSE),\"\")","v":""},null,null,null,null,{"$f":"IF($AG$1<>0,VLOOKUP($AG$1,Data_UR!$A$4:$AO$23,16,FALSE),\"\")","v":""}]
[]
[null,null,null,null,null,{"$f":"IF(AG1<>0,IF(Doku!Y28<>\"\",Doku!Y28,\"\"),\"\")","v":""}]
[null,null,null,null,null,{"$f":"IF(AG1<>0,IF(Doku!CC28<>\"\",Doku!CC28,\"\"),\"\")","v":""}]
[null,null,null,null,null,{"$f":"IF($AG$1<>0,VLOOKUP($AG$1,Data_UR!$A$4:$AO$23,17,FALSE),\"\")","v":""},null,null,null,null,null,null,null,null,null,null,null,null,{"$f":"IF($AG$1<>0,VLOOKUP($AG$1,Data_UR!$A$4:$AO$23,18,FALSE),\"\")","v":""}]
[]
[null,null,null,null,null,{"$f":"IF(AG1<>0,IF(Doku!W8<>\"\",Doku!W8,\"\"),\"\")","v":""}]
[null,null,null,null,null,{"$f":"IF(AG1<>0,IF(Doku!BZ8<>\"\",Doku!BZ8,\"\"),\"\")","v":""},null,null,null,null,null,null,null,null,null,{"$f":"IF(Z27<>\"\",Z27+1,\"\")","v":""}]
[null,null,null,null,null,{"$f":"IF($AG$1<>0,VLOOKUP($AG$1,Data_UR!$A$4:$AO$23,19,FALSE),\"\")","v":""},null,null,null,null,null,null,null,null,null,{"$f":"IF(AG1<>0,\"Datum\",\"\")","v":""},null,null,null,null,{"$f":"IF($AG$1<>0,VLOOKUP($AG$1,Data_UR!$A$4:$AO$23,20,FALSE),\"\")","v":""}]
[]
[null,null,null,null,null,{"$f":"IF($AG$1<>0,VLOOKUP($AG$1,Data_UR!$A$4:$AO$23,21,FALSE),\"\")","v":""}]
[null,null,null,null,null,{"$f":"IF($AG$1<>0,VLOOKUP($AG$1,Data_UR!$A$4:$AO$23,22,FALSE),\"\")","v":""}]
[null,null,null,null,null,{"$f":"IF($AG$1<>0,VLOOKUP($AG$1,Data_UR!$A$4:$AO$23,23,FALSE),\"\")","v":""}]

{"sheet":"Rs_2","index":10,"n_rows":47,"n_cols":34,"rows_kept":47,"cut":false,"hidden":true,"merged":[[3,2,46,2],[3,3,4,27],[3,28,3,29],[4,28,4,29],[2,3,2,27],[2,28,2,29],[9,26,9,27],[9,28,9,29],[10,4,10,25],[10,26,10,27],[10,28,10,29],[5,3,5,27],[5,28,5,29],[6,3,7,27],[6,28,6,29],[7,28,7,29],[8,28,8,29],[13,4,13,25],[13,26,13,27],[13,28,13,29],[14,4,14,25],[14,28,14,29],[11,4,11,25],[11,26,11,27],[11,28,11,29],[12,4,12,25],[12,26,12,27],[12,28,12,29],[17,4,17,25],[17,26,17,27],[17,28,17,29],[19,28,19,29],[20,4,20,25],[20,26,20,27],[20,28,20,29],[18,4,18,25],[18,26,18,27],[18,28,18,29],[15,4,15,25],[15,26,15,27],[15,28,15,29],[16,4,16,25],[16,26,16,27],[16,28,16,29],[26,28,26,29],[27,4,27,25],[27,26,27,27],[27,28,27,29],[23,28,23,29],[25,26,25,27],[25,28,25,29],[21,4,21,25],[21,26,21,27],[21,28,21,29],[22,4,22,25],[22,26,22,27],[22,28,22,29],[30,28,30,29],[31,4,31,25],[31,26,31,27],[31,28,31,29],[28,4,28,25],[28,26,28,27],[28,28,28,29],[29,4,29,25],[29,26,29,27],[29,28,29,29],[34,28,34,29],[35,4,35,25],[35,26,35,27],[35,28,35,29],[32,4,32,25],[32,26,32,27],[32,28,32,29],[33,4,33,25],[33,26,33,27],[33,28,33,29],[3,33,4,35],[46,3,46,27],[46,28,46,29],[47,3,47,29],[3,32,4,32],[42,3,42,27],[42,28,42,29],[43,3,43,27],[44,3,45,27],[44,28,44,29],[45,28,45,29],[39,4,39,25],[39,26,39,27],[39,28,39,29],[40,3,40,27],[40,28,40,29],[41,3,41,27],[41,28,41,29],[37,4,37,25],[37,26,37,27],[37,28,37,29],[38,4,38,25],[38,26,38,27],[38,28,38,29],[8,26,8,27],[8,3,8,25],[9,4,9,25],[23,4,23,25],[23,26,23,27],[24,4,24,25],[24,26,24,27],[25,4,25,25],[36,26,36,27],[36,4,36,25],[34,4,34,25],[34,26,34,27],[30,4,30,25],[30,26,30,27],[26,4,26,25],[26,26,26,27],[19,4,19,25],[19,26,19,27],[14,26,14,27]]}
[{"$f":"IF(Data_PD!A4<>\"\",Data_PD!A4,0)","v":0},null,null,null,null,null,null,null,null,null,null,null,null,null,null,null,null,null,null,null,null,null,null,null,null,null,null,null,null,null,null,null,{"$f":"IF(Data_LD!B24=18,Data_LD!B24,0)","v":0}]
[{"$f":"IF(Data_PD!A5<>\"\",Data_PD!A5,0)","v":0}]
[3]
[{"$f":"IF(Data_PD!A7<>\"\",Data_PD!A7,0)","v":0},null,null,{"$f":"IF($AG$1<>0,VLOOKUP($AG$4,Data_PD!A4:U23,18,FALSE),\"\")","v":""},null,null,null,null,null,null,null,null,null,null,null,null,null,null,null,null,null,null,null,null,null,null,null,null,null,null,null,null,1,"  Lfd-Nr. für den Einzekdruck\n  Nummer aus der Teilnehmerliste"]
[{"$f":"IF(Data_PD!A8<>\"\",Data_PD!A8,0)","v":0}]
[{"$f":"IF(Data_PD!A9<>\"\",Data_PD!A9,0)","v":0}]
[{"$f":"IF(Data_PD!A10<>\"\",Data_PD!A10,0)","v":0},null,null,{"$f":"IF($AG$1<>0,VLOOKUP($AG$1,Data_UR!$A$30:$AS$49,20,FALSE),\"\")","v":""}]
[{"$f":"IF(Data_PD!A11<>\"\",Data_PD!A11,0)","v":0}]
[{"$f":"IF(Data_PD!A12<>\"\",Data_PD!A12,0)","v":0},null,null,null,null,null,null,null,null,null,null,null,null,null,null,null,null,null,null,null,null,null,null,null,null,null,{"$f":"IF(AG1<>0,\"LE\",\"\")","v":""}]
[{"$f":"IF(Data_PD!A13<>\"\",Data_PD!A13,0)","v":0},null,null,{"$f":"IF(AA10<>\"\",\"•\",\"\")","v":"•"},null,null,null,null,null,null,null,null,null,null,null,null,null,null,null,null,null,null,null,null,null,null,2]
[{"$f":"IF(Data_PD!A14<>\"\",Data_PD!A14,0)","v":0},null,null,{"$f":"IF(AA11<>\"\",\"•\",\"\")","v":"•"},null,null,null,null,null,null,null,null,null,null,null,null,null,null,null,null,null,null,null,null,null,null,2]
[{"$f":"IF(Data_PD!A15<>\"\",Data_PD!A15,0)","v":0},null,null,{"$f":"IF(AA12<>\"\",\"•\",\"\")","v":"•"},null,null,null,null,null,null,null,null,null,null,null,null,null,null,null,null,null,null,null,null,null,null,2]
[{"$f":"IF(Data_PD!A16<>\"\",Data_PD!A16,0)","v":0},null,null,"•",null,null,null,null,null,null,null,null,null,null,null,null,null,null,null,null,null,null,null,null,null,null,2]
[{"$f":"IF(Data_PD!A17<>\"\",Data_PD!A17,0)","v":0},null,null,"•",null,null,null,null,null,null,null,null,null,null,null,null,null,null,null,null,null,null,null,null,null,null,2]
[{"$f":"IF(Data_PD!A18<>\"\",Data_PD!A18,0)","v":0},null,null,"•",null,null,null,null,null,null,null,null,null,null,null,null,null,null,null,null,null,null,null,null,null,null,2]
[{"$f":"IF(Data_PD!A19<>\"\",Data_PD!A19,0)","v":0},null,null,""]
[{"$f":"IF(Data_PD!A20<>\"\",Data_PD!A20,0)","v":0},null,null,""]
[{"$f":"IF(Data_PD!A21<>\"\",Data_PD!A21,0)","v":0},null,null,""]
[{"$f":"IF(Data_PD!A22<>\"\",Data_PD!A22,0)","v":0},null,null,""]
[{"$f":"IF(Data_PD!A23<>\"\",Data_PD!A23,0)","v":0},null,null,""]
[null,null,null,""]
[null,null,null,""]
[null,null,null,{"$f":"IF(AA23<>\"\",\"•\",\"\")","v":""}]
[null,null,null,""]
[null,null,null,""]
[null,null,null,""]
[null,null,null,{"$f":"IF(AA27<>\"\",\"•\",\"\")","v":""}]
[null,null,null,{"$f":"IF(AA28<>\"\",\"•\",\"\")","v":""}]
[null,null,null,""]
[null,null,null,""]
[null,null,null,""]
[null,null,null,""]
[null,null,null,""]
[null,null,null,""]
[null,null,null,""]
[null,null,null,""]
[null,null,null,""]
[null,null,null,""]
[null,null,null,""]
[null,null,null,null,{"$f":"IF(AG1<>0,\"Fortbildungsinhalte gesamt: \",\"\")","v":""},null,null,null,null,null,null,null,null,null,null,null,null,null,null,null,null,null,null,null,null,null,{"$f":"IF(SUM(AA10:AB39),SUM(AA10:AB39),\"\")","v":12}]
[]
[null,null,null,{"$f":"IF(AG1<>0,CONCATENATE(\"Insgesamt sind \",SUM(AA40),\" Lerneinheiten (1 LE = 45 Min.) anzurechnenden.\"),\"\")","v":""}]
[]
[]
[null,null,null,{"$f":"IF($AG$1<>0,VLOOKUP($AG$1,Data_UR!$A$30:$AS$49,41,FALSE),\"\")","v":""}]
[]
[null,null,null,{"$f":"IF(AG1<>0,CONCATENATE(Doku!$W$8,\" • \",Doku!$W$10,\" • \",Doku!$BR$10,\" \",Doku!$BZ$10),\"\")","v":""}]

{"sheet":"TBG","index":11,"n_rows":83,"n_cols":121,"rows_kept":83,"cut":false,"hidden":true,"merged":[[8,120,12,123],[9,5,9,114],[10,7,11,31],[12,6,12,57],[1,118,6,123],[4,2,4,4],[4,5,4,114],[5,5,5,55],[5,61,5,63],[5,87,5,89],[6,5,6,55],[20,5,20,26],[20,27,20,101],[20,102,21,115],[17,6,17,12],[17,14,17,57],[15,118,16,118],[14,61,14,113],[14,6,14,57],[7,5,7,39],[7,61,7,63],[8,5,8,39],[21,2,21,4],[21,5,21,61],[21,62,21,81],[21,82,21,101],[23,2,23,4],[23,6,23,60],[23,62,23,66],[23,68,23,72],[23,74,23,81],[23,82,23,101],[23,102,23,106],[23,107,23,110],[23,111,23,115],[23,120,23,121],[26,2,26,4],[26,6,26,60],[26,62,26,66],[26,68,26,72],[26,74,26,81],[26,82,26,101],[26,102,26,106],[26,107,26,110],[26,111,26,115],[26,120,26,121],[29,120,29,121],[32,2,32,4],[32,6,32,60],[32,62,32,66],[32,68,32,72],[32,74,32,81],[32,82,32,101],[32,102,32,106],[32,107,32,110],[32,111,32,115],[32,120,32,121],[29,2,29,4],[29,6,29,60],[29,62,29,66],[29,68,29,72],[29,74,29,81],[29,82,29,101],[29,102,29,106],[29,107,29,110],[29,111,29,115],[35,120,35,121],[38,2,38,4],[38,6,38,60],[38,62,38,66],[38,68,38,72],[38,74,38,81],[38,82,38,101],[38,102,38,106],[38,107,38,110],[38,111,38,115],[38,120,38,121],[35,2,35,4],[35,6,35,60],[35,62,35,66],[35,68,35,72],[35,74,35,81],[35,82,35,101],[35,102,35,106],[35,107,35,110],[35,111,35,115],[41,120,41,121],[44,2,44,4],[44,6,44,60],[44,62,44,66],[44,68,44,72],[44,74,44,81],[44,82,44,101],[44,102,44,106],[44,107,44,110],[44,111,44,115],[44,120,44,121],[41,2,41,4],[41,6,41,60],[41,62,41,66],[41,68,41,72],[41,74,41,81],[41,82,41,101],[41,102,41,106],[41,107,41,110],[41,111,41,115],[52,2,52,4],[53,2,53,4],[53,6,53,114],[47,102,47,106],[47,107,47,110],[47,111,47,115],[47,120,47,121],[50,2,50,4],[50,6,50,60],[50,62,50,66],[50,68,50,72],[50,74,50,81],[50,82,50,101],[47,2,47,4],[47,6,47,60],[47,62,47,66],[47,68,47,72],[47,74,47,81],[47,82,47,101],[50,107,50,110],[50,111,50,115],[50,120,50,121],[59,2,59,4],[60,2,60,4],[60,6,60,114],[62,7,63,48],[62,55,63,72],[63,52,64,53],[64,7,64,50],[64,90,64,112],[54,2,54,4],[55,2,55,4],[56,2,56,4],[57,2,57,4],[58,2,58,4],[55,6,55,59],[74,7,75,16],[74,55,75,88],[75,52,80,53],[76,55,76,113],[77,55,77,113],[78,55,78,113],[79,55,79,113],[80,55,80,113],[76,7,76,50],[68,55,68,113],[72,55,72,113],[2,5,2,115],[3,5,3,115],[16,6,16,12],[64,56,64,60],[64,84,64,85],[64,61,64,83],[64,86,64,89],[15,61,15,113],[11,61,12,114],[13,6,13,57],[13,61,13,113],[15,52,15,57],[15,6,15,50],[66,7,67,32],[66,55,67,70],[67,52,68,53],[68,7,68,50],[70,7,71,32],[70,55,71,70],[71,52,72,53],[72,7,72,50],[50,102,50,106]]}
[null,null,null,null,null,null,null,null,null,null,null,null,null,null,null,null,null,null,null,null,null,null,null,null,null,null,null,null,null,null,null,null,null,null,null,null,null,null,null,null,null,null,null,null,null,null,null,null,null,null,null,null,null,null,null,null,null,null,null,null,null,null,null,null,null,null,null,null,null,null,null,null,null,null,null,null,null,null,null,null,null,null,null,null,null,null,null,null,null,null,null,null,null,null,null,null,null,null,null,null,null,null,null,null,null,null,null,null,null,null,null,null,null,null,null,null,null,{"$f":"Start!I9","v":0}]
[null,null,null,null,null,null,null,null,null,null,null,null,null,null,null,null,null,null,null,null,null,null,null,null,null,null,null,null,null,null,null,null,null,null,null,null,null,null,null,null,null,null,null,null,null,null,null,null,null,null,null,null,null,null,null,null,null,null,null,null,null,null,null,null,null,null,null,null,null,null,null,null,null,null,null,null,null,null,null,null,null,null,null,null,null,null,null,null,null,null,null,null,null,null,null,null,null,null,null,null,null,null,null,null,null,null,null,null,null,null,null,null,null,null,null,null,null,null," Wichtiger Hinweis!\n Das Anmeldeformular bitte unbedingt in Farbe ausdrucken, da dieses \n Formular bei der Abrechnungsstelle elektronisch zur Bearbeitung \n eingelesen wird."]
[null,null,null,null,null,"Verfahrenshinweis: Durch organisatorische Maßnahmen ist zu gewährleisten, dass bei der Unterzeichnung nur die eigenen Personendaten eingesehen werden können. "]
[null,null,null,null,null,"Nutzen Sie bitte die elektronische Formularfunktion dieses Dokuments. Ansonsten füllen Sie es mit einem schwarzen oder dunkelblauen Stift aus."]
[]
[null,null,null,null,null,null,null,null,null,null,null,null,null,null,null,null,null,null,null,null,null,null,null,null,null,null,null,null,null,null,null,null,null,null,null,null,null,null,null,null,null,null,null,null,null,null,null,null,null,null,null,null,null,null,null,null,null,null,null,null,null,{"$f":"IF(DN1=1,\"X\",\"\")","v":""},null,null," Ausbildung",null,null,null,null,null,null,null,null,null,null,null,null,null,null,null,null,null,null,null,null,null,null,{"$f":"IF(DN1=3,\"X\",\"\")","v":""},null,null," Fortbildung"]
[]
[null,null,null,null,null,"Aus- und Fortbildung",null,null,null,null,null,null,null,null,null,null,null,null,null,null,null,null,null,null,null,null,null,null,null,null,null,null,null,null,null,null,null,null,null,null,null,null,null,null,null,null,null,null,null,null,null,null,null,null,null,null,null,null,null,null,null,{"$f":"IF(DN1=2,\"X\",\"\")","v":""},null,null," Erste Hilfe in Bildungs- und Betreuungseinrichtungen"]
[null,null,null,null,null,"für betriebliche Ersthelfer",null,null,null,null,null,null,null,null,null,null,null,null,null,null,null,null,null,null,null,null,null,null,null,null,null,null,null,null,null,null,null,null,null,null,null,null,null,null,null,null,null,null,null,null,null,null,null,null,null,null,null,null,null,null,null,null,null,null,null,null,null,null,null,null,null,null,null,null,null,null,null,null,null,null,null,null,null,null,null,null,null,null,null,null,null,null,null,null,null,null,null,null,null,null,null,null,null,null,null,null,null,null,null,null,null,null,null,null,null,null,null,null,null,null,"Hinweis:\nZum vervollständigen dieser Liste bitte die laufende Nummer aus der unten stehenden Liste in den weißen Feldern eintragen."]
[]
[null,null,null,null,null,null,null,"Name des Mitgliedsbetriebes"]
[null,null,null,null,null,null,null,null,null,null,null,null,null,null,null,null,null,null,null,null,null,null,null,null,null,null,null,null,null,null,null,null,null,null,null,null,null,null,null,null,null,null,null,null,null,null,null,null,null,null,null,null,null,null,null,null,null,null,null,null,null,"Zuständiger Unfallversicherungsträger\n(Berufsgenossenschaft, Unfallkasse) "]
[]
[]
[null,null,null,null,null,null,"Straße / Hausnummer",null,null,null,null,null,null,null,null,null,null,null,null,null,null,null,null,null,null,null,null,null,null,null,null,null,null,null,null,null,null,null,null,null,null,null,null,null,null,null,null,null,null,null,null,null,null,null,null,null,null,null,null,null,null,"Mitgliedsnummer / Versicherungsnummer:"]
[]
[null,null,null,null,null,null,"PLZ",null,null,null,null,null,null,null,"Ort"]
[]
[]
[]
[null,null,null,null,null," Teilnahmeliste",null,null,null,null,null,null,null,null,null,null,null,null,null,null,null,null,null,null,null,null,null,"Die Teilnahmeliste ist vom Unternehmen auszufüllen.\nDie Teilnahme ist von den Teilnehmenden am Tag des Kurses durch Unterschrift zu bestätigen.",null,null,null,null,null,null,null,null,null,null,null,null,null,null,null,null,null,null,null,null,null,null,null,null,null,null,null,null,null,null,null,null,null,null,null,null,null,null,null,null,null,null,null,null,null,null,null,null,null,null,null,null,null,null,null,null,null,null,null,null,null,null,null,null,null,null,null,null,null,null,null,null,null,null," Bestätigung\n durch die \n Ausbildungsstelle"]
[null,null,null,null,null," Name, Vorname",null,null,null,null,null,null,null,null,null,null,null,null,null,null,null,null,null,null,null,null,null,null,null,null,null,null,null,null,null,null,null,null,null,null,null,null,null,null,null,null,null,null,null,null,null,null,null,null,null,null,null,null,null,null,null,null,"Geburtsdatum",null,null,null,null,null,null,null,null,null,null,null,null,null,null,null,null,null,null,null,"Unterschrift",null,null,null,null,null,null,null,null,null,null,null,null,null,null,null,null,null,null,null,null,null,null,null,null,null,null,null,null,null,null,null,null,null,null,null,"Nr."]
[]
[null,null,1,null,null,null,{"$f":"IF(DO24<>\"\",IFERROR(VLOOKUP(DO24,Data_PD!$A$4:$U$23,4,FALSE),\"Keine Daten vorhanden!\"),\"\")","v":""},null,null,null,null,null,null,null,null,null,null,null,null,null,null,null,null,null,null,null,null,null,null,null,null,null,null,null,null,null,null,null,null,null,null,null,null,null,null,null,null,null,null,null,null,null,null,null,null,null,null,null,null,null,null,null,{"$f":"IF(DO24<>\"\",IFERROR(TEXT(VLOOKUP(DO24,Data_PD!$A$4:$U$23,5,FALSE),\"TT\"),\"./.\"),\"\")","v":""},null,null,null,null,"•",{"$f":"IF(DO24<>\"\",IFERROR(TEXT(VLOOKUP(DO24,Data_PD!$A$4:$U$23,5,FALSE),\"MM\"),\"./.\"),\"\")","v":""},null,null,null,null,"•",{"$f":"IF(DO24<>\"\",IFERROR(TEXT(VLOOKUP(DO24,Data_PD!$A$4:$U$23,5,FALSE),\"JJJJ\"),\"./.\"),\"\")","v":""},null,null,null,null,null,null,null,null,null,null,null,null,null,null,null,null,null,null,null,null,null,null,null,null,null,null,null,null,null,null,null,null,{"$f":"IF(DO24<>\"\",\"X\",\"\")","v":""},null,null,null,null,null,null,null,null,null,{"$f":"IF(DO24<>\"\",1,\"\")","v":""}]
[]
[]
[null,null,2,null,null,null,{"$f":"IF(DO27<>\"\",IFERROR(VLOOKUP(DO27,Data_PD!$A$4:$U$23,4,FALSE),\"Keine Daten vorhanden!\"),\"\")","v":""},null,null,null,null,null,null,null,null,null,null,null,null,null,null,null,null,null,null,null,null,null,null,null,null,null,null,null,null,null,null,null,null,null,null,null,null,null,null,null,null,null,null,null,null,null,null,null,null,null,null,null,null,null,null,null,{"$f":"IF(DO27<>\"\",IFERROR(TEXT(VLOOKUP(DO27,Data_PD!$A$4:$U$23,5,FALSE),\"TT\"),\"./.\"),\"\")","v":""},null,null,null,null,"•",{"$f":"IF(DO27<>\"\",IFERROR(TEXT(VLOOKUP(DO27,Data_PD!$A$4:$U$23,5,FALSE),\"MM\"),\"./.\"),\"\")","v":""},null,null,null,null,"•",{"$f":"IF(DO27<>\"\",IFERROR(TEXT(VLOOKUP(DO27,Data_PD!$A$4:$U$23,5,FALSE),\"JJJJ\"),\"./.\"),\"\")","v":""},null,null,null,null,null,null,null,null,null,null,null,null,null,null,null,null,null,null,null,null,null,null,null,null,null,null,null,null,null,null,null,null,{"$f":"IF(DO27<>\"\",\"X\",\"\")","v":""},null,null,null,null,null,null,null,null,null,{"$f":"IF(DO27<>\"\",1,\"\")","v":""}]
[]
[]
[null,null,3,null,null,null,{"$f":"IF(DO30<>\"\",IFERROR(VLOOKUP(DO30,Data_PD!$A$4:$U$23,4,FALSE),\"Keine Daten vorhanden!\"),\"\")","v":""},null,null,null,null,null,null,null,null,null,null,null,null,null,null,null,null,null,null,null,null,null,null,null,null,null,null,null,null,null,null,null,null,null,null,null,null,null,null,null,null,null,null,null,null,null,null,null,null,null,null,null,null,null,null,null,{"$f":"IF(DO30<>\"\",IFERROR(TEXT(VLOOKUP(DO30,Data_PD!$A$4:$U$23,5,FALSE),\"TT\"),\"./.\"),\"\")","v":""},null,null,null,null,"•",{"$f":"IF(DO30<>\"\",IFERROR(TEXT(VLOOKUP(DO30,Data_PD!$A$4:$U$23,5,FALSE),\"MM\"),\"./.\"),\"\")","v":""},null,null,null,null,"•",{"$f":"IF(DO30<>\"\",IFERROR(TEXT(VLOOKUP(DO30,Data_PD!$A$4:$U$23,5,FALSE),\"JJJJ\"),\"./.\"),\"\")","v":""},null,null,null,null,null,null,null,null,null,null,null,null,null,null,null,null,null,null,null,null,null,null,null,null,null,null,null,null,null,null,null,null,{"$f":"IF(DO30<>\"\",\"X\",\"\")","v":""},null,null,null,null,null,null,null,null,null,{"$f":"IF(DO30<>\"\",1,\"\")","v":""}]
[]
[]
[null,null,4,null,null,null,{"$f":"IF(DO33<>\"\",IFERROR(VLOOKUP(DO33,Data_PD!$A$4:$U$23,4,FALSE),\"Keine Daten vorhanden!\"),\"\")","v":""},null,null,null,null,null,null,null,null,null,null,null,null,null,null,null,null,null,null,null,null,null,null,null,null,null,null,null,null,null,null,null,null,null,null,null,null,null,null,null,null,null,null,null,null,null,null,null,null,null,null,null,null,null,null,null,{"$f":"IF(DO33<>\"\",IFERROR(TEXT(VLOOKUP(DO33,Data_PD!$A$4:$U$23,5,FALSE),\"TT\"),\"./.\"),\"\")","v":""},null,null,null,null,"•",{"$f":"IF(DO33<>\"\",IFERROR(TEXT(VLOOKUP(DO33,Data_PD!$A$4:$U$23,5,FALSE),\"MM\"),\"./.\"),\"\")","v":""},null,null,null,null,"•",{"$f":"IF(DO33<>\"\",IFERROR(TEXT(VLOOKUP(DO33,Data_PD!$A$4:$U$23,5,FALSE),\"JJJJ\"),\"./.\"),\"\")","v":""},null,null,null,null,null,null,null,null,null,null,null,null,null,null,null,null,null,null,null,null,null,null,null,null,null,null,null,null,null,null,null,null,{"$f":"IF(DO33<>\"\",\"X\",\"\")","v":""},null,null,null,null,null,null,null,null,null,{"$f":"IF(DO33<>\"\",1,\"\")","v":""}]
[]
[]
[null,null,5,null,null,null,{"$f":"IF(DO36<>\"\",IFERROR(VLOOKUP(DO36,Data_PD!$A$4:$U$23,4,FALSE),\"Keine Daten vorhanden!\"),\"\")","v":""},null,null,null,null,null,null,null,null,null,null,null,null,null,null,null,null,null,null,null,null,null,null,null,null,null,null,null,null,null,null,null,null,null,null,null,null,null,null,null,null,null,null,null,null,null,null,null,null,null,null,null,null,null,null,null,{"$f":"IF(DO36<>\"\",IFERROR(TEXT(VLOOKUP(DO36,Data_PD!$A$4:$U$23,5,FALSE),\"TT\"),\"./.\"),\"\")","v":""},null,null,null,null,"•",{"$f":"IF(DO36<>\"\",IFERROR(TEXT(VLOOKUP(DO36,Data_PD!$A$4:$U$23,5,FALSE),\"MM\"),\"./.\"),\"\")","v":""},null,null,null,null,"•",{"$f":"IF(DO36<>\"\",IFERROR(TEXT(VLOOKUP(DO36,Data_PD!$A$4:$U$23,5,FALSE),\"JJJJ\"),\"./.\"),\"\")","v":""},null,null,null,null,null,null,null,null,null,null,null,null,null,null,null,null,null,null,null,null,null,null,null,null,null,null,null,null,null,null,null,null,{"$f":"IF(DO36<>\"\",\"X\",\"\")","v":""},null,null,null,null,null,null,null,null,null,{"$f":"IF(DO36<>\"\",1,\"\")","v":""}]
[]
[]
[null,null,6,null,null,null,{"$f":"IF(DO39<>\"\",IFERROR(VLOOKUP(DO39,Data_PD!$A$4:$U$23,4,FALSE),\"Keine Daten vorhanden!\"),\"\")","v":""},null,null,null,null,null,null,null,null,null,null,null,null,null,null,null,null,null,null,null,null,null,null,null,null,null,null,null,null,null,null,null,null,null,null,null,null,null,null,null,null,null,null,null,null,null,null,null,null,null,null,null,null,null,null,null,{"$f":"IF(DO39<>\"\",IFERROR(TEXT(VLOOKUP(DO39,Data_PD!$A$4:$U$23,5,FALSE),\"TT\"),\"./.\"),\"\")","v":""},null,null,null,null,"•",{"$f":"IF(DO39<>\"\",IFERROR(TEXT(VLOOKUP(DO39,Data_PD!$A$4:$U$23,5,FALSE),\"MM\"),\"./.\"),\"\")","v":""},null,null,null,null,"•",{"$f":"IF(DO39<>\"\",IFERROR(TEXT(VLOOKUP(DO39,Data_PD!$A$4:$U$23,5,FALSE),\"JJJJ\"),\"./.\"),\"\")","v":""},null,null,null,null,null,null,null,null,null,null,null,null,null,null,null,null,null,null,null,null,null,null,null,null,null,null,null,null,null,null,null,null,{"$f":"IF(DO39<>\"\",\"X\",\"\")","v":""},null,null,null,null,null,null,null,null,null,{"$f":"IF(DO39<>\"\",1,\"\")","v":""}]
[]
[]
[null,null,7,null,null,null,{"$f":"IF(DO42<>\"\",IFERROR(VLOOKUP(DO42,Data_PD!$A$4:$U$23,4,FALSE),\"Keine Daten vorhanden!\"),\"\")","v":""},null,null,null,null,null,null,null,null,null,null,null,null,null,null,null,null,null,null,null,null,null,null,null,null,null,null,null,null,null,null,null,null,null,null,null,null,null,null,null,null,null,null,null,null,null,null,null,null,null,null,null,null,null,null,null,{"$f":"IF(DO42<>\"\",IFERROR(TEXT(VLOOKUP(DO42,Data_PD!$A$4:$U$23,5,FALSE),\"TT\"),\"./.\"),\"\")","v":""},null,null,null,null,"•",{"$f":"IF(DO42<>\"\",IFERROR(TEXT(VLOOKUP(DO42,Data_PD!$A$4:$U$23,5,FALSE),\"MM\"),\"./.\"),\"\")","v":""},null,null,null,null,"•",{"$f":"IF(DO42<>\"\",IFERROR(TEXT(VLOOKUP(DO42,Data_PD!$A$4:$U$23,5,FALSE),\"JJJJ\"),\"./.\"),\"\")","v":""},null,null,null,null,null,null,null,null,null,null,null,null,null,null,null,null,null,null,null,null,null,null,null,null,null,null,null,null,null,null,null,null,{"$f":"IF(DO42<>\"\",\"X\",\"\")","v":""},null,null,null,null,null,null,null,null,null,{"$f":"IF(DO42<>\"\",1,\"\")","v":""}]
[]
[]
[null,null,8,null,null,null,{"$f":"IF(DO45<>\"\",IFERROR(VLOOKUP(DO45,Data_PD!$A$4:$U$23,4,FALSE),\"Keine Daten vorhanden!\"),\"\")","v":""},null,null,null,null,null,null,null,null,null,null,null,null,null,null,null,null,null,null,null,null,null,null,null,null,null,null,null,null,null,null,null,null,null,null,null,null,null,null,null,null,null,null,null,null,null,null,null,null,null,null,null,null,null,null,null,{"$f":"IF(DO45<>\"\",IFERROR(TEXT(VLOOKUP(DO45,Data_PD!$A$4:$U$23,5,FALSE),\"TT\"),\"./.\"),\"\")","v":""},null,null,null,null,"•",{"$f":"IF(DO45<>\"\",IFERROR(TEXT(VLOOKUP(DO45,Data_PD!$A$4:$U$23,5,FALSE),\"MM\"),\"./.\"),\"\")","v":""},null,null,null,null,"•",{"$f":"IF(DO45<>\"\",IFERROR(TEXT(VLOOKUP(DO45,Data_PD!$A$4:$U$23,5,FALSE),\"JJJJ\"),\"./.\"),\"\")","v":""},null,null,null,null,null,null,null,null,null,null,null,null,null,null,null,null,null,null,null,null,null,null,null,null,null,null,null,null,null,null,null,null,{"$f":"IF(DO45<>\"\",\"X\",\"\")","v":""},null,null,null,null,null,null,null,null,null,{"$f":"IF(DO45<>\"\",1,\"\")","v":""}]
[]
[]
[null,null,9,null,null,null,{"$f":"IF(DO48<>\"\",IFERROR(VLOOKUP(DO48,Data_PD!$A$4:$U$23,4,FALSE),\"Keine Daten vorhanden!\"),\"\")","v":""},null,null,null,null,null,null,null,null,null,null,null,null,null,null,null,null,null,null,null,null,null,null,null,null,null,null,null,null,null,null,null,null,null,null,null,null,null,null,null,null,null,null,null,null,null,null,null,null,null,null,null,null,null,null,null,{"$f":"IF(DO48<>\"\",IFERROR(TEXT(VLOOKUP(DO48,Data_PD!$A$4:$U$23,5,FALSE),\"TT\"),\"./.\"),\"\")","v":""},null,null,null,null,"•",{"$f":"IF(DO48<>\"\",IFERROR(TEXT(VLOOKUP(DO48,Data_PD!$A$4:$U$23,5,FALSE),\"MM\"),\"./.\"),\"\")","v":""},null,null,null,null,"•",{"$f":"IF(DO48<>\"\",IFERROR(TEXT(VLOOKUP(DO48,Data_PD!$A$4:$U$23,5,FALSE),\"JJJJ\"),\"./.\"),\"\")","v":""},null,null,null,null,null,null,null,null,null,null,null,null,null,null,null,null,null,null,null,null,null,null,null,null,null,null,null,null,null,null,null,null,{"$f":"IF(DO48<>\"\",\"X\",\"\")","v":""},null,null,null,null,null,null,null,null,null,{"$f":"IF(DO48<>\"\",1,\"\")","v":""}]
[]
[]
[null,null,10,null,null,null,{"$f":"IF(DO51<>\"\",IFERROR(VLOOKUP(DO51,Data_PD!$A$4:$U$23,4,FALSE),\"Keine Daten vorhanden!\"),\"\")","v":""},null,null,null,null,null,null,null,null,null,null,null,null,null,null,null,null,null,null,null,null,null,null,null,null,null,null,null,null,null,null,null,null,null,null,null,null,null,null,null,null,null,null,null,null,null,null,null,null,null,null,null,null,null,null,null,{"$f":"IF(DO51<>\"\",IFERROR(TEXT(VLOOKUP(DO51,Data_PD!$A$4:$U$23,5,FALSE),\"TT\"),\"./.\"),\"\")","v":""},null,null,null,null,"•",{"$f":"IF(DO51<>\"\",IFERROR(TEXT(VLOOKUP(DO51,Data_PD!$A$4:$U$23,5,FALSE),\"MM\"),\"./.\"),\"\")","v":""},null,null,null,null,"•",{"$f":"IF(DO51<>\"\",IFERROR(TEXT(VLOOKUP(DO51,Data_PD!$A$4:$U$23,5,FALSE),\"JJJJ\"),\"./.\"),\"\")","v":""},null,null,null,null,null,null,null,null,null,null,null,null,null,null,null,null,null,null,null,null,null,null,null,null,null,null,null,null,null,null,null,null,{"$f":"IF(DO51<>\"\",\"X\",\"\")","v":""},null,null,null,null,null,null,null,null,null,{"$f":"IF(DO51<>\"\",1,\"\")","v":""}]
[]
[]
[null,null,null,null,null,null,"Bestätigung durch das Unternehmen"]
[null,null,null,null,null,null,"Ort, Datum",null,null,null,null,null,null,null,null,null,null,null,null,null,null,null,null,null,null,null,null,null,null,null,null,null,null,null,null,null,null,null,null,null,null,null,null,null,null,null,null,null,null,null,null,null,null,null,null,null,null,null,null,null,null,null,"Stempel, Unterschrift des Unternehmens"]
[]
[]
[]
[]
[]
[null,null,null,null,null,null,"Bestätigung durch die Ausbildungsstelle"]
[]
[null,null,null,null,null,null,null," Abrechenbare Teilnehmeranzahl auf diesem Formular",null,null,null,null,null,null,null,null,null,null,null,null,null,null,null,null,null,null,null,null,null,null,null,null,null,null,null,null,null,null,null,null,null,null,null,null,null,null,null,null,null,null,null,null,null,null,null," Datum des Lehrgangs "]
[]
[null,null,null,null,null,null,null,{"$f":"IF(SUM(DN24:DN51),SUM(DN24:DN51),\"\")","v":""},null,null,null,null,null,null,null,null,null,null,null,null,null,null,null,null,null,null,null,null,null,null,null,null,null,null,null,null,null,null,null,null,null,null,null,null,null,null,null,null,null,null,null,null,null,null,null,null,"vom:",null,null,null,null,{"$f":"IF(Doku!Y34<>\"\",TEXT(Doku!Y34,\"TT.MM.JJJJ\"),\"\")","v":""},null,null,null,null,null,null,null,null,null,null,null,null,null,null,null,null,null,null,null,null,null,null,null,null,"bis:",null,null,null,{"$f":"IF(Doku!CC34<>\"\",TEXT(Doku!CC34,\"TT.MM.JJJJ\"),\"\")","v":""}]
[]
[null,null,null,null,null,null,null," Kennziffer der Ausbildungsstelle",null,null,null,null,null,null,null,null,null,null,null,null,null,null,null,null,null,null,null,null,null,null,null,null,null,null,null,null,null,null,null,null,null,null,null,null,null,null,null,null,null,null,null,null,null,null,null," Name der Lehrkraft "]
[]
[null,null,null,null,null,null,null,{"$f":"IF(Start!N25<>\"\",Start!N25,\"\")","v":""},null,null,null,null,null,null,null,null,null,null,null,null,null,null,null,null,null,null,null,null,null,null,null,null,null,null,null,null,null,null,null,null,null,null,null,null,null,null,null,null,null,null,null,null,null,null,null,{"$f":"IF(Doku!Y28<>\"\",Doku!Y28,\"\")","v":""}]
[]
[null,null,null,null,null,null,null," Registriernummer des Lehrgangs",null,null,null,null,null,null,null,null,null,null,null,null,null,null,null,null,null,null,null,null,null,null,null,null,null,null,null,null,null,null,null,null,null,null,null,null,null,null,null,null,null,null,null,null,null,null,null," Ort des Lehrgangs"]
[]
[null,null,null,null,null,null,null,{"$f":"IF(Doku!Y26<>\"\",Doku!Y26,\"\")","v":""},null,null,null,null,null,null,null,null,null,null,null,null,null,null,null,null,null,null,null,null,null,null,null,null,null,null,null,null,null,null,null,null,null,null,null,null,null,null,null,null,null,null,null,null,null,null,null,{"$f":"CONCATENATE(Doku!BR18,\" \",Doku!BZ18,\", \",Doku!W18)","v":" , "}]
[]
[null,null,null,null,null,null,null," Ort, Datum",null,null,null,null,null,null,null,null,null,null,null,null,null,null,null,null,null,null,null,null,null,null,null,null,null,null,null,null,null,null,null,null,null,null,null,null,null,null,null,null,null,null,null,null,null,null,null," Anschrift, Unterschift der Ausbildungsstelle"]
[]
[null,null,null,null,null,null,null,{"$f":"IF(Start!K20<>\"\",CONCATENATE(Start!K20,\", \",TEXT(Doku!CC34,\"TT.MM.JJJJ\"),\"\"))","v":false},null,null,null,null,null,null,null,null,null,null,null,null,null,null,null,null,null,null,null,null,null,null,null,null,null,null,null,null,null,null,null,null,null,null,null,null,null,null,null,null,null,null,null,null,null,null,null,{"$f":"IF(Start!K14<>\"\",Start!K14,\"\")","v":""}]
[null,null,null,null,null,null,null,null,null,null,null,null,null,null,null,null,null,null,null,null,null,null,null,null,null,null,null,null,null,null,null,null,null,null,null,null,null,null,null,null,null,null,null,null,null,null,null,null,null,null,null,null,null,null,null,{"$f":"IF(Start!K16<>\"\",Start!K16,\"\")","v":""}]
[null,null,null,null,null,null,null,null,null,null,null,null,null,null,null,null,null,null,null,null,null,null,null,null,null,null,null,null,null,null,null,null,null,null,null,null,null,null,null,null,null,null,null,null,null,null,null,null,null,null,null,null,null,null,null,{"$f":"IF(Start!K18<>\"\",CONCATENATE(Start!K18,\" \",Start!K20),\"\")","v":""}]
[]
[]
[]
[null,null,null,null,null,"Die personenbezogenen Daten werden aufgrund des Art. 6 Abs. 1 lit. c und e DSGVO, § 199 Abs. 1 Nr. 5 i.V.m. § 23 SGB VII durch den Unfallversicherungsträger verarbeitet."]

{"sheet":"TNB","index":12,"n_rows":89,"n_cols":34,"rows_kept":89,"cut":false,"hidden":true,"merged":[[5,19,5,21],[5,22,5,29],[40,5,40,29],[17,7,17,11],[18,7,18,11],[17,13,17,15],[18,13,18,15],[17,16,18,18],[18,5,18,6],[18,19,18,20],[24,21,24,29],[24,6,24,20],[20,13,20,29],[21,13,21,28],[22,5,22,29],[31,19,31,29],[31,17,33,18],[31,5,33,16],[28,5,30,29],[26,5,26,17],[26,27,26,29],[10,5,10,29],[12,24,13,24],[12,25,12,29],[12,5,12,23],[13,5,13,23],[17,19,17,20],[35,5,35,16],[35,19,35,29],[34,17,35,18],[34,5,34,16],[34,19,34,29],[23,20,23,29],[23,6,23,19],[7,5,7,29],[8,5,8,29],[9,5,9,29],[11,5,11,29],[17,27,17,29],[86,3,87,27],[86,28,86,30],[87,28,87,30],[80,3,80,27],[80,28,80,30],[81,3,81,27],[81,28,81,30],[82,3,82,27],[82,28,82,30],[77,3,77,27],[77,28,77,30],[78,3,78,27],[78,28,78,30],[79,3,79,27],[79,28,79,30],[74,3,74,27],[26,24,26,26],[26,20,26,22],[13,25,13,29],[74,28,74,30],[75,3,75,27],[21,5,21,12],[41,5,41,29],[88,3,88,27],[88,28,88,30],[89,3,89,27],[89,28,89,30],[83,3,83,27],[83,28,83,30],[84,3,84,27],[84,28,84,30],[85,3,85,27],[85,28,85,30],[75,28,75,30],[76,3,76,27],[76,28,76,30],[71,3,71,27],[71,28,71,30],[72,3,72,27],[72,28,72,30],[73,3,73,27],[73,28,73,30],[68,3,68,27],[68,28,68,30],[69,3,69,27],[69,28,69,30],[70,3,70,27],[70,28,70,30],[65,3,65,27],[65,28,65,30],[66,3,66,27],[66,28,66,30],[67,3,67,27],[67,28,67,30],[61,3,62,27],[61,28,61,30],[62,28,62,30],[63,3,63,27],[64,3,64,27],[64,28,64,30],[58,3,58,27],[58,28,58,30],[59,3,59,27],[59,28,59,30],[60,3,60,27],[60,28,60,30],[56,3,56,27],[56,28,56,30],[57,3,57,27],[57,28,57,30],[52,3,52,27],[52,28,52,30],[53,3,53,27],[53,28,53,30],[54,3,54,27],[54,28,54,30],[42,2,89,2],[42,3,42,27],[42,28,42,30],[43,3,44,27],[43,28,43,30],[44,28,44,30],[36,5,36,29],[37,5,37,29],[39,5,39,29],[49,3,49,27],[49,28,49,30],[50,3,50,27],[50,28,50,30],[51,3,51,27],[51,28,51,30],[45,3,45,27],[45,28,45,30],[46,3,46,27],[46,28,46,30],[47,3,47,27],[48,3,48,27],[48,28,48,30],[55,3,55,27],[55,28,55,30],[5,9,5,18],[1,3,1,29],[2,5,2,29],[3,5,3,29],[3,33,3,35],[4,5,4,29],[17,5,17,6],[38,5,38,29],[33,19,33,29],[32,19,32,29],[27,5,27,29],[19,5,19,29],[25,5,25,29],[20,5,20,12],[14,5,14,29],[15,5,15,29],[16,5,16,29],[18,27,18,29],[17,26,18,26],[17,21,17,25],[18,21,18,25],[3,32,4,32],[5,5,5,8],[6,5,6,29]]}
[{"$f":"IF(Data_PD!A4<>\"\",Data_PD!A4,0)","v":0},null,null,null,null,null,null,null,null,null,null,null,null,null,null,null,null,null,null,null,null,null,null,null,null,null,null,null,null,null,null,null,{"$f":"IF(OR(Data_LD!B24=1,Data_LD!B24=2,Data_LD!B24=3,Data_LD!B24=5,Data_LD!B24=7,Data_LD!B24=8,Data_LD!B24=9,,Data_LD!B24=10),Data_UR!B50,0)","v":0}]
[{"$f":"IF(Data_PD!A5<>\"\",Data_PD!A5,0)","v":0}]
[{"$f":"IF(Data_PD!A6<>\"\",Data_PD!A6,0)","v":0}]
[{"$f":"IF(Data_PD!A7<>\"\",Data_PD!A7,0)","v":0},null,null,null,null,{"$f":"IF(AG1<>0,VLOOKUP(AG1,Data_TNB!A4:AX23,4,FALSE),\"\")","v":""},null,null,null,null,null,null,null,null,null,null,null,null,null,null,null,null,null,null,null,null,null,null,null,null,null,null,1,"  Lfd-Nr. für den Einzeldruck\n  Nummer aus der Teilnehmerliste"]
[{"$f":"IF(Data_PD!A8<>\"\",Data_PD!A8,0)","v":0}]
[{"$f":"IF(Data_PD!A9<>\"\",Data_PD!A9,0)","v":0},null,null,null,null,{"$f":"IF(AG1<>0,\"Reg.-Nr.:\",\"\")","v":""},null,null,null,{"$f":"IF(AG4<>0,VLOOKUP(TNB!AG4,Data_PD!A4:U23,14,FALSE),\"\")","v":{"$error":"#N/A"}},null,null,null,null,null,null,null,null,null,{"$f":"IF(OR(AG1=1,AG1=2,AG1=3,AG1=4,AG1=5),\"(DLRG)\",\"\")","v":""}]
[{"$f":"IF(Data_PD!A10<>\"\",Data_PD!A10,0)","v":0}]
[{"$f":"IF(Data_PD!A11<>\"\",Data_PD!A11,0)","v":0}]
[{"$f":"IF(Data_PD!A12<>\"\",Data_PD!A12,0)","v":0},null,null,null,null,{"$f":"IF(AG1<>0,VLOOKUP(AG1,Data_TNB!A4:AX23,7,FALSE),\"\")","v":""}]
[{"$f":"IF(Data_PD!A13<>\"\",Data_PD!A13,0)","v":0},null,null,null,null,{"$f":"IF(AG1<>0,VLOOKUP(AG1,Data_TNB!A4:AX23,8,FALSE),\"\")","v":""}]
[{"$f":"IF(Data_PD!A14<>\"\",Data_PD!A14,0)","v":0}]
[{"$f":"IF(Data_PD!A15<>\"\",Data_PD!A15,0)","v":0}]
[{"$f":"IF(Data_PD!A16<>\"\",Data_PD!A16,0)","v":0},null,null,null,null,{"$f":"IF(AG4<>0,VLOOKUP(AG4,Data_PD!A4:U23,4,FALSE),\"\")","v":{"$error":"#N/A"}},null,null,null,null,null,null,null,null,null,null,null,null,null,null,null,null,null,null,null,{"$f":"IF(AG4<>0,VLOOKUP(AG4,Data_PD!A4:U23,5,FALSE),\"\")","v":{"$error":"#N/A"}}]
[{"$f":"IF(Data_PD!A17<>\"\",Data_PD!A17,0)","v":0},null,null,null,null,{"$f":"IF(AG1<>0,\"Name, Vorname\",\"\")","v":""},null,null,null,null,null,null,null,null,null,null,null,null,null,null,null,null,null,null,null,{"$f":"IF(AG1<>0,\"Geburtsdatum\",\"\")","v":""}]
[{"$f":"IF(Data_PD!A18<>\"\",Data_PD!A18,0)","v":0}]
[{"$f":"IF(Data_PD!A19<>\"\",Data_PD!A19,0)","v":0},null,null,null,null,{"$f":"IF(AG1<>0,VLOOKUP(AG1,Data_UR!A73:AS92,9,FALSE),\"\")","v":""}]
[{"$f":"IF(Data_PD!A20<>\"\",Data_PD!A20,0)","v":0}]
[{"$f":"IF(Data_PD!A21<>\"\",Data_PD!A21,0)","v":0},null,null,null,null,{"$f":"IF(AG1<>0,\"vom:\",\"\")","v":""},null,{"$f":"IF(AG4<>0,Doku!Y34,\"\")","v":"00:00:00"},null,null,null,null,null,{"$f":"IF(OR(AG1=1,AG1=2,AG1=3,AG1=4,AG1=5,AG1=6,AG1=7,AG1=8,AG1=9,AG1=10),Doku!AO34,\"\")","v":""},null,null,null,null,null,{"$f":"IF(AG1<>0,\"bis:\",\"\")","v":""},null,{"$f":"IF(AG4<>0,Doku!CC34,\"\")","v":"00:00:00"},null,null,null,null,null,{"$f":"IF(OR(AG1=1,AG1=2,AG1=3,AG1=4,AG1=5,AG1=6,AG1=7,AG1=8,AG1=9,AG1=10),Doku!CS34,\"\")","v":""}]
[{"$f":"IF(Data_PD!A22<>\"\",Data_PD!A22,0)","v":0},null,null,null,null,null,null,{"$f":"IF(AG1<>0,\"Datum\",\"\")","v":""},null,null,null,null,null,{"$f":"IF(OR(AG1=1,AG1=2,AG1=3,AG1=4,AG1=5,AG1=6,AG1=7,AG1=8,AG1=9,AG1=10),\"Uhrzeit\",\"\")","v":""},null,null,null,null,null,null,null,{"$f":"IF(AG1<>0,\"Datum\",\"\")","v":""},null,null,null,null,null,{"$f":"IF(OR(AG1=1,AG1=2,AG1=3,AG1=4,AG1=5,AG1=6,AG1=7,AG1=8,AG1=9,AG1=10),\"Uhrzeit\",\"\")","v":""}]
[{"$f":"IF(Data_PD!A23<>\"\",Data_PD!A23,0)","v":0}]
[null,null,null,null,null,{"$f":"IF(AG1<>0,\"unter der Leitung von:\",\"\")","v":""},null,null,null,null,null,null,null,{"$f":"IF(AG4<>0,IF(Doku!Y28<>\"\",Doku!Y28,\"\"),\"\")","v":""}]
[null,null,null,null,null,null,null,null,null,null,null,null,null,{"$f":"IF(AG1<>0,VLOOKUP(AG1,Data_TNB!A4:AX23,15,FALSE),\"\")","v":""}]
[]
[null,null,null,null,null,{"$f":"IF(AG1<>0,\"in:\",\"\")","v":""},{"$f":"IF(AG4<>0,CONCATENATE(Doku!BR18,\" \",Doku!BZ18,\"\"))","v":" "},null,null,null,null,null,null,null,null,null,null,null,null,null,{"$f":"IF(AG1<>0,\"erfolgreich teilgenommen.\",\"\")","v":""}]
[null,null,null,null,null,null,{"$f":"IF(AG1<>0,VLOOKUP(AG1,Data_TNB!A4:AX23,14,FALSE),\"\")","v":""}]
[]
[null,null,null,null,null,{"$f":"IF(AG1<>0,\"Teilnehmerunterlagen ausgehändigt:\",\"\")","v":""},null,null,null,null,null,null,null,null,null,null,null,null,null,{"$f":"IF(AG1<>0,\"X\",\"\")","v":""},{"$f":"IF(AG1<>0,\" Ja\",\"\")","v":""},null,null,null,{"$f":"IF(AG1<>0,\" Nein\",\"\")","v":""}]
[]
[null,null,null,null,null,{"$f":"IF(AG1<>0,VLOOKUP(AG1,Data_TNB!A4:AX23,10,FALSE),\"\")","v":""}]
[]
[]
[]
[]
[]
[null,null,null,null,null,{"$f":"IF(AG1<>0,CONCATENATE(Doku!BZ18,\", \",TEXT(Doku!CC34,\"TT.MM.JJJJ\")),\"\")","v":""}]
[null,null,null,null,null,{"$f":"IF(AG1<>0,\"Ort, Datum\",\"\")","v":""},null,null,null,null,null,null,null,null,null,null,null,null,null,{"$f":"IF(AG1<>0,VLOOKUP(AG1,Data_TNB!A4:AX23,16,FALSE),\"\")","v":""}]
[]
[null,null,null,null,null,{"$f":"IF(AG1<>0,VLOOKUP(AG1,Data_TNB!A4:AX23,11,FALSE),\"\")","v":""}]
[null,null,null,null,null,{"$f":"IF(AG1<>0,VLOOKUP(AG1,Data_TNB!A4:AX23,13,FALSE),\"\")","v":""}]
[null,null,null,null,null,{"$f":"IF(AG1<>0,VLOOKUP(AG1,Data_TNB!A4:AX23,12,FALSE),\"\")","v":""}]
[]
[]
[]
[null,null,null,{"$f":"IF($AG$1<>0,VLOOKUP($AG$1,Data_UR!$A$30:$AS$49,7,FALSE),\"\")","v":""}]
[]
[]
[null,null,null,"Voraussetzungen (gesonderte Nachweise)"]
[]
[null,null,null,{"$f":"IF($AG$1<>0,VLOOKUP($AG$1,Data_UR!$A$30:$AQ$49,9,FALSE),\"\")","v":""}]
[null,null,null,{"$f":"IF($AG$1<>0,VLOOKUP($AG$1,Data_UR!$A$30:$AQ$49,10,FALSE),\"\")","v":""}]
[null,null,null,{"$f":"IF($AG$1<>0,VLOOKUP($AG$1,Data_UR!$A$30:$AQ$49,11,FALSE),\"\")","v":""}]
[null,null,null,{"$f":"IF($AG$1<>0,VLOOKUP($AG$1,Data_UR!$A$30:$AQ$49,12,FALSE),\"\")","v":""}]
[null,null,null,{"$f":"IF($AG$1<>0,VLOOKUP($AG$1,Data_UR!$A$30:$AQ$49,13,FALSE),\"\")","v":""}]
[null,null,null,{"$f":"IF($AG$1<>0,VLOOKUP($AG$1,Data_UR!$A$30:$AQ$49,14,FALSE),\"\")","v":""}]
[null,null,null,{"$f":"IF($AG$1<>0,VLOOKUP($AG$1,Data_UR!$A$30:$AQ$49,15,FALSE),\"\")","v":""}]
[null,null,null,{"$f":"IF($AG$1<>0,VLOOKUP($AG$1,Data_UR!$A$30:$AQ$49,16,FALSE),\"\")","v":""}]
[null,null,null,{"$f":"IF($AG$1<>0,VLOOKUP($AG$1,Data_UR!$A$30:$AQ$49,17,FALSE),\"\")","v":""}]
[null,null,null,{"$f":"IF($AG$1<>0,VLOOKUP($AG$1,Data_UR!$A$30:$AQ$49,18,FALSE),\"\")","v":""}]
[null,null,null,{"$f":"IF($AG$1<>0,VLOOKUP($AG$1,Data_UR!$A$30:$AQ$49,19,FALSE),\"\")","v":""}]
[null,null,null,{"$f":"IF($AG$1<>0,VLOOKUP($AG$1,Data_UR!$A$30:$AQ$49,20,FALSE),\"\")","v":""}]
[]
[null,null,null,{"$f":"IF($AG$1<>0,VLOOKUP($AG$1,Data_UR!$A$30:$AQ$49,22,FALSE),\"\")","v":""}]
[]
[]
[null,null,null,{"$f":"IF($AG$1<>0,VLOOKUP($AG$1,Data_UR!$A$30:$AQ$49,23,FALSE),\"\")","v":""}]
[null,null,null,{"$f":"IF($AG$1<>0,VLOOKUP($AG$1,Data_UR!$A$30:$AQ$49,24,FALSE),\"\")","v":""}]
[null,null,null,{"$f":"IF($AG$1<>0,VLOOKUP($AG$1,Data_UR!$A$30:$AQ$49,25,FALSE),\"\")","v":""}]
[null,null,null,{"$f":"IF($AG$1<>0,VLOOKUP($AG$1,Data_UR!$A$30:$AQ$49,26,FALSE),\"\")","v":""}]
[null,null,null,{"$f":"IF($AG$1<>0,VLOOKUP($AG$1,Data_UR!$A$30:$AQ$49,27,FALSE),\"\")","v":""}]
[null,null,null,{"$f":"IF($AG$1<>0,VLOOKUP($AG$1,Data_UR!$A$30:$AQ$49,28,FALSE),\"\")","v":""}]
[null,null,null,{"$f":"IF($AG$1<>0,VLOOKUP($AG$1,Data_UR!$A$30:$AQ$49,29,FALSE),\"\")","v":""}]
[null,null,null,{"$f":"IF($AG$1<>0,VLOOKUP($AG$1,Data_UR!$A$30:$AQ$49,30,FALSE),\"\")","v":""}]
[null,null,null,{"$f":"IF($AG$1<>0,VLOOKUP($AG$1,Data_UR!$A$30:$AQ$49,31,FALSE),\"\")","v":""}]
[null,null,null,{"$f":"IF($AG$1<>0,VLOOKUP($AG$1,Data_UR!$A$30:$AQ$49,32,FALSE),\"\")","v":""}]
[null,null,null,{"$f":"IF($AG$1<>0,VLOOKUP($AG$1,Data_UR!$A$30:$AQ$49,33,FALSE),\"\")","v":""}]
[null,null,null,{"$f":"IF($AG$1<>0,VLOOKUP($AG$1,Data_UR!$A$30:$AQ$49,34,FALSE),\"\")","v":""}]
[null,null,null,{"$f":"IF($AG$1<>0,VLOOKUP($AG$1,Data_UR!$A$30:$AQ$49,35,FALSE),\"\")","v":""}]
[null,null,null,{"$f":"IF($AG$1<>0,VLOOKUP($AG$1,Data_UR!$A$30:$AQ$49,36,FALSE),\"\")","v":""}]
[null,null,null,{"$f":"IF($AG$1<>0,VLOOKUP($AG$1,Data_UR!$A$30:$AQ$49,37,FALSE),\"\")","v":""}]
[null,null,null,{"$f":"IF($AG$1<>0,VLOOKUP($AG$1,Data_UR!$A$30:$AQ$49,38,FALSE),\"\")","v":""}]
[null,null,null,{"$f":"IF($AG$1<>0,VLOOKUP($AG$1,Data_UR!$A$30:$AQ$49,39,FALSE),\"\")","v":""}]
[null,null,null,{"$f":"IF($AG$1<>0,VLOOKUP($AG$1,Data_UR!$A$30:$AQ$49,40,FALSE),\"\")","v":""}]
[null,null,null,{"$f":"IF($AG$1<>0,VLOOKUP($AG$1,Data_UR!$A$30:$AQ$49,41,FALSE),\"\")","v":""}]
[null,null,null,{"$f":"IF($AG$1<>0,VLOOKUP($AG$1,Data_UR!$A$30:$AQ$49,42,FALSE),\"\")","v":""}]
[]
[]
[null,null,null,{"$f":"IF($AG$1<>0,VLOOKUP($AG$1,Data_UR!$A$30:$AQ$49,43,FALSE),\"\")","v":""}]
[]
[null,null,null,{"$f":"IF(AG1<>0,CONCATENATE(Doku!$W$8,\" • \",Doku!$W$10,\" • \",Doku!$BR$10,\" \",Doku!$BZ$10),\"\")","v":""}]

{"sheet":"TNB_2","index":13,"n_rows":91,"n_cols":59,"rows_kept":91,"cut":false,"hidden":true,"merged":[[42,5,42,19],[42,36,42,50],[37,36,37,60],[38,36,38,60],[39,36,39,60],[40,36,40,60],[34,36,34,47],[34,48,35,49],[34,50,34,60],[35,36,35,47],[35,50,35,60],[36,36,36,60],[27,36,27,60],[28,36,30,60],[31,36,33,47],[31,48,33,49],[31,50,31,60],[32,50,32,60],[33,50,33,60],[23,37,23,51],[23,52,23,60],[24,37,24,51],[24,52,24,60],[25,36,25,60],[26,36,26,48],[26,51,26,53],[26,55,26,57],[26,58,26,60],[19,36,19,60],[20,36,20,43],[20,44,20,60],[21,36,21,43],[21,44,21,59],[22,36,22,60],[17,58,17,60],[18,36,18,37],[18,38,18,42],[18,44,18,46],[18,50,18,51],[18,52,18,56],[18,58,18,60],[14,36,14,60],[15,36,15,60],[16,36,16,60],[17,36,17,37],[17,38,17,42],[17,44,17,46],[17,47,18,49],[17,50,17,51],[17,52,17,56],[17,57,18,57],[9,36,9,60],[10,36,10,60],[11,36,11,60],[12,36,12,54],[12,55,13,55],[12,56,12,60],[13,36,13,54],[13,56,13,60],[2,36,2,60],[3,36,3,60],[4,36,4,60],[5,36,5,39],[5,40,5,48],[5,50,5,60],[6,36,6,60],[7,36,7,60],[8,36,8,60],[91,3,91,27],[91,28,91,30],[87,3,87,27],[87,28,87,30],[88,3,89,27],[88,28,88,30],[89,28,89,30],[90,3,90,27],[90,28,90,30],[84,3,84,27],[84,28,84,30],[85,3,85,27],[85,28,85,30],[86,3,86,27],[86,28,86,30],[81,3,81,27],[81,28,81,30],[82,3,82,27],[82,28,82,30],[83,3,83,27],[83,28,83,30],[78,3,78,27],[78,28,78,30],[79,3,79,27],[79,28,79,30],[80,3,80,27],[80,28,80,30],[75,3,75,27],[75,28,75,30],[76,3,76,27],[76,28,76,30],[77,3,77,27],[77,28,77,30],[72,3,72,27],[72,28,72,30],[73,3,73,27],[73,28,73,30],[74,3,74,27],[74,28,74,30],[69,3,69,27],[69,28,69,30],[70,3,70,27],[70,28,70,30],[71,3,71,27],[71,28,71,30],[66,3,66,27],[66,28,66,30],[67,3,67,27],[67,28,67,30],[68,3,68,27],[68,28,68,30],[62,3,62,27],[62,28,62,30],[63,3,64,27],[63,28,63,30],[64,28,64,30],[65,3,65,27],[59,3,59,27],[59,28,59,30],[60,3,60,27],[60,28,60,30],[61,3,61,27],[61,28,61,30],[56,3,56,27],[56,28,56,30],[57,3,57,27],[57,28,57,30],[58,3,58,27],[58,28,58,30],[54,28,54,30],[55,3,55,27],[55,28,55,30],[50,3,50,27],[50,28,50,30],[51,3,51,27],[51,28,51,30],[52,3,52,27],[52,28,52,30],[44,2,91,2],[44,3,44,27],[44,28,44,30],[45,3,46,27],[45,28,45,30],[34,5,34,16],[34,17,35,18],[34,19,34,29],[35,5,35,16],[35,19,35,29],[36,5,36,29],[46,28,46,30],[47,3,47,27],[47,28,47,30],[48,3,48,27],[48,28,48,30],[49,3,49,27],[37,5,37,29],[38,5,38,29],[39,5,39,29],[40,5,40,29],[53,3,53,27],[53,28,53,30],[54,3,54,27],[27,5,27,29],[28,5,30,29],[31,5,33,16],[31,17,33,18],[31,19,31,29],[32,19,32,29],[33,19,33,29],[23,6,23,20],[23,21,23,29],[24,6,24,20],[24,21,24,29],[25,5,25,29],[26,5,26,17],[26,20,26,22],[26,24,26,26],[26,27,26,29],[19,5,19,29],[20,5,20,12],[20,13,20,29],[21,5,21,12],[21,13,21,28],[22,5,22,29],[17,27,17,29],[18,5,18,6],[18,7,18,11],[18,13,18,15],[18,19,18,20],[18,21,18,25],[18,27,18,29],[14,5,14,29],[15,5,15,29],[16,5,16,29],[17,5,17,6],[17,7,17,11],[17,13,17,15],[17,16,18,18],[17,19,17,20],[17,21,17,25],[17,26,18,26],[1,3,1,29],[2,5,2,29],[3,5,3,29],[4,5,4,29],[9,5,9,29],[10,5,10,29],[11,5,11,29],[12,5,12,23],[12,24,13,24],[12,25,12,29],[13,5,13,23],[13,25,13,29],[5,5,5,8],[5,9,5,17],[5,19,5,29],[6,5,6,29],[7,5,7,29],[8,5,8,29]]}
[{"$f":"IF(Data_PD!A4<>\"\",Data_PD!A4,0)","v":0},null,null,null,null,null,null,null,null,null,null,null,null,null,null,null,null,null,null,null,null,null,null,null,null,null,null,null,null,null,null,null,{"$f":"IF(OR(Data_LD!B24=1,Data_LD!B24=2,Data_LD!B24=3,Data_LD!B24=5,Data_LD!B24=7,Data_LD!B24=8,Data_LD!B24=9,,Data_LD!B24=10),Data_UR!B50,0)","v":0}]
[{"$f":"IF(Data_PD!A5<>\"\",Data_PD!A5,0)","v":0}]
[{"$f":"IF(Data_PD!A6<>\"\",Data_PD!A6,0)","v":0}]
[{"$f":"IF(Data_PD!A7<>\"\",Data_PD!A7,0)","v":0},null,null,null,null,{"$f":"IF(AG1<>0,VLOOKUP(AG1,Data_TNB!A4:AX23,4,FALSE),\"\")","v":""},null,null,null,null,null,null,null,null,null,null,null,null,null,null,null,null,null,null,null,null,null,null,null,null,null,null,null,null,null,null,{"$f":"IF(AG1<>0,VLOOKUP(AG1,Data_TNB!A4:AX23,4,FALSE),\"\")","v":""}]
[{"$f":"IF(Data_PD!A8<>\"\",Data_PD!A8,0)","v":0}]
[{"$f":"IF(Data_PD!A9<>\"\",Data_PD!A9,0)","v":0},null,null,null,null,{"$f":"IF($AG$1<>0,\"Reg.-Nr.:\",\"\")","v":""},null,null,null,{"$f":"IF(TNB!$AG$4<>0,VLOOKUP(TNB!$AG$4,Data_PD!$A$4:$U$23,14,FALSE),\"\")","v":{"$error":"#N/A"}},null,null,null,null,null,null,null,null,null,null,null,null,null,null,null,null,null,null,null,null,null,null,null,null,null,null,{"$f":"IF($AG$1<>0,\"Reg.-Nr.:\",\"\")","v":""},null,null,null,{"$f":"IF(TNB!$AG$4<>0,VLOOKUP(TNB!$AG$4,Data_PD!$A$4:$U$23,14,FALSE),\"\")","v":{"$error":"#N/A"}}]
[{"$f":"IF(Data_PD!A10<>\"\",Data_PD!A10,0)","v":0}]
[{"$f":"IF(Data_PD!A11<>\"\",Data_PD!A11,0)","v":0}]
[{"$f":"IF(Data_PD!A12<>\"\",Data_PD!A12,0)","v":0},null,null,null,null,{"$f":"IF(AG1<>0,VLOOKUP(AG1,Data_TNB!A4:AX23,7,FALSE),\"\")","v":""},null,null,null,null,null,null,null,null,null,null,null,null,null,null,null,null,null,null,null,null,null,null,null,null,null,null,null,null,null,null,{"$f":"IF(AG1<>0,VLOOKUP(AG1,Data_TNB!A4:AX23,7,FALSE),\"\")","v":""}]
[{"$f":"IF(Data_PD!A13<>\"\",Data_PD!A13,0)","v":0},null,null,null,null,{"$f":"IF(AG1<>0,VLOOKUP(AG1,Data_TNB!A4:AX23,8,FALSE),\"\")","v":""},null,null,null,null,null,null,null,null,null,null,null,null,null,null,null,null,null,null,null,null,null,null,null,null,null,null,null,null,null,null,{"$f":"IF(AG1<>0,VLOOKUP(AG1,Data_TNB!A4:AX23,8,FALSE),\"\")","v":""}]
[{"$f":"IF(Data_PD!A14<>\"\",Data_PD!A14,0)","v":0}]
[{"$f":"IF(Data_PD!A15<>\"\",Data_PD!A15,0)","v":0}]
[{"$f":"IF(Data_PD!A16<>\"\",Data_PD!A16,0)","v":0},null,null,null,null,{"$f":"IF(TNB!$AG$4<>0,VLOOKUP(TNB!$AG$4,Data_PD!$A$4:$U$23,4,FALSE),\"\")","v":{"$error":"#N/A"}},null,null,null,null,null,null,null,null,null,null,null,null,null,null,null,null,null,null,null,{"$f":"IF(TNB!$AG$4<>0,VLOOKUP(TNB!$AG$4,Data_PD!$A$4:$U$23,5,FALSE),\"\")","v":{"$error":"#N/A"}},null,null,null,null,null,null,null,null,null,null,{"$f":"IF(TNB!$AG$4<>0,VLOOKUP(TNB!$AG$4,Data_PD!$A$4:$U$23,4,FALSE),\"\")","v":{"$error":"#N/A"}},null,null,null,null,null,null,null,null,null,null,null,null,null,null,null,null,null,null,null,{"$f":"IF(TNB!$AG$4<>0,VLOOKUP(TNB!$AG$4,Data_PD!$A$4:$U$23,5,FALSE),\"\")","v":{"$error":"#N/A"}}]
[{"$f":"IF(Data_PD!A17<>\"\",Data_PD!A17,0)","v":0},null,null,null,null,{"$f":"IF($AG$1<>0,\"Name, Vorname\",\"\")","v":""},null,null,null,null,null,null,null,null,null,null,null,null,null,null,null,null,null,null,null,{"$f":"IF($AG$1<>0,\"Geburtsdatum\",\"\")","v":""},null,null,null,null,null,null,null,null,null,null,{"$f":"IF($AG$1<>0,\"Name, Vorname\",\"\")","v":""},null,null,null,null,null,null,null,null,null,null,null,null,null,null,null,null,null,null,null,{"$f":"IF($AG$1<>0,\"Geburtsdatum\",\"\")","v":""}]
[{"$f":"IF(Data_PD!A18<>\"\",Data_PD!A18,0)","v":0}]
[{"$f":"IF(Data_PD!A19<>\"\",Data_PD!A19,0)","v":0},null,null,null,null,{"$f":"IF(AG1<>0,VLOOKUP(AG1,Data_UR!A73:AS92,9,FALSE),\"\")","v":""},null,null,null,null,null,null,null,null,null,null,null,null,null,null,null,null,null,null,null,null,null,null,null,null,null,null,null,null,null,null,{"$f":"IF(AG1<>0,VLOOKUP(AG1,Data_UR!A73:AS92,9,FALSE),\"\")","v":""}]
[{"$f":"IF(Data_PD!A20<>\"\",Data_PD!A20,0)","v":0}]
[{"$f":"IF(Data_PD!A22<>\"\",Data_PD!A22,0)","v":0},null,null,null,null,{"$f":"IF($AG$1<>0,\"vom:\",\"\")","v":""},null,{"$f":"IF(TNB!$AG$4<>0,Doku!$Y$34,\"\")","v":"00:00:00"},null,null,null,null,null,{"$f":"IF(OR(TNB!$AG$4=3,TNB!$AG$4=6),\"\",Doku!$AO$34)","v":"00:00:00"},null,null,null,null,null,{"$f":"IF($AG$1<>0,\"bis:\",\"\")","v":""},null,{"$f":"IF(TNB!$AG$4<>0,Doku!$CC$34,\"\")","v":"00:00:00"},null,null,null,null,null,{"$f":"IF(OR(TNB!$AG$4=3,TNB!$AG$4=6),\"\",Doku!$CS$34)","v":"00:00:00"},null,null,null,null,null,null,null,null,{"$f":"IF($AG$1<>0,\"vom:\",\"\")","v":""},null,{"$f":"IF(TNB!$AG$4<>0,Doku!$Y$34,\"\")","v":"00:00:00"},null,null,null,null,null,{"$f":"IF(OR(TNB!$AG$4=3,TNB!$AG$4=6),\"\",Doku!$AO$34)","v":"00:00:00"},null,null,null,null,null,{"$f":"IF($AG$1<>0,\"bis:\",\"\")","v":""},null,{"$f":"IF(TNB!$AG$4<>0,Doku!$CC$34,\"\")","v":"00:00:00"},null,null,null,null,null,{"$f":"IF(OR(TNB!$AG$4=3,TNB!$AG$4=6),\"\",Doku!$CS$34)","v":"00:00:00"}]
[{"$f":"IF(Data_PD!A23<>\"\",Data_PD!A23,0)","v":0},null,null,null,null,null,null,{"$f":"IF($AG$1<>0,\"Datum\",\"\")","v":""},null,null,null,null,null,{"$f":"IF(OR(TNB!$AG$4=3,TNB!$AG$4=6),\"\",\"Uhrzeit\")","v":"Uhrzeit"},null,null,null,null,null,null,null,{"$f":"IF($AG$1<>0,\"Datum\",\"\")","v":""},null,null,null,null,null,{"$f":"IF(OR(TNB!$AG$4=3,$AI$1=6),\"\",\"Uhrzeit\")","v":"Uhrzeit"},null,null,null,null,null,null,null,null,null,null,{"$f":"IF($AG$1<>0,\"Datum\",\"\")","v":""},null,null,null,null,null,{"$f":"IF(OR(TNB!$AG$4=3,TNB!$AG$4=6),\"\",\"Uhrzeit\")","v":"Uhrzeit"},null,null,null,null,null,null,null,{"$f":"IF($AG$1<>0,\"Datum\",\"\")","v":""},null,null,null,null,null,{"$f":"IF(OR(TNB!$AG$4=3,$AI$1=6),\"\",\"Uhrzeit\")","v":"Uhrzeit"}]
[]
[null,null,null,null,null,{"$f":"IF($AG$1<>0,\"unter der Leitung von:\",\"\")","v":""},null,null,null,null,null,null,null,{"$f":"IF(TNB!$AG$4<>0,IF(Doku!$Y$28<>\"\",Doku!$Y$28,\"\"),\"\")","v":""},null,null,null,null,null,null,null,null,null,null,null,null,null,null,null,null,null,null,null,null,null,null,{"$f":"IF($AG$1<>0,\"unter der Leitung von:\",\"\")","v":""},null,null,null,null,null,null,null,{"$f":"IF(TNB!$AG$4<>0,IF(Doku!$Y$28<>\"\",Doku!$Y$28,\"\"),\"\")","v":""}]
[null,null,null,null,null,null,null,null,null,null,null,null,null,{"$f":"IF(AG1<>0,VLOOKUP(AG1,Data_TNB!A4:AX23,15,FALSE),\"\")","v":""},null,null,null,null,null,null,null,null,null,null,null,null,null,null,null,null,null,null,null,null,null,null,null,null,null,null,null,null,null,null,{"$f":"IF(AG1<>0,VLOOKUP(AG1,Data_TNB!A4:AX23,15,FALSE),\"\")","v":""}]
[]
[null,null,null,null,null,{"$f":"IF($AG$1<>0,\"in:\",\"\")","v":""},{"$f":"IF(TNB!$AG$4<>0,CONCATENATE(Doku!$BR$18,\" \",Doku!$BZ$18,\"\"))","v":" "},null,null,null,null,null,null,null,null,null,null,null,null,null,null,{"$f":"IF($AG$1<>0,\"erfolgreich teilgenommen.\",\"\")","v":""},null,null,null,null,null,null,null,null,null,null,null,null,null,null,{"$f":"IF($AG$1<>0,\"in:\",\"\")","v":""},{"$f":"IF(TNB!$AG$4<>0,CONCATENATE(Doku!$BR$18,\" \",Doku!$BZ$18,\"\"))","v":" "},null,null,null,null,null,null,null,null,null,null,null,null,null,null,{"$f":"IF($AG$1<>0,\"erfolgreich teilgenommen.\",\"\")","v":""}]
[null,null,null,null,null,null,{"$f":"IF(AG1<>0,VLOOKUP(AG1,Data_TNB!A4:AX23,14,FALSE),\"\")","v":""},null,null,null,null,null,null,null,null,null,null,null,null,null,null,null,null,null,null,null,null,null,null,null,null,null,null,null,null,null,null,{"$f":"IF(AG1<>0,VLOOKUP(AG1,Data_TNB!A4:AX23,14,FALSE),\"\")","v":""}]
[]
[null,null,null,null,null,{"$f":"IF($AG$1<>0,\"Teilnehmerunterlagen ausgehändigt:\",\"\")","v":""},null,null,null,null,null,null,null,null,null,null,null,null,null,{"$f":"IF($AG$1<>0,\"X\",\"\")","v":""},{"$f":"IF($AG$1<>0,\" Ja\",\"\")","v":""},null,null,null,{"$f":"IF($AG$1<>0,\" Nein\",\"\")","v":""},null,null,null,null,null,null,null,null,null,null,null,{"$f":"IF($AG$1<>0,\"Teilnehmerunterlagen ausgehändigt:\",\"\")","v":""},null,null,null,null,null,null,null,null,null,null,null,null,null,{"$f":"IF($AG$1<>0,\"X\",\"\")","v":""},{"$f":"IF($AG$1<>0,\" Ja\",\"\")","v":""},null,null,null,{"$f":"IF($AG$1<>0,\" Nein\",\"\")","v":""}]
[]
[null,null,null,null,null,{"$f":"IF(AG1<>0,VLOOKUP(AG1,Data_TNB!A4:AX23,10,FALSE),\"\")","v":""},null,null,null,null,null,null,null,null,null,null,null,null,null,null,null,null,null,null,null,null,null,null,null,null,null,null,null,null,null,null,{"$f":"IF(AG1<>0,VLOOKUP(AG1,Data_TNB!A4:AX23,10,FALSE),\"\")","v":""}]
[]
[]
[]
[]
[]
[null,null,null,null,null,{"$f":"IF($AG$1<>0,CONCATENATE(Doku!$BZ$18,\", \",TEXT(Doku!$CC$34,\"TT.MM.JJJJ\")),\"\")","v":""},null,null,null,null,null,null,null,null,null,null,null,null,null,null,null,null,null,null,null,null,null,null,null,null,null,null,null,null,null,null,{"$f":"IF($AG$1<>0,CONCATENATE(Doku!$BZ$18,\", \",TEXT(Doku!$CC$34,\"TT.MM.JJJJ\")),\"\")","v":""}]
[null,null,null,null,null,{"$f":"IF($AG$1<>0,\"Ort, Datum\",\"\")","v":""},null,null,null,null,null,null,null,null,null,null,null,null,null,{"$f":"IF(AG1<>0,VLOOKUP(AG1,Data_TNB!A4:AX23,16,FALSE),\"\")","v":""},null,null,null,null,null,null,null,null,null,null,null,null,null,null,null,null,{"$f":"IF($AG$1<>0,\"Ort, Datum\",\"\")","v":""},null,null,null,null,null,null,null,null,null,null,null,null,null,{"$f":"IF(AG1<>0,VLOOKUP(AG1,Data_TNB!A4:AX23,16,FALSE),\"\")","v":""}]
[]
[null,null,null,null,null,{"$f":"IF(AG1<>0,VLOOKUP(AG1,Data_TNB!A4:AX23,11,FALSE),\"\")","v":""},null,null,null,null,null,null,null,null,null,null,null,null,null,null,null,null,null,null,null,null,null,null,null,null,null,null,null,null,null,null,{"$f":"IF(AG1<>0,VLOOKUP(AG1,Data_TNB!A4:AX23,11,FALSE),\"\")","v":""}]
[null,null,null,null,null,{"$f":"IF(AG1<>0,VLOOKUP(AG1,Data_TNB!A4:AX23,12,FALSE),\"\")","v":""},null,null,null,null,null,null,null,null,null,null,null,null,null,null,null,null,null,null,null,null,null,null,null,null,null,null,null,null,null,null,{"$f":"IF(AG1<>0,VLOOKUP(AG1,Data_TNB!A4:AX23,12,FALSE),\"\")","v":""}]
[null,null,null,null,null,{"$f":"IF(AG1<>0,VLOOKUP(AG1,Data_TNB!A4:AX23,13,FALSE),\"\")","v":""},null,null,null,null,null,null,null,null,null,null,null,null,null,null,null,null,null,null,null,null,null,null,null,null,null,null,null,null,null,null,{"$f":"IF(AG1<>0,VLOOKUP(AG1,Data_TNB!A4:AX23,13,FALSE),\"\")","v":""}]
[]
[]
[]
[]
[]
[null,null,null,{"$f":"IF($AI$1<>0,VLOOKUP($AI$1,Data_UR!$A$30:$AS$49,7,FALSE),\"\")","v":""}]
[]
[]
[null,null,null,"Voraussetzungen (gesonderte Nachweise)"]
[]
[null,null,null,{"$f":"IF($AI$1<>0,VLOOKUP($AI$1,Data_UR!$A$30:$AQ$49,9,FALSE),\"\")","v":""}]
[null,null,null,{"$f":"IF($AI$1<>0,VLOOKUP($AI$1,Data_UR!$A$30:$AQ$49,10,FALSE),\"\")","v":""}]
[null,null,null,{"$f":"IF($AI$1<>0,VLOOKUP($AI$1,Data_UR!$A$30:$AQ$49,11,FALSE),\"\")","v":""}]
[null,null,null,{"$f":"IF($AI$1<>0,VLOOKUP($AI$1,Data_UR!$A$30:$AQ$49,12,FALSE),\"\")","v":""}]
[null,null,null,{"$f":"IF($AI$1<>0,VLOOKUP($AI$1,Data_UR!$A$30:$AQ$49,13,FALSE),\"\")","v":""}]
[null,null,null,{"$f":"IF($AI$1<>0,VLOOKUP($AI$1,Data_UR!$A$30:$AQ$49,14,FALSE),\"\")","v":""}]
[null,null,null,{"$f":"IF($AI$1<>0,VLOOKUP($AI$1,Data_UR!$A$30:$AQ$49,15,FALSE),\"\")","v":""}]
[null,null,null,{"$f":"IF($AI$1<>0,VLOOKUP($AI$1,Data_UR!$A$30:$AQ$49,16,FALSE),\"\")","v":""}]
[null,null,null,{"$f":"IF($AI$1<>0,VLOOKUP($AI$1,Data_UR!$A$30:$AQ$49,17,FALSE),\"\")","v":""}]
[null,null,null,{"$f":"IF($AI$1<>0,VLOOKUP($AI$1,Data_UR!$A$30:$AQ$49,18,FALSE),\"\")","v":""}]
[null,null,null,{"$f":"IF($AI$1<>0,VLOOKUP($AI$1,Data_UR!$A$30:$AQ$49,19,FALSE),\"\")","v":""}]
[null,null,null,{"$f":"IF($AI$1<>0,VLOOKUP($AI$1,Data_UR!$A$30:$AQ$49,20,FALSE),\"\")","v":""}]
[]
[null,null,null,{"$f":"IF($AI$1<>0,VLOOKUP($AI$1,Data_UR!$A$30:$AQ$49,22,FALSE),\"\")","v":""}]
[]
[]
[null,null,null,{"$f":"IF($AI$1<>0,VLOOKUP($AI$1,Data_UR!$A$30:$AQ$49,23,FALSE),\"\")","v":""}]
[null,null,null,{"$f":"IF($AI$1<>0,VLOOKUP($AI$1,Data_UR!$A$30:$AQ$49,24,FALSE),\"\")","v":""}]
[null,null,null,{"$f":"IF($AI$1<>0,VLOOKUP($AI$1,Data_UR!$A$30:$AQ$49,25,FALSE),\"\")","v":""}]
[null,null,null,{"$f":"IF($AI$1<>0,VLOOKUP($AI$1,Data_UR!$A$30:$AQ$49,26,FALSE),\"\")","v":""}]
[null,null,null,{"$f":"IF($AI$1<>0,VLOOKUP($AI$1,Data_UR!$A$30:$AQ$49,27,FALSE),\"\")","v":""}]
[null,null,null,{"$f":"IF($AI$1<>0,VLOOKUP($AI$1,Data_UR!$A$30:$AQ$49,28,FALSE),\"\")","v":""}]
[null,null,null,{"$f":"IF($AI$1<>0,VLOOKUP($AI$1,Data_UR!$A$30:$AQ$49,29,FALSE),\"\")","v":""}]
[null,null,null,{"$f":"IF($AI$1<>0,VLOOKUP($AI$1,Data_UR!$A$30:$AQ$49,30,FALSE),\"\")","v":""}]
[null,null,null,{"$f":"IF($AI$1<>0,VLOOKUP($AI$1,Data_UR!$A$30:$AQ$49,31,FALSE),\"\")","v":""}]
[null,null,null,{"$f":"IF($AI$1<>0,VLOOKUP($AI$1,Data_UR!$A$30:$AQ$49,32,FALSE),\"\")","v":""}]
[null,null,null,{"$f":"IF($AI$1<>0,VLOOKUP($AI$1,Data_UR!$A$30:$AQ$49,33,FALSE),\"\")","v":""}]
[null,null,null,{"$f":"IF($AI$1<>0,VLOOKUP($AI$1,Data_UR!$A$30:$AQ$49,34,FALSE),\"\")","v":""}]
[null,null,null,{"$f":"IF($AI$1<>0,VLOOKUP($AI$1,Data_UR!$A$30:$AQ$49,35,FALSE),\"\")","v":""}]
[null,null,null,{"$f":"IF($AI$1<>0,VLOOKUP($AI$1,Data_UR!$A$30:$AQ$49,36,FALSE),\"\")","v":""}]
[null,null,null,{"$f":"IF($AI$1<>0,VLOOKUP($AI$1,Data_UR!$A$30:$AQ$49,37,FALSE),\"\")","v":""}]
[null,null,null,{"$f":"IF($AI$1<>0,VLOOKUP($AI$1,Data_UR!$A$30:$AQ$49,38,FALSE),\"\")","v":""}]
[null,null,null,{"$f":"IF($AI$1<>0,VLOOKUP($AI$1,Data_UR!$A$30:$AQ$49,39,FALSE),\"\")","v":""}]
[null,null,null,{"$f":"IF($AI$1<>0,VLOOKUP($AI$1,Data_UR!$A$30:$AQ$49,40,FALSE),\"\")","v":""}]
[null,null,null,{"$f":"IF($AI$1<>0,VLOOKUP($AI$1,Data_UR!$A$30:$AQ$49,41,FALSE),\"\")","v":""}]
[null,null,null,{"$f":"IF($AI$1<>0,VLOOKUP($AI$1,Data_UR!$A$30:$AQ$49,42,FALSE),\"\")","v":""}]
[]
[]
[null,null,null,{"$f":"IF($AI$1<>0,VLOOKUP($AI$1,Data_UR!$A$30:$AQ$49,43,FALSE),\"\")","v":""}]
[]
[null,null,null,{"$f":"IF(AI1<>0,CONCATENATE(Doku!$W$8,\" • \",Doku!$W$10,\" • \",Doku!$BR$10,\" \",Doku!$BZ$10),\"\")","v":""}]

{"sheet":"Data_LD","index":14,"n_rows":91,"n_cols":34,"rows_kept":91,"cut":false,"hidden":true,"merged":[[1,28,2,28],[1,29,2,29],[1,30,2,30],[87,0,87,1],[82,0,82,1],[77,0,77,1],[1,26,2,26],[1,27,2,27]]}
["Lehrgangsdokumentation"]
[1,2,3,4,5,6,7,8,9,10,11,12,13,14,15,16,17,18,19,20,21,22,23,24,25,null,"Nr.","Lehrgang",null,"DGUV\nDLRG","Form",null,"Nr.","PO-Nr."]
["Nr.","Nr. V","PO-Nr.","Orga","Subtitel","Lehrgangsform","Lehrgangstitel","Lehrgangsthema","Lehrgangsthema & -art","Lerneinheiten",{"$f":"IF(J3<>0,CONCATENATE(\"(\",J3,\" LE)\"),\"\")","v":"(Lerneinheiten LE)"},"UVT","QSEH-/Gliederungs-Nr.","QSEH-/Gliederungs-Nr. 2","Lehrkraft | Ausbilder","Stelle","Lehrgangs-Nr.",null,null,null,null,null,null,null,null,null,null,null,null,null,null,null,0]
[1,{"$f":"IF(Start!$I$9=A4,A4,0)","v":0},312,"DGUV",{"$f":"IF(OR(D4=\"DGUV\",D4=\"FeV\",D4=\"DLRG\"),VLOOKUP(D4,$A$84:$B$86,2,FALSE),\"\")","v":"(gemäß DGUV Grundsatz 304-001)"},"Ausbildung",{"$f":"IF($C$4<>\"\",\"Erste-Hilfe-Ausbildung\",\"\")","v":"Erste-Hilfe-Ausbildung"},{"$f":"IF(C4<>\"\",\"für betriebliche Ersthelfende | EH-Schulung gemäß § 19 FeV\",\"\")","v":"für betriebliche Ersthelfende | EH-Schulung gemäß § 19 FeV"},{"$f":"IF(C4<>\"\",CONCATENATE(G4,\" – \",H4),\" \")","v":"Erste-Hilfe-Ausbildung – für betriebliche Ersthelfende | EH-Schulung gemäß § 19 FeV"},9,"(9 LE)","davon UVT:","QSEH-Kennziffer:",{"$f":"IF(Start!$N$25<>\"\",Start!$N$25,\"\")","v":""},"Lehrkraft:","Angaben zur ermächtigten Stelle","Lehrgangs-Nr. DGUV:",null,null,null,null,null,null,null,null,null,{"$f":"IF(AH4<>0,AG4,\"\")","v":1},{"$f":"IF(I4<>\"\",I4,\"\")","v":"Erste-Hilfe-Ausbildung – für betriebliche Ersthelfende | EH-Schulung gemäß § 19 FeV"},null,{"$f":"IF(AH4<>0,D4,\"\")","v":"DGUV"},{"$f":"IF(AH4<>0,F4,\"\")","v":"Ausbildung"},null,1,{"$f":"IF(D4<>\"\",D4,0)","v":"DGUV"}]
[2,{"$f":"IF(Start!$I$9=A5,A5,0)","v":0},315,"DGUV","(gemäß DGUV Grundsatz 304-001)","Schulung","Erste-Hilfe-Schulung","in Bildungs- und Betreuungseinrichtungen für Kinder",{"$f":"IF(H5<>\"\",CONCATENATE(G5,\" – \",H5),\" \")","v":"Erste-Hilfe-Schulung – in Bildungs- und Betreuungseinrichtungen für Kinder"},9,"(9 LE)","davon UVT:","QSEH-Kennziffer:",{"$f":"IF(Start!$N$25<>\"\",Start!$N$25,\"\")","v":""},"Lehrkraft:","Angaben zur ermächtigten Stelle","Lehrgangs-Nr. DGUV:",null,null,null,null,null,null,null,null,null,{"$f":"IF(AH5<>0,AG5,\"\")","v":2},{"$f":"IF(I5<>\"\",I5,\"\")","v":"Erste-Hilfe-Schulung – in Bildungs- und Betreuungseinrichtungen für Kinder"},null,{"$f":"IF(AH5<>0,D5,\"\")","v":"DGUV"},{"$f":"IF(AH5<>0,F5,\"\")","v":"Schulung"},null,2,{"$f":"IF(D5<>\"\",D5,0)","v":"DGUV"}]
[3,{"$f":"IF(Start!$I$9=A6,A6,0)","v":0},321,"DGUV","(gemäß DGUV Grundsatz 304-001)","Fortbildung","Erste-Hilfe-Fortbildung","Auffrischung der Kenntnisse in Erster Hilfe","Erste-Hilfe-Fortbildung – Auffrischung der Kenntnisse in Erster Hilfe",9,"(9 LE)","davon UVT:","QSEH-Kennziffer:",{"$f":"IF(Start!$N$25<>\"\",Start!$N$25,\"\")","v":""},"Lehrkraft:","Angaben zur ermächtigten Stelle","Lehrgangs-Nr. DGUV:",null,null,null,null,null,null,null,null,null,3,"Erste-Hilfe-Fortbildung – Auffrischung der Kenntnisse in Erster Hilfe",null,"DGUV","Fortbildung",null,3,"DGUV"]
[4,{"$f":"IF(Start!$I$9=A7,A7,0)","v":0},{"$f":"IF(B7,VLOOKUP(B7,$AG$3:$AH$23,2,FALSE),\"\")","v":""},null,null,null,null,null," ",null,"",null,null,null,null,null,null,null,null,null,null,null,null,null,null,null,""," ",null,"","",null,4,0]
[5,{"$f":"IF(Start!$I$9=A8,A8,0)","v":0},312,"FeV","(gemäß § 68 Fahrerlaubnis-Verordnung (FeV)","Schulung","Erste-Hilfe-Schulung","gemäß § 19 Fahrerlaubnis-Verordnung (FeV)","Erste-Hilfe-Schulung – gemäß § 19 Fahrerlaubnis-Verordnung (FeV)",9,"(9 LE)",null,"FeV-Aktenzeichen:",{"$f":"IF(Start!$L$28<>\"\",Start!$L$28,\"\")","v":""},"Ausbilder:","Angaben zur anerkannten Stelle","Lehrgangs-Nr. DLRG:",null,null,null,null,null,null,null,null,null,5,"Erste-Hilfe-Schulung – gemäß § 19 Fahrerlaubnis-Verordnung (FeV)",null,"FeV","Schulung",null,5,"FeV"]
[6,{"$f":"IF(Start!$I$9=A9,A9,0)","v":0},null,null,null,null,null,null,null,null,"",null,null,null,null,null,null,null,null,null,null,null,null,null,null,null,"","",null,"","",null,6,0]
[7,{"$f":"IF(Start!$I$9=A10,A10,0)","v":0},312,"DLRG",{"$f":"IF(OR(D10=\"DGUV\",D10=\"FeV\",D10=\"DLRG\"),VLOOKUP(D10,$A$84:$B$86,2,FALSE),\"\")","v":"(gemäß den Ausbildungs- und Prüfungsordnungen der DLRG)"},"Ausbildung","Erste-Hilfe-Ausbildung","gemäß den Gemeinsamen Grundsätzen der BAGEH",{"$f":"IF(H10<>\"\",CONCATENATE(G10,\" – \",H10),\" \")","v":"Erste-Hilfe-Ausbildung – gemäß den Gemeinsamen Grundsätzen der BAGEH"},9,"(9 LE)",null,"Gliederungs-Nr.:",{"$f":"IF(Start!$P$18<>\"\",TEXT(Start!$P$18,\"00 00 000\"),\"\")","v":""},"Ausbilder:","Angaben zur ausbildenden Stelle","Lehrgangs-Nr. DLRG:",null,null,null,null,null,null,null,null,null,7,"Erste-Hilfe-Ausbildung – gemäß den Gemeinsamen Grundsätzen der BAGEH",null,"DLRG","Ausbildung",null,7,"DLRG"]
[8,{"$f":"IF(Start!$I$9=A11,A11,0)","v":0},321,"DLRG","(gemäß den Ausbildungs- und Prüfungsordnungen der DLRG)","Fortbildung","Erste-Hilfe-Fortbildung","gemäß den Gemeinsamen Grundsätzen der BAGEH",{"$f":"IF(H11<>\"\",CONCATENATE(G11,\" – \",H11),\" \")","v":"Erste-Hilfe-Fortbildung – gemäß den Gemeinsamen Grundsätzen der BAGEH"},9,{"$f":"IF(J11<>0,CONCATENATE(\"(\",J11,\" LE)\"),\"\")","v":"(9 LE)"},null,"Gliederungs-Nr.:",{"$f":"IF(Start!$P$18<>\"\",TEXT(Start!$P$18,\"00 00 000\"),\"\")","v":""},"Ausbilder:","Angaben zur ausbildenden Stelle","Lehrgangs-Nr. DLRG:",null,null,null,null,null,null,null,null,null,8,"Erste-Hilfe-Fortbildung – gemäß den Gemeinsamen Grundsätzen der BAGEH",null,"DLRG","Fortbildung",null,8,"DLRG"]
[9,{"$f":"IF(Start!$I$9=A12,A12,0)","v":0},313,"DLRG","(gemäß den Ausbildungs- und Prüfungsordnungen der DLRG)","Ausbildung","Erste-Hilfe bei Kindernotfällen","Erste Hilfe leisten bei akuten Gefahren, Krankheiten und Notfällen",{"$f":"IF(H12<>\"\",CONCATENATE(G12,\" – \",H12),\" \")","v":"Erste-Hilfe bei Kindernotfällen – Erste Hilfe leisten bei akuten Gefahren, Krankheiten und Notfällen"},9,"(9 LE)",null,"Gliederungs-Nr.:",{"$f":"IF(Start!$P$18<>\"\",TEXT(Start!$P$18,\"00 00 000\"),\"\")","v":""},"Ausbilder:","Angaben zur ausbildenden Stelle","Lehrgangs-Nr. DLRG:",null,null,null,null,null,null,null,null,null,9,"Erste-Hilfe bei Kindernotfällen – Erste Hilfe leisten bei akuten Gefahren, Krankheiten und Notfällen",null,"DLRG","Ausbildung",null,9,"DLRG"]
[10,{"$f":"IF(Start!$I$9=A13,A13,0)","v":0},322,"DLRG","(gemäß den Ausbildungs- und Prüfungsordnungen der DLRG)","Fortbildung","Erste-Hilfe-Fortbildung","Auffrischung der Kenntnisse Erste Hilfe bei Kindernotfällen","Erste-Hilfe-Fortbildung – Auffrischung der Kenntnisse Erste Hilfe bei Kindernotfällen",9,{"$f":"IF(J13<>0,CONCATENATE(\"(\",J13,\" LE)\"),\"\")","v":"(9 LE)"},null,"Gliederungs-Nr.:",{"$f":"IF(Start!$P$18<>\"\",TEXT(Start!$P$18,\"00 00 000\"),\"\")","v":""},"Ausbilder:","Angaben zur ausbildenden Stelle","Lehrgangs-Nr. DLRG:",null,null,null,null,null,null,null,null,null,10,"Erste-Hilfe-Fortbildung – Auffrischung der Kenntnisse Erste Hilfe bei Kindernotfällen",null,"DLRG","Fortbildung",null,10,"DLRG"]
[11,{"$f":"IF(Start!$I$9=A14,A14,0)","v":0},null,null,null,null,null,null,null,null,null,null,null,null,null,null,null,null,null,null,null,null,null,null,null,null,"","",null,"","",null,11,0]
[12,{"$f":"IF(Start!$I$9=A15,A15,0)","v":0},331,"DLRG","(gemäß den Ausbildungs- und Prüfungsordnungen der DLRG)","Ausbildung","Sanitätsausbildung A","Sanitätshelfer",{"$f":"IF(H15<>\"\",CONCATENATE(G15,\" – \",H15),\" \")","v":"Sanitätsausbildung A – Sanitätshelfer"},24,{"$f":"IF(J15<>0,CONCATENATE(\"(\",J15,\" LE)\"),\"\")","v":"(24 LE)"},null,"Gliederungs-Nr.:",{"$f":"IF(Start!$P$18<>\"\",TEXT(Start!$P$18,\"00 00 000\"),\"\")","v":""},"Ausbilder:","Angaben zur ausbildenden Stelle","Lehrgangs-Nr. DLRG:",null,null,null,null,null,null,null,null,null,12,"Sanitätsausbildung A – Sanitätshelfer",null,"DLRG","Ausbildung",null,12,"DLRG"]
[13,{"$f":"IF(Start!$I$9=A16,A16,0)","v":0},332,"DLRG","(gemäß den Ausbildungs- und Prüfungsordnungen der DLRG)","Ausbildung","Sanitätsausbildung B","Sanitäter",{"$f":"IF(H16<>\"\",CONCATENATE(G16,\" – \",H16),\" \")","v":"Sanitätsausbildung B – Sanitäter"},24,{"$f":"IF(J16<>0,CONCATENATE(\"(\",J16,\" LE)\"),\"\")","v":"(24 LE)"},null,"Gliederungs-Nr.:",{"$f":"IF(Start!$P$18<>\"\",TEXT(Start!$P$18,\"00 00 000\"),\"\")","v":""},"Ausbilder:","Angaben zur ausbildenden Stelle","Lehrgangs-Nr. DLRG:",null,null,null,null,null,null,null,null,null,13,"Sanitätsausbildung B – Sanitäter",null,"DLRG","Ausbildung",null,13,"DLRG"]
[14,{"$f":"IF(Start!$I$9=A17,A17,0)","v":0},null,null,null,null,null,null,null,null,null,null,null,null,null,null,null,null,null,null,null,null,null,null,null,null,"","",null,"","",null,14,0]
[15,{"$f":"IF(Start!$I$9=A18,A18,0)","v":0},351,"DLRG","(gemäß den Ausbildungs- und Prüfungsordnungen der DLRG)","Ausbildung","RUND-Grundkurs","Erlernen von Darstellungen, Schminken von Verletzungen/Erkrankungen",{"$f":"IF(H18<>\"\",CONCATENATE(G18,\" – \",H18),\" \")","v":"RUND-Grundkurs – Erlernen von Darstellungen, Schminken von Verletzungen/Erkrankungen"},16,{"$f":"IF(J18<>0,CONCATENATE(\"(\",J18,\" LE)\"),\"\")","v":"(16 LE)"},null,"Gliederungs-Nr.:",{"$f":"IF(Start!$P$18<>\"\",TEXT(Start!$P$18,\"00 00 000\"),\"\")","v":""},"Ausbilder:","Angaben zur ausbildenden Stelle","Lehrgangs-Nr. DLRG:",null,null,null,null,null,null,null,null,null,15,"RUND-Grundkurs – Erlernen von Darstellungen, Schminken von Verletzungen/Erkrankungen",null,"DLRG","Ausbildung",null,15,"DLRG"]
[16,{"$f":"IF(Start!$I$9=A19,A19,0)","v":0},352,"DLRG","(gemäß den Ausbildungs- und Prüfungsordnungen der DLRG)","Ausbildung","RUND-Aufbaukurs","Erweiterung/Vertiefung von Kenntnissen und Fertigkeiten des RUND-Grundkurses",{"$f":"IF(H19<>\"\",CONCATENATE(G19,\" – \",H19),\" \")","v":"RUND-Aufbaukurs – Erweiterung/Vertiefung von Kenntnissen und Fertigkeiten des RUND-Grundkurses"},16,{"$f":"IF(J19<>0,CONCATENATE(\"(\",J19,\" LE)\"),\"\")","v":"(16 LE)"},null,"Gliederungs-Nr.:",{"$f":"IF(Start!$P$18<>\"\",TEXT(Start!$P$18,\"00 00 000\"),\"\")","v":""},"Ausbilder:","Angaben zur ausbildenden Stelle","Lehrgangs-Nr. DLRG:",null,null,null,null,null,null,null,null,null,16,"RUND-Aufbaukurs – Erweiterung/Vertiefung von Kenntnissen und Fertigkeiten des RUND-Grundkurses",null,"DLRG","Ausbildung",null,16,"DLRG"]
[17,{"$f":"IF(Start!$I$9=A20,A20,0)","v":0},null,null,null,null,null,null,null,null,null,null,null,null,null,null,null,null,null,null,null,null,null,null,null,null,"","",null,"","",null,17,0]
[18,{"$f":"IF(Start!$I$9=A21,A21,0)","v":0},341,"DLRG","(gemäß den Ausbildungs- und Prüfungsordnungen der DLRG)","Fortbildung","Sanitätsfortbildung","Auffrischung und Vertiefung der Kenntnisse aus dem Sanitätsdienst",{"$f":"IF(H21<>\"\",CONCATENATE(G21,\" – \",H21),\" \")","v":"Sanitätsfortbildung – Auffrischung und Vertiefung der Kenntnisse aus dem Sanitätsdienst"},10,{"$f":"IF(J21<>0,CONCATENATE(\"(\",J21,\" LE)\"),\"\")","v":"(10 LE)"},null,"Gliederungs-Nr.:",{"$f":"IF(Start!$P$18<>\"\",TEXT(Start!$P$18,\"00 00 000\"),\"\")","v":""},"Ausbilder:","Angaben zur ausbildenden Stelle","Lehrgangs-Nr. DLRG:",null,null,null,null,null,null,null,null,null,18,"Sanitätsfortbildung – Auffrischung und Vertiefung der Kenntnisse aus dem Sanitätsdienst",null,"DLRG","Fortbildung",null,18,"DLRG"]
[19,{"$f":"IF(Start!$I$9=A22,A22,0)","v":0},"",null,null,null,null,null," ",null,"",null,null,null,null,null,null,null,null,null,null,null,null,null,null,null,"",{"$f":"IF(I22<>\"\",I22,\"\")","v":" "},null,"","",null,19,0]
[20,{"$f":"IF(Start!$I$9=A23,A23,0)","v":0},"",null,null,null,null,null," ",null,"",null,null,null,null,null,null,null,null,null,null,null,null,null,null,null,""," ",null,"","",null,20,0]
[null,{"$f":"SUM(B4:B23)","v":0}]
[]
["Lehrgangsdokumentation – Voraussetzungen"]
[1,2,3,4,5,6,7,8,9,10,11,12,13,14,15,16,17,18,19,20,21,22,23,24,25]
["Nr.","Nr. V","PO-Nr.","Orga","Lehrgangsform","Lehrgangstitel","Lehrgangsvoraussetzungen","Voraussetzung 1","Voraussetzung 2","Voraussetzung 3","Voraussetzung 4","Voraussetzung 5","Voraussetzung 6","Voraussetzung 7","Voraussetzung 8","Voraussetzung 9","Voraussetzung 10","Voraussetzung 11","Voraussetzung 12"]
[1,{"$f":"IF(Start!$I$9=A29,A29,0)","v":0},{"$f":"IF(C4<>\"\",C4,\"\")","v":312},{"$f":"IF(D4<>\"\",D4,\"\")","v":"DGUV"},{"$f":"IF(F4<>\"\",F4,\"\")","v":"Ausbildung"},"Erste-Hilfe-Ausbildung","Lehrgangsvoraussetzungen","•  Keine"," "," "," "," "," "," "," "," "," "," "," "," "]
[2,{"$f":"IF(Start!$I$9=A30,A30,0)","v":0},{"$f":"IF(C5<>\"\",C5,\"\")","v":315},"DGUV",{"$f":"IF(F5<>\"\",F5,\"\")","v":"Schulung"},{"$f":"IF(G5<>\"\",G5,\"\")","v":"Erste-Hilfe-Schulung"},"Lehrgangsvoraussetzungen","•  Keine"," "," "," "," "," "," "," "," "," "," "," "," "]
[3,{"$f":"IF(Start!$I$9=A31,A31,0)","v":0},321,"DGUV","Fortbildung","Erste-Hilfe-Fortbildung","Lehrgangsvoraussetzungen","•  Erste Hilfe-Ausbildung oder Erste Hilfe-Fortbildung"," "," "," "," "," "," "," "," "," "," "," "," "]
[4,{"$f":"IF(Start!$I$9=A32,A32,0)","v":0},"","","",""," "," "]
[5,{"$f":"IF(Start!$I$9=A33,A33,0)","v":0},312,"FeV","Schulung","Erste-Hilfe-Schulung","Lehrgangsvoraussetzungen","•  Keine"," "," "," "," "," "," "," "," "," "," "," "," "]
[6,{"$f":"IF(Start!$I$9=A34,A34,0)","v":0},"","","","",null,null,null,null,null," "," "," "," "," "," "," "," "," "]
[7,{"$f":"IF(Start!$I$9=A35,A35,0)","v":0},312,"DLRG","Ausbildung","Erste-Hilfe-Ausbildung","Lehrgangsvoraussetzungen","•  Keine"]
[8,{"$f":"IF(Start!$I$9=A36,A36,0)","v":0},321,"DLRG","Fortbildung","Erste-Hilfe-Fortbildung","Lehrgangsvoraussetzungen","•  Erste Hilfe-Aus- oder Fortbildung oder","•  Aus- oder Fortbildung Erste Hilfe bei Kindernotfällen","•  Erste Hilfe-Ausbildung in Bildungs- und Betreuungseinrichtungen für Kinder","   (gemäß DGUV Grundsatz 304-001)"," "," "," "," "," "," "," "," "," "]
[9,{"$f":"IF(Start!$I$9=A37,A37,0)","v":0},313,"DLRG","Ausbildung","Erste-Hilfe bei Kindernotfällen","Lehrgangsvoraussetzungen","•  Keine",null,null," "," "," "," "," "," "," "," "," "," "]
[10,{"$f":"IF(Start!$I$9=A38,A38,0)","v":0},322,"DLRG","Fortbildung","Erste-Hilfe-Fortbildung","Lehrgangsvoraussetzungen"," •  Aus- oder Fortbildung Erste Hilfe bei Kindernotfällen"]
[11,{"$f":"IF(Start!$I$9=A39,A39,0)","v":0},"","","","",null,null,null,null," "," "," "," "," "," "," "," "," "," "]
[12,{"$f":"IF(Start!$I$9=A40,A40,0)","v":0},331,"DLRG","Ausbildung","Sanitätsausbildung A","Lehrgangsvoraussetzungen","•  Mitgliedschaft in der DLRG","•  Mindestalter 14 Jahre","•  Gültige Erste Hilfe-Ausbildung",null," "," "," "," "," "," "," "," "," "]
[13,{"$f":"IF(Start!$I$9=A41,A41,0)","v":0},332,"DLRG","Ausbildung","Sanitätsausbildung B"," Lehrgangsvoraussetzungen","•  Mitgliedschaft in der DLRG","•  Mindestalter 16 Jahre","•  Gültige Sanitätsausbildung A"]
[14,{"$f":"IF(Start!$I$9=A42,A42,0)","v":0},"","","",""," "," "]
[15,{"$f":"IF(Start!$I$9=A43,A43,0)","v":0},351,"DLRG","Ausbildung","RUND-Grundkurs","Lehrgangsvoraussetzungen","•  Mitgliedschaft in der DLRG","•  Mindestalter 14 Jahre (schriftliche Erlaubnis des Sorgeberechtigten)","•  Gültige Erste Hilfe-Ausbildung"]
[16,{"$f":"IF(Start!$I$9=A44,A44,0)","v":0},352,"DLRG","Ausbildung","RUND-Aufbaukurs","Lehrgangsvoraussetzungen","•  Mitgliedschaft in der DLRG","•  Mindestalter 16 Jahre (schriftliche Erlaubnis des Sorgeberechtigten)","•  Abgeschlossener RUND-Grundkurs","•  Gültige Sanitätsausbildung A"]
[17,{"$f":"IF(Start!$I$9=A45,A45,0)","v":0},"","","","",null,null,null,null," "," "," "," "," "," "," "," "," "," "]
[18,{"$f":"IF(Start!$I$9=A46,A46,0)","v":0},341,"DLRG","Fortbildung","Sanitätsfortbildung"," Lehrgangsvoraussetzungen"," •  Mitgliedschaft in der DLRG","•  Gültige Sanitätsausbildung A oder","•  Gültige Sanitätsausbildung B"]
[19,{"$f":"IF(Start!$I$9=A47,A47,0)","v":0},"","","",""," "," "]
[20,{"$f":"IF(Start!$I$9=A48,A48,0)","v":0},"","","",""," "," "]
[null,{"$f":"SUM(B29:B48)","v":0}]
[]
[]
["Teilnehmerdatenblatt"]
[1,2,3,4,5,6,7,8,9,10,11,12,13,14,15,16,17,18,19,20,21,22,23,24,25]
["Nr.","Nr. V","PO-Nr.","Orga","Titel","Subtitel","Lehrgangsthema & -art","Angaben zum","Arbeitgeber | Dienststelle","Firmenort | PLZ & Ort","UVT","Hinweis 1","Rechnung","QSEH | FeV | Gliederung","QSEH-N. | Gl.-Nr.","E-Mail","Lehrgangsummer:"]
[1,{"$f":"IF(Start!$I$9=A55,A55,0)","v":0},{"$f":"IF(C4<>\"\",C4,\"\")","v":312},{"$f":"IF(D4<>\"\",D4,\"\")","v":"DGUV"},{"$f":"IF(D55<>\"\",\"Teilnehmerdatenblatt\",\"\")","v":"Teilnehmerdatenblatt"},{"$f":"IF(D55<>\"\",VLOOKUP(D55,$A$79:$B$81,2,FALSE),\"\")","v":"(Anlage zur Lehrgangsdokumentation – DGUV)"},{"$f":"IF(I4<>\"\",I4,\"\")","v":"Erste-Hilfe-Ausbildung – für betriebliche Ersthelfende | EH-Schulung gemäß § 19 FeV"},"Teilnehmender über Unfallversicherungsträger (UVT*)","Name des Arbeitgebers:","PLZ und Ort:","Unfallversicherungsträger:","Die personenbezogenen Daten werden aufgrund des § 199 Abs. 1 Nr. 5 i.V.m. § 23 SGV VII verarbeitet.","Privatteilnehmender (Angaben nur nötig bei Privatrechnung)","QSEH-Kennziffer:",{"$f":"Start!$N$25","v":0}," ",{"$f":"Doku!$Y$26","v":0}]
[2,{"$f":"IF(Start!$I$9=A56,A56,0)","v":0},{"$f":"IF(C5<>\"\",C5,\"\")","v":315},"DGUV",{"$f":"IF(D56<>\"\",\"Teilnehmerdatenblatt\",\"\")","v":"Teilnehmerdatenblatt"},{"$f":"IF(D56<>\"\",VLOOKUP(D56,$A$79:$B$81,2,FALSE),\"\")","v":"(Anlage zur Lehrgangsdokumentation – DGUV)"},{"$f":"IF(I5<>\"\",I5,\"\")","v":"Erste-Hilfe-Schulung – in Bildungs- und Betreuungseinrichtungen für Kinder"},"Teilnehmender über Unfallversicherungsträger (UVT*)","Name des Arbeitgebers:","PLZ und Ort:","Unfallversicherungsträger:","Die personenbezogenen Daten werden aufgrund des § 199 Abs. 1 Nr. 5 i.V.m. § 23 SGV VII verarbeitet.","Privatteilnehmender (Angaben nur nötig bei Privatrechnung)","QSEH-Kennziffer:",{"$f":"Start!$N$25","v":0}," ",{"$f":"Doku!$Y$26","v":0}]
[3,{"$f":"IF(Start!$I$9=A57,A57,0)","v":0},{"$f":"IF(C6<>\"\",C6,\"\")","v":321},"DGUV","Teilnehmerdatenblatt","(Anlage zur Lehrgangsdokumentation – DGUV)","Erste-Hilfe-Fortbildung – Auffrischung der Kenntnisse in Erster Hilfe","Teilnehmender über Unfallversicherungsträger (UVT*)","Name des Arbeitgebers:","PLZ und Ort:","Unfallversicherungsträger:","Die personenbezogenen Daten werden aufgrund des § 199 Abs. 1 Nr. 5 i.V.m. § 23 SGV VII verarbeitet.","Privatteilnehmender (Angaben nur nötig bei Privatrechnung)","QSEH-Kennziffer:",{"$f":"Start!$N$25","v":0}," ",{"$f":"Doku!$Y$26","v":0}]
[4,{"$f":"IF(Start!$I$9=A58,A58,0)","v":0},{"$f":"IF(C7<>\"\",C7,\"\")","v":""},"","",""," ",{"$f":"IF(D58=\"DLRG\",\"Falls nicht DLRG-Mitglied:\",IF(D58=\"DGUV\",\"Teilnehmender über Unfallversicherungsträger (UVT*):\",\"\"))","v":""},{"$f":"IF(D58=\"DLRG\",\"Name der Dienststelle o. ä.:\",IF(D58=\"DGUV\",\"Name des Arbeitgebers:\",\"\"))","v":""},{"$f":"IF(D58=\"DLRG\",\"Straße, Hausnummer:\",IF(D58=\"DGUV\",\"PLZ und Ort:\",\"\"))","v":""},{"$f":"IF(D58=\"DLRG\",\"PLZ und Ort:\",IF(D58=\"DGUV\",\"Unfallversicherungsträger:\",\"\"))","v":""},{"$f":"IF(D58=\"DLRG\",\"Die personenbezogenen Daten sind nötig zur Überprüfung des Unfallversicherungsschutzes bei nicht DLRG-Mitgliedern.\",IF(D58=\"DGUV\",\"*Die personenbezogenen Daten werden aufgrund des § 199 Abs. 1 Nr. 5 i.V.m. § 23 SGV VII verarbeitet.\",\"\"))","v":""}]
[5,{"$f":"IF(Start!$I$9=A59,A59,0)","v":0},{"$f":"IF(C8<>\"\",C8,\"\")","v":312},"FeV","Teilnehmerdatenblatt","(Anlage zur Lehrgangsdokumentation – FeV)","Erste-Hilfe-Schulung – gemäß § 19 Fahrerlaubnis-Verordnung (FeV)","Falls nicht DLRG-Mitglied:","Name der Dienststelle o. ä.:","Straße, Hausnummer:","PLZ und Ort:","Die personenbezogenen Daten sind nötig zur Überprüfung des Unfallversicherungsschutzes bei nicht DLRG-Mitgliedern.","Adresse des Teilnehmers (Angaben nur nötig bei Privatrechnung)","Aktenzeichen:",{"$f":"TEXT(Start!$L$28,\"00 00 000\")","v":"00 00 000"},"E-Mail:",{"$f":"Doku!$Y$26","v":0}]
[6,{"$f":"IF(Start!$I$9=A60,A60,0)","v":0},{"$f":"IF(C9<>\"\",C9,\"\")","v":""},"","","","","","","","","",null,null,{"$f":"IF(D60=\"DLRG\",TEXT(Start!$P$18,\"00 00 000\"),IF(D60=\"DGUV\",Start!$N$25,IF(D60=\"FeV\",Start!$L$28,\"\")))","v":""}]
[7,{"$f":"IF(Start!$I$9=A61,A61,0)","v":0},{"$f":"IF(C10<>\"\",C10,\"\")","v":312},"DLRG","Teilnehmerdatenblatt","(Anlage zur Lehrgangsdokumentation – DLRG)","Erste-Hilfe-Ausbildung – gemäß den Gemeinsamen Grundsätzen der BAGEH","Falls nicht DLRG-Mitglied:","Name der Dienststelle o. ä.:","Straße, Hausnummer:","PLZ und Ort:","Die personenbezogenen Daten sind nötig zur Überprüfung des Unfallversicherungsschutzes bei nicht DLRG-Mitgliedern.","Adresse des Teilnehmers (Angaben nur nötig bei Privatrechnung)","Gliederungs-Nr.:",{"$f":"TEXT(Start!$P$18,\"00 00 000\")","v":"00 00 000"},{"$f":"IF(D61=\"DLRG\",\"E-Mail:\",IF(D61=\"DGUV\",\"\",\"\"))","v":"E-Mail:"},{"$f":"Doku!$Y$26","v":0}]
[8,{"$f":"IF(Start!$I$9=A62,A62,0)","v":0},{"$f":"IF(C11<>\"\",C11,\"\")","v":321},"DLRG","Teilnehmerdatenblatt","(Anlage zur Lehrgangsdokumentation – DLRG)","Erste-Hilfe-Fortbildung – gemäß den Gemeinsamen Grundsätzen der BAGEH","Falls nicht DLRG-Mitglied:","Name der Dienststelle o. ä.:","Straße, Hausnummer:","PLZ und Ort:","Die personenbezogenen Daten sind nötig zur Überprüfung des Unfallversicherungsschutzes bei nicht DLRG-Mitgliedern.","Adresse des Teilnehmers (Angaben nur nötig bei Privatrechnung)","Gliederungs-Nr.:",{"$f":"TEXT(Start!$P$18,\"00 00 000\")","v":"00 00 000"},{"$f":"IF(D62=\"DLRG\",\"E-Mail:\",IF(D62=\"DGUV\",\"\",\"\"))","v":"E-Mail:"},{"$f":"Doku!$Y$26","v":0}]
[9,{"$f":"IF(Start!$I$9=A63,A63,0)","v":0},{"$f":"IF(C12<>\"\",C12,\"\")","v":313},"DLRG","Teilnehmerdatenblatt","(Anlage zur Lehrgangsdokumentation – DLRG)","Erste-Hilfe bei Kindernotfällen – Erste Hilfe leisten bei akuten Gefahren, Krankheiten und Notfällen","Falls nicht DLRG-Mitglied:","Name der Dienststelle o. ä.:","Straße, Hausnummer:","PLZ und Ort:","Die personenbezogenen Daten sind nötig zur Überprüfung des Unfallversicherungsschutzes bei nicht DLRG-Mitgliedern.","Adresse des Teilnehmers (Angaben nur nötig bei Privatrechnung)","Gliederungs-Nr.:",{"$f":"TEXT(Start!$P$18,\"00 00 000\")","v":"00 00 000"},"E-Mail:",{"$f":"Doku!$Y$26","v":0}]
[10,{"$f":"IF(Start!$I$9=A64,A64,0)","v":0},{"$f":"IF(C13<>\"\",C13,\"\")","v":322},"DLRG","Teilnehmerdatenblatt","(Anlage zur Lehrgangsdokumentation – DLRG)","Erste-Hilfe-Fortbildung – Auffrischung der Kenntnisse Erste Hilfe bei Kindernotfällen","Falls nicht DLRG-Mitglied:","Name der Dienststelle o. ä.:","Straße, Hausnummer:","PLZ und Ort:","Die personenbezogenen Daten sind nötig zur Überprüfung des Unfallversicherungsschutzes bei nicht DLRG-Mitgliedern.","Adresse des Teilnehmers (Angaben nur nötig bei Privatrechnung)","Gliederungs-Nr.:",{"$f":"TEXT(Start!$P$18,\"00 00 000\")","v":"00 00 000"},"E-Mail:",{"$f":"Doku!$Y$26","v":0}]
[11,{"$f":"IF(Start!$I$9=A65,A65,0)","v":0},{"$f":"IF(C14<>\"\",C14,\"\")","v":""},"","","","","","",""]
[12,{"$f":"IF(Start!$I$9=A66,A66,0)","v":0},{"$f":"IF(C15<>\"\",C15,\"\")","v":331},"DLRG","Teilnehmerdatenblatt","(Anlage zur Lehrgangsdokumentation – DLRG)","Sanitätsausbildung A – Sanitätshelfer","Falls nicht DLRG-Mitglied:","Name der Dienststelle o. ä.:","Straße, Hausnummer:","PLZ und Ort:","Die personenbezogenen Daten sind nötig zur Überprüfung des Unfallversicherungsschutzes bei nicht DLRG-Mitgliedern.","Adresse des Teilnehmers (Angaben nur nötig bei Privatrechnung)","Gliederungs-Nr.:",{"$f":"TEXT(Start!$P$18,\"00 00 000\")","v":"00 00 000"},"E-Mail:",{"$f":"Doku!$Y$26","v":0}]
[13,{"$f":"IF(Start!$I$9=A67,A67,0)","v":0},{"$f":"IF(C16<>\"\",C16,\"\")","v":332},"DLRG","Teilnehmerdatenblatt","(Anlage zur Lehrgangsdokumentation – DLRG)","Sanitätsausbildung B – Sanitäter","Falls nicht DLRG-Mitglied:","Name der Dienststelle o. ä.:","Straße, Hausnummer:","PLZ und Ort:","Die personenbezogenen Daten sind nötig zur Überprüfung des Unfallversicherungsschutzes bei nicht DLRG-Mitgliedern.","Adresse des Teilnehmers (Angaben nur nötig bei Privatrechnung)","Gliederungs-Nr.:",{"$f":"TEXT(Start!$P$18,\"00 00 000\")","v":"00 00 000"},"E-Mail:",{"$f":"Doku!$Y$26","v":0}]
[14,{"$f":"IF(Start!$I$9=A68,A68,0)","v":0},{"$f":"IF(C17<>\"\",C17,\"\")","v":""},"","","","","","","",""]
[15,{"$f":"IF(Start!$I$9=A69,A69,0)","v":0},{"$f":"IF(C18<>\"\",C18,\"\")","v":351},"DLRG","Teilnehmerdatenblatt","(Anlage zur Lehrgangsdokumentation – DLRG)","RUND-Grundkurs – Erlernen von Darstellungen, Schminken von Verletzungen/Erkrankungen","Falls nicht DLRG-Mitglied:","Name der Dienststelle o. ä.:","Straße, Hausnummer:","PLZ und Ort:","Die personenbezogenen Daten sind nötig zur Überprüfung des Unfallversicherungsschutzes bei nicht DLRG-Mitgliedern.","Adresse des Teilnehmers (Angaben nur nötig bei Privatrechnung)","Gliederungs-Nr.:",{"$f":"TEXT(Start!$P$18,\"00 00 000\")","v":"00 00 000"},"E-Mail:",{"$f":"Doku!$Y$26","v":0}]
[16,{"$f":"IF(Start!$I$9=A70,A70,0)","v":0},{"$f":"IF(C19<>\"\",C19,\"\")","v":352},"DLRG","Teilnehmerdatenblatt","(Anlage zur Lehrgangsdokumentation – DLRG)","RUND-Aufbaukurs – Erweiterung/Vertiefung von Kenntnissen und Fertigkeiten des RUND-Grundkurses","Falls nicht DLRG-Mitglied:","Name der Dienststelle o. ä.:","Straße, Hausnummer:","PLZ und Ort:","Die personenbezogenen Daten sind nötig zur Überprüfung des Unfallversicherungsschutzes bei nicht DLRG-Mitgliedern.","Adresse des Teilnehmers (Angaben nur nötig bei Privatrechnung)","Gliederungs-Nr.:",{"$f":"TEXT(Start!$P$18,\"00 00 000\")","v":"00 00 000"},"E-Mail:",{"$f":"Doku!$Y$26","v":0}]
[17,{"$f":"IF(Start!$I$9=A71,A71,0)","v":0},{"$f":"IF(C20<>\"\",C20,\"\")","v":""},"","","","","","",""]
[18,{"$f":"IF(Start!$I$9=A72,A72,0)","v":0},{"$f":"IF(C21<>\"\",C21,\"\")","v":341},"DLRG","Teilnehmerdatenblatt","(Anlage zur Lehrgangsdokumentation – DLRG)","Sanitätsfortbildung – Auffrischung und Vertiefung der Kenntnisse aus dem Sanitätsdienst","Falls nicht DLRG-Mitglied:","Name der Dienststelle o. ä.:","Straße, Hausnummer:","PLZ und Ort:","Die personenbezogenen Daten sind nötig zur Überprüfung des Unfallversicherungsschutzes bei nicht DLRG-Mitgliedern.","Adresse des Teilnehmers (Angaben nur nötig bei Privatrechnung)","Gliederungs-Nr.:",{"$f":"TEXT(Start!$P$18,\"00 00 000\")","v":"00 00 000"},"E-Mail:",{"$f":"Doku!$Y$26","v":0}]
[19,{"$f":"IF(Start!$I$9=A73,A73,0)","v":0},{"$f":"IF(C22<>\"\",C22,\"\")","v":""},"","",""," ","","","",""]
[20,{"$f":"IF(Start!$I$9=A74,A74,0)","v":0},{"$f":"IF(C23<>\"\",C23,\"\")","v":""},"","",""," ","","","",""]
[null,{"$f":"SUM(B55:B74)","v":0}]
[]
[null,null,null,null,null,null,null,{"$f":"IF(D55=\"DLRG\",\"Falls nicht DLRG-Mitglied:\",IF(D55=\"DGUV\",\"Teilnehmender über Unfallversicherungsträger (UVT*):\",IF(D55=\"FeV\",\" \",\"\")))","v":"Teilnehmender über Unfallversicherungsträger (UVT*):"},null,{"$f":"IF(D55=\"DLRG\",\"Name der Dienststelle o. ä.:\",IF(D55=\"DGUV\",\"Name des Arbeitgebers:\",\"\"))","v":"Name des Arbeitgebers:"},{"$f":"IF(D55=\"DLRG\",\"Straße, Hausnummer:\",IF(D55=\"DGUV\",\"PLZ und Ort:\",\"\"))","v":"PLZ und Ort:"},{"$f":"IF(D55=\"DLRG\",\"PLZ und Ort:\",IF(D55=\"DGUV\",\"Unfallversicherungsträger:\",\"\"))","v":"Unfallversicherungsträger:"}]
[]
["DGUV","(Anlage zur Lehrgangsdokumentation – DGUV)"]
["FeV","(Anlage zur Lehrgangsdokumentation – FeV)"]
["DLRG","(Anlage zur Lehrgangsdokumentation – DLRG)"]
[]
[]
["DGUV","(gemäß DGUV Grundsatz 304-001)"]
["FeV","(gemäß § 68 Fahrerlaubnis-Verordnung (FeV)"]
["DLRG","(gemäß den Ausbildungs- und Prüfungsordnungen der DLRG)"]
[]
[19]
["DGUV","Angaben zur ermächtigten Stelle"]
["FeV","Angaben zur anerkannten Stelle"]
["DLRG","Angaben zur ausbildenden Stelle"]

{"sheet":"Data_PD","index":15,"n_rows":45,"n_cols":32,"rows_kept":45,"cut":false,"hidden":true,"merged":[]}
["Personaldaten (Teilnehmerdaten)"]
[1,2,3,4,5,6,7,8,9,10,11,12,13,14,15,16,17,18,19,20,21]
["Nr.","Nachname","Vorname","Namen","Geb.","Geb.-am","Ort","von","bis","Straße","Wohnort","E-Mail","Gültigkeit","Reg.-Nr.: ","gültig bis","Reg.-Nr. komplett","Name Rückseite","Name Rückseite","Name Arbeitgeber","PLZ & Firmenort","UVT",null,"Gliederung","/","Qual.","/","Lfd.-Nr.","/","Jahr",null,"Nr.","Lfd.-Nr."]
[{"$f":"IF(B4<>\"\",1,\"\")","v":""},{"$f":"IF(TNL!J9<>\"\",TNL!J9,\"\")","v":""},{"$f":"IF(B4<>\"\",TNL!AP9,\"\")","v":""},{"$f":"IF(A4<>\"\",CONCATENATE(B4,\", \",C4),\"\")","v":""},{"$f":"IF(B4<>\"\",TEXT(TNL!BU9,\"TT.MM.JJJJ\"),\"\")","v":""},{"$f":"IF(B4<>\"\",CONCATENATE(\"geboren am: \",TEXT(E4,\"TT. MMMM JJJJ\"),\"\"),\"\")","v":""},{"$f":"IF(A4<>\"\",CONCATENATE(TNL!$AY$5,\", \"),\"\")","v":""},{"$f":"IF(A4<>\"\",TEXT(TNL!$C$5,\"TT.MM.JJJJ\"),\"\")","v":""},{"$f":"IF(A4<>\"\",TEXT(TNL!$T$5,\"TT.MM.JJJJ\"),\"\")","v":""},{"$f":"IF(B4<>\"\",IF(TNL!CJ9<>\"\",TNL!CJ9,\"\"),\"\")","v":""},{"$f":"IF(B4<>\"\",IF(TNL!DW9<>\"\",TNL!DW9,\"\"),\"\")","v":""},{"$f":"IF(B4<>\"\",IF(TNL!AP37<>\"\",TNL!AP37,\"\"),\"\")","v":""},{"$f":"IF(B4<>\"\",CONCATENATE(\"Dieser Nachweis ist gültig bis \",TEXT(O4,\"TT.MM.JJJJ\")),\"Dieser Nachweis ist unbegrenzt gültig!\")","v":"Dieser Nachweis ist unbegrenzt gültig!"},{"$f":"IF(B4<>0,CONCATENATE(TEXT(W4,\"00 00 000\"),X4,Y4,Z4,TEXT(AA4,\"000\"),AB4,AC4),\"\")","v":" /  / 001 / "},{"$f":"IF(B4<>\"\",TEXT(I4+365,\"TT.MM.JJJJ\"),\"\")","v":""},{"$f":"IF(C4<>0,CONCATENATE($N$3,N4),\"\")","v":"Reg.-Nr.:  /  / 001 / "},{"$f":"CONCATENATE(D4,\" – \",TEXT(E4,\"TT.MM.JJJJ\"),\" | \",Doku!$Y$26)","v":" –  | "},{"$f":"CONCATENATE(D4,\" – \",TEXT(E4,\"TT.MM.JJJJ\"),\" | \",Doku!$Y$26)","v":" –  | "},{"$f":"IF(A4<>\"\",IF(TNL!$A$1<>4,TNL!CX37,\"\"),\"\")","v":""},{"$f":"IF(A4<>\"\",IF(TNL!$A$1<>4,TNL!ED37,\"\"),\"\")","v":""},{"$f":"IF(A4<>\"\",IF(TNL!$A$1<>4,TNL!EX37,\"\"),\"\")","v":""},null,{"$f":"IF(Start!$P$18<>\"\",Start!$P$18,\"\")","v":""}," / ",{"$f":"IF(Start!$I$9<>0,VLOOKUP(Start!$I$9,Data_LD!$A$4:$W$23,3,FALSE),\"\")","v":""}," / ",{"$f":"IF(TNL!$FP$37<>0,AF4,\"\")","v":1}," / ",{"$f":"IF(Doku!$CC$34<>\"\",TEXT(Doku!$CC$34,\"JJ\"),\"\")","v":""},null,0,{"$f":"IF(TNL!$FP$37<>\"\",TNL!$FP$37+AE4,0)","v":1}]
[{"$f":"IF(B5<>\"\",2,\"\")","v":""},{"$f":"IF(TNL!J10<>\"\",TNL!J10,\"\")","v":""},{"$f":"IF(B5<>\"\",TNL!AP10,\"\")","v":""},{"$f":"IF(A5<>\"\",CONCATENATE(B5,\", \",C5),\"\")","v":""},{"$f":"IF(B5<>\"\",TEXT(TNL!BU10,\"TT.MM.JJJJ\"),\"\")","v":""},{"$f":"IF(B5<>\"\",CONCATENATE(\"geboren am: \",TEXT(E5,\"TT. MMMM JJJJ\"),\"\"),\"\")","v":""},{"$f":"IF(A5<>\"\",CONCATENATE(TNL!$AY$5,\", \"),\"\")","v":""},{"$f":"IF(A5<>\"\",TEXT(TNL!$C$5,\"TT.MM.JJJJ\"),\"\")","v":""},{"$f":"IF(A5<>\"\",TEXT(TNL!$T$5,\"TT.MM.JJJJ\"),\"\")","v":""},{"$f":"IF(B5<>\"\",IF(TNL!CJ10<>\"\",TNL!CJ10,\"\"),\"\")","v":""},{"$f":"IF(B5<>\"\",IF(TNL!DW10<>\"\",TNL!DW10,\"\"),\"\")","v":""},{"$f":"IF(B5<>\"\",IF(TNL!AP38<>\"\",TNL!AP38,\"\"),\"\")","v":""},{"$f":"IF(B5<>\"\",CONCATENATE(\"Dieser Nachweis ist gültig bis \",TEXT(O5,\"TT.MM.JJJJ\")),\"Dieser Nachweis ist unbegrenzt gültig!\")","v":"Dieser Nachweis ist unbegrenzt gültig!"},{"$f":"IF(B4<>0,CONCATENATE(TEXT(W5,\"00 00 000\"),X5,Y5,Z5,TEXT(AA5,\"000\"),AB5,AC5),\"\")","v":" /  / 002 / "},{"$f":"IF(B5<>\"\",TEXT(I5+365,\"TT.MM.JJJJ\"),\"\")","v":""},{"$f":"IF(C5<>0,CONCATENATE($N$3,N5),\"\")","v":"Reg.-Nr.:  /  / 002 / "},{"$f":"CONCATENATE(D5,\" – \",TEXT(E5,\"TT.MM.JJJJ\"),\" | \",Doku!$Y$26)","v":" –  | "},{"$f":"CONCATENATE(D5,\" – \",TEXT(E5,\"TT.MM.JJJJ\"),\" | \",Doku!$Y$26)","v":" –  | "},{"$f":"IF(A5<>\"\",IF(TNL!$A$1<>4,TNL!CX38,\"\"),\"\")","v":""},{"$f":"IF(A5<>\"\",IF(TNL!$A$1<>4,TNL!ED38,\"\"),\"\")","v":""},{"$f":"IF(A5<>\"\",IF(TNL!$A$1<>4,TNL!EX38,\"\"),\"\")","v":""},null,{"$f":"IF(Start!$P$18<>\"\",Start!$P$18,\"\")","v":""}," / ",{"$f":"IF(Start!$I$9<>0,VLOOKUP(Start!$I$9,Data_LD!$A$4:$W$23,3,FALSE),\"\")","v":""}," / ",{"$f":"IF(TNL!$FP$37<>0,AF5,\"\")","v":2}," / ",{"$f":"IF(Doku!$CC$34<>\"\",TEXT(Doku!$CC$34,\"JJ\"),\"\")","v":""},null,1,{"$f":"IF(TNL!$FP$37<>\"\",TNL!$FP$37+AE5,0)","v":2}]
[{"$f":"IF(B6<>\"\",3,\"\")","v":""},{"$f":"IF(TNL!J11<>\"\",TNL!J11,\"\")","v":""},{"$f":"IF(B6<>\"\",TNL!AP11,\"\")","v":""},"",{"$f":"IF(B6<>\"\",TEXT(TNL!BU11,\"TT.MM.JJJJ\"),\"\")","v":""},"",{"$f":"IF(A6<>\"\",CONCATENATE(TNL!$AY$5,\", \"),\"\")","v":""},{"$f":"IF(A6<>\"\",TEXT(TNL!$C$5,\"TT.MM.JJJJ\"),\"\")","v":""},{"$f":"IF(A6<>\"\",TEXT(TNL!$T$5,\"TT.MM.JJJJ\"),\"\")","v":""},{"$f":"IF(B6<>\"\",IF(TNL!CJ11<>\"\",TNL!CJ11,\"\"),\"\")","v":""},{"$f":"IF(B6<>\"\",IF(TNL!DW11<>\"\",TNL!DW11,\"\"),\"\")","v":""},{"$f":"IF(B6<>\"\",IF(TNL!AP39<>\"\",TNL!AP39,\"\"),\"\")","v":""},"Dieser Nachweis ist unbegrenzt gültig!"," /  / 003 / ","","Reg.-Nr.:  /  / 003 / ",{"$f":"CONCATENATE(D6,\" – \",TEXT(E6,\"TT.MM.JJJJ\"),\" | \",Doku!$Y$26)","v":" –  | "},{"$f":"CONCATENATE(D6,\" – \",TEXT(E6,\"TT.MM.JJJJ\"),\" | \",Doku!$Y$26)","v":" –  | "},{"$f":"IF(A6<>\"\",IF(TNL!$A$1<>4,TNL!CX39,\"\"),\"\")","v":""},{"$f":"IF(A6<>\"\",IF(TNL!$A$1<>4,TNL!ED39,\"\"),\"\")","v":""},{"$f":"IF(A6<>\"\",IF(TNL!$A$1<>4,TNL!EX39,\"\"),\"\")","v":""},null,{"$f":"IF(Start!$P$18<>\"\",Start!$P$18,\"\")","v":""}," / ",{"$f":"IF(Start!$I$9<>0,VLOOKUP(Start!$I$9,Data_LD!$A$4:$W$23,3,FALSE),\"\")","v":""}," / ",{"$f":"IF(TNL!$FP$37<>0,AF6,\"\")","v":3}," / ",{"$f":"IF(Doku!$CC$34<>\"\",TEXT(Doku!$CC$34,\"JJ\"),\"\")","v":""},null,2,{"$f":"IF(TNL!$FP$37<>\"\",TNL!$FP$37+AE6,0)","v":3}]
[{"$f":"IF(B7<>\"\",4,\"\")","v":""},{"$f":"IF(TNL!J12<>\"\",TNL!J12,\"\")","v":""},{"$f":"IF(B7<>\"\",TNL!AP12,\"\")","v":""},"",{"$f":"IF(B7<>\"\",TEXT(TNL!BU12,\"TT.MM.JJJJ\"),\"\")","v":""},"",{"$f":"IF(A7<>\"\",CONCATENATE(TNL!$AY$5,\", \"),\"\")","v":""},{"$f":"IF(A7<>\"\",TEXT(TNL!$C$5,\"TT.MM.JJJJ\"),\"\")","v":""},{"$f":"IF(A7<>\"\",TEXT(TNL!$T$5,\"TT.MM.JJJJ\"),\"\")","v":""},{"$f":"IF(B7<>\"\",IF(TNL!CJ12<>\"\",TNL!CJ12,\"\"),\"\")","v":""},{"$f":"IF(B7<>\"\",IF(TNL!DW12<>\"\",TNL!DW12,\"\"),\"\")","v":""},{"$f":"IF(B7<>\"\",IF(TNL!AP40<>\"\",TNL!AP40,\"\"),\"\")","v":""},"Dieser Nachweis ist unbegrenzt gültig!"," /  / 004 / ","","Reg.-Nr.:  /  / 004 / ",{"$f":"CONCATENATE(D7,\" – \",TEXT(E7,\"TT.MM.JJJJ\"),\" | \",Doku!$Y$26)","v":" –  | "},{"$f":"CONCATENATE(D7,\" – \",TEXT(E7,\"TT.MM.JJJJ\"),\" | \",Doku!$Y$26)","v":" –  | "},{"$f":"IF(A7<>\"\",IF(TNL!$A$1<>4,TNL!CX40,\"\"),\"\")","v":""},{"$f":"IF(A7<>\"\",IF(TNL!$A$1<>4,TNL!ED40,\"\"),\"\")","v":""},{"$f":"IF(A7<>\"\",IF(TNL!$A$1<>4,TNL!EX40,\"\"),\"\")","v":""},null,{"$f":"IF(Start!$P$18<>\"\",Start!$P$18,\"\")","v":""}," / ",{"$f":"IF(Start!$I$9<>0,VLOOKUP(Start!$I$9,Data_LD!$A$4:$W$23,3,FALSE),\"\")","v":""}," / ",{"$f":"IF(TNL!$FP$37<>0,AF7,\"\")","v":4}," / ",{"$f":"IF(Doku!$CC$34<>\"\",TEXT(Doku!$CC$34,\"JJ\"),\"\")","v":""},null,3,{"$f":"IF(TNL!$FP$37<>\"\",TNL!$FP$37+AE7,0)","v":4}]
[{"$f":"IF(B8<>\"\",5,\"\")","v":""},{"$f":"IF(TNL!J13<>\"\",TNL!J13,\"\")","v":""},{"$f":"IF(B8<>\"\",TNL!AP13,\"\")","v":""},"",{"$f":"IF(B8<>\"\",TEXT(TNL!BU13,\"TT.MM.JJJJ\"),\"\")","v":""},"",{"$f":"IF(A8<>\"\",CONCATENATE(TNL!$AY$5,\", \"),\"\")","v":""},{"$f":"IF(A8<>\"\",TEXT(TNL!$C$5,\"TT.MM.JJJJ\"),\"\")","v":""},{"$f":"IF(A8<>\"\",TEXT(TNL!$T$5,\"TT.MM.JJJJ\"),\"\")","v":""},{"$f":"IF(B8<>\"\",IF(TNL!CJ13<>\"\",TNL!CJ13,\"\"),\"\")","v":""},{"$f":"IF(B8<>\"\",IF(TNL!DW13<>\"\",TNL!DW13,\"\"),\"\")","v":""},{"$f":"IF(B8<>\"\",IF(TNL!AP41<>\"\",TNL!AP41,\"\"),\"\")","v":""},"Dieser Nachweis ist unbegrenzt gültig!"," /  / 005 / ","","Reg.-Nr.:  /  / 005 / ",{"$f":"CONCATENATE(D8,\" – \",TEXT(E8,\"TT.MM.JJJJ\"),\" | \",Doku!$Y$26)","v":" –  | "},{"$f":"CONCATENATE(D8,\" – \",TEXT(E8,\"TT.MM.JJJJ\"),\" | \",Doku!$Y$26)","v":" –  | "},{"$f":"IF(A8<>\"\",IF(TNL!$A$1<>4,TNL!CX41,\"\"),\"\")","v":""},{"$f":"IF(A8<>\"\",IF(TNL!$A$1<>4,TNL!ED41,\"\"),\"\")","v":""},{"$f":"IF(A8<>\"\",IF(TNL!$A$1<>4,TNL!EX41,\"\"),\"\")","v":""},null,{"$f":"IF(Start!$P$18<>\"\",Start!$P$18,\"\")","v":""}," / ",{"$f":"IF(Start!$I$9<>0,VLOOKUP(Start!$I$9,Data_LD!$A$4:$W$23,3,FALSE),\"\")","v":""}," / ",{"$f":"IF(TNL!$FP$37<>0,AF8,\"\")","v":5}," / ",{"$f":"IF(Doku!$CC$34<>\"\",TEXT(Doku!$CC$34,\"JJ\"),\"\")","v":""},null,4,{"$f":"IF(TNL!$FP$37<>\"\",TNL!$FP$37+AE8,0)","v":5}]
[{"$f":"IF(B9<>\"\",6,\"\")","v":""},{"$f":"IF(TNL!J14<>\"\",TNL!J14,\"\")","v":""},{"$f":"IF(B9<>\"\",TNL!AP14,\"\")","v":""},"",{"$f":"IF(B9<>\"\",TEXT(TNL!BU14,\"TT.MM.JJJJ\"),\"\")","v":""},"",{"$f":"IF(A9<>\"\",CONCATENATE(TNL!$AY$5,\", \"),\"\")","v":""},{"$f":"IF(A9<>\"\",TEXT(TNL!$C$5,\"TT.MM.JJJJ\"),\"\")","v":""},{"$f":"IF(A9<>\"\",TEXT(TNL!$T$5,\"TT.MM.JJJJ\"),\"\")","v":""},{"$f":"IF(B9<>\"\",IF(TNL!CJ14<>\"\",TNL!CJ14,\"\"),\"\")","v":""},{"$f":"IF(B9<>\"\",IF(TNL!DW14<>\"\",TNL!DW14,\"\"),\"\")","v":""},{"$f":"IF(B9<>\"\",IF(TNL!AP42<>\"\",TNL!AP42,\"\"),\"\")","v":""},"Dieser Nachweis ist unbegrenzt gültig!"," /  / 006 / ","","Reg.-Nr.:  /  / 006 / ",{"$f":"CONCATENATE(D9,\" – \",TEXT(E9,\"TT.MM.JJJJ\"),\" | \",Doku!$Y$26)","v":" –  | "},{"$f":"CONCATENATE(D9,\" – \",TEXT(E9,\"TT.MM.JJJJ\"),\" | \",Doku!$Y$26)","v":" –  | "},{"$f":"IF(A9<>\"\",IF(TNL!$A$1<>4,TNL!CX42,\"\"),\"\")","v":""},{"$f":"IF(A9<>\"\",IF(TNL!$A$1<>4,TNL!ED42,\"\"),\"\")","v":""},{"$f":"IF(A9<>\"\",IF(TNL!$A$1<>4,TNL!EX42,\"\"),\"\")","v":""},null,{"$f":"IF(Start!$P$18<>\"\",Start!$P$18,\"\")","v":""}," / ",{"$f":"IF(Start!$I$9<>0,VLOOKUP(Start!$I$9,Data_LD!$A$4:$W$23,3,FALSE),\"\")","v":""}," / ",{"$f":"IF(TNL!$FP$37<>0,AF9,\"\")","v":6}," / ",{"$f":"IF(Doku!$CC$34<>\"\",TEXT(Doku!$CC$34,\"JJ\"),\"\")","v":""},null,5,{"$f":"IF(TNL!$FP$37<>\"\",TNL!$FP$37+AE9,0)","v":6}]
[{"$f":"IF(B10<>\"\",7,\"\")","v":""},{"$f":"IF(TNL!J15<>\"\",TNL!J15,\"\")","v":""},{"$f":"IF(B10<>\"\",TNL!AP15,\"\")","v":""},"",{"$f":"IF(B10<>\"\",TEXT(TNL!BU15,\"TT.MM.JJJJ\"),\"\")","v":""},"",{"$f":"IF(A10<>\"\",CONCATENATE(TNL!$AY$5,\", \"),\"\")","v":""},{"$f":"IF(A10<>\"\",TEXT(TNL!$C$5,\"TT.MM.JJJJ\"),\"\")","v":""},{"$f":"IF(A10<>\"\",TEXT(TNL!$T$5,\"TT.MM.JJJJ\"),\"\")","v":""},{"$f":"IF(B10<>\"\",IF(TNL!CJ15<>\"\",TNL!CJ15,\"\"),\"\")","v":""},{"$f":"IF(B10<>\"\",IF(TNL!DW15<>\"\",TNL!DW15,\"\"),\"\")","v":""},{"$f":"IF(B10<>\"\",IF(TNL!AP43<>\"\",TNL!AP43,\"\"),\"\")","v":""},"Dieser Nachweis ist unbegrenzt gültig!"," /  / 007 / ","","Reg.-Nr.:  /  / 007 / ",{"$f":"CONCATENATE(D10,\" – \",TEXT(E10,\"TT.MM.JJJJ\"),\" | \",Doku!$Y$26)","v":" –  | "},{"$f":"CONCATENATE(D10,\" – \",TEXT(E10,\"TT.MM.JJJJ\"),\" | \",Doku!$Y$26)","v":" –  | "},{"$f":"IF(A10<>\"\",IF(TNL!$A$1<>4,TNL!CX43,\"\"),\"\")","v":""},{"$f":"IF(A10<>\"\",IF(TNL!$A$1<>4,TNL!ED43,\"\"),\"\")","v":""},{"$f":"IF(A10<>\"\",IF(TNL!$A$1<>4,TNL!EX43,\"\"),\"\")","v":""},null,{"$f":"IF(Start!$P$18<>\"\",Start!$P$18,\"\")","v":""}," / ",{"$f":"IF(Start!$I$9<>0,VLOOKUP(Start!$I$9,Data_LD!$A$4:$W$23,3,FALSE),\"\")","v":""}," / ",{"$f":"IF(TNL!$FP$37<>0,AF10,\"\")","v":7}," / ",{"$f":"IF(Doku!$CC$34<>\"\",TEXT(Doku!$CC$34,\"JJ\"),\"\")","v":""},null,6,{"$f":"IF(TNL!$FP$37<>\"\",TNL!$FP$37+AE10,0)","v":7}]
[{"$f":"IF(B11<>\"\",8,\"\")","v":""},{"$f":"IF(TNL!J16<>\"\",TNL!J16,\"\")","v":""},{"$f":"IF(B11<>\"\",TNL!AP16,\"\")","v":""},"",{"$f":"IF(B11<>\"\",TEXT(TNL!BU16,\"TT.MM.JJJJ\"),\"\")","v":""},"",{"$f":"IF(A11<>\"\",CONCATENATE(TNL!$AY$5,\", \"),\"\")","v":""},{"$f":"IF(A11<>\"\",TEXT(TNL!$C$5,\"TT.MM.JJJJ\"),\"\")","v":""},{"$f":"IF(A11<>\"\",TEXT(TNL!$T$5,\"TT.MM.JJJJ\"),\"\")","v":""},{"$f":"IF(B11<>\"\",IF(TNL!CJ16<>\"\",TNL!CJ16,\"\"),\"\")","v":""},{"$f":"IF(B11<>\"\",IF(TNL!DW16<>\"\",TNL!DW16,\"\"),\"\")","v":""},{"$f":"IF(B11<>\"\",IF(TNL!AP44<>\"\",TNL!AP44,\"\"),\"\")","v":""},"Dieser Nachweis ist unbegrenzt gültig!"," /  / 008 / ","","Reg.-Nr.:  /  / 008 / ",{"$f":"CONCATENATE(D11,\" – \",TEXT(E11,\"TT.MM.JJJJ\"),\" | \",Doku!$Y$26)","v":" –  | "},{"$f":"CONCATENATE(D11,\" – \",TEXT(E11,\"TT.MM.JJJJ\"),\" | \",Doku!$Y$26)","v":" –  | "},{"$f":"IF(A11<>\"\",IF(TNL!$A$1<>4,TNL!CX44,\"\"),\"\")","v":""},{"$f":"IF(A11<>\"\",IF(TNL!$A$1<>4,TNL!ED44,\"\"),\"\")","v":""},{"$f":"IF(A11<>\"\",IF(TNL!$A$1<>4,TNL!EX44,\"\"),\"\")","v":""},null,{"$f":"IF(Start!$P$18<>\"\",Start!$P$18,\"\")","v":""}," / ",{"$f":"IF(Start!$I$9<>0,VLOOKUP(Start!$I$9,Data_LD!$A$4:$W$23,3,FALSE),\"\")","v":""}," / ",{"$f":"IF(TNL!$FP$37<>0,AF11,\"\")","v":8}," / ",{"$f":"IF(Doku!$CC$34<>\"\",TEXT(Doku!$CC$34,\"JJ\"),\"\")","v":""},null,7,{"$f":"IF(TNL!$FP$37<>\"\",TNL!$FP$37+AE11,0)","v":8}]
[{"$f":"IF(B12<>\"\",9,\"\")","v":""},{"$f":"IF(TNL!J17<>\"\",TNL!J17,\"\")","v":""},{"$f":"IF(B12<>\"\",TNL!AP17,\"\")","v":""},"",{"$f":"IF(B12<>\"\",TEXT(TNL!BU17,\"TT.MM.JJJJ\"),\"\")","v":""},"",{"$f":"IF(A12<>\"\",CONCATENATE(TNL!$AY$5,\", \"),\"\")","v":""},{"$f":"IF(A12<>\"\",TEXT(TNL!$C$5,\"TT.MM.JJJJ\"),\"\")","v":""},{"$f":"IF(A12<>\"\",TEXT(TNL!$T$5,\"TT.MM.JJJJ\"),\"\")","v":""},{"$f":"IF(B12<>\"\",IF(TNL!CJ17<>\"\",TNL!CJ17,\"\"),\"\")","v":""},{"$f":"IF(B12<>\"\",IF(TNL!DW17<>\"\",TNL!DW17,\"\"),\"\")","v":""},{"$f":"IF(B12<>\"\",IF(TNL!AP45<>\"\",TNL!AP45,\"\"),\"\")","v":""},"Dieser Nachweis ist unbegrenzt gültig!"," /  / 009 / ","","Reg.-Nr.:  /  / 009 / ",{"$f":"CONCATENATE(D12,\" – \",TEXT(E12,\"TT.MM.JJJJ\"),\" | \",Doku!$Y$26)","v":" –  | "},{"$f":"CONCATENATE(D12,\" – \",TEXT(E12,\"TT.MM.JJJJ\"),\" | \",Doku!$Y$26)","v":" –  | "},{"$f":"IF(A12<>\"\",IF(TNL!$A$1<>4,TNL!CX45,\"\"),\"\")","v":""},{"$f":"IF(A12<>\"\",IF(TNL!$A$1<>4,TNL!ED45,\"\"),\"\")","v":""},{"$f":"IF(A12<>\"\",IF(TNL!$A$1<>4,TNL!EX45,\"\"),\"\")","v":""},null,{"$f":"IF(Start!$P$18<>\"\",Start!$P$18,\"\")","v":""}," / ",{"$f":"IF(Start!$I$9<>0,VLOOKUP(Start!$I$9,Data_LD!$A$4:$W$23,3,FALSE),\"\")","v":""}," / ",{"$f":"IF(TNL!$FP$37<>0,AF12,\"\")","v":9}," / ",{"$f":"IF(Doku!$CC$34<>\"\",TEXT(Doku!$CC$34,\"JJ\"),\"\")","v":""},null,8,{"$f":"IF(TNL!$FP$37<>\"\",TNL!$FP$37+AE12,0)","v":9}]
[{"$f":"IF(B13<>\"\",10,\"\")","v":""},{"$f":"IF(TNL!J18<>\"\",TNL!J18,\"\")","v":""},{"$f":"IF(B13<>\"\",TNL!AP18,\"\")","v":""},"",{"$f":"IF(B13<>\"\",TEXT(TNL!BU18,\"TT.MM.JJJJ\"),\"\")","v":""},"",{"$f":"IF(A13<>\"\",CONCATENATE(TNL!$AY$5,\", \"),\"\")","v":""},{"$f":"IF(A13<>\"\",TEXT(TNL!$C$5,\"TT.MM.JJJJ\"),\"\")","v":""},{"$f":"IF(A13<>\"\",TEXT(TNL!$T$5,\"TT.MM.JJJJ\"),\"\")","v":""},{"$f":"IF(B13<>\"\",IF(TNL!CJ18<>\"\",TNL!CJ18,\"\"),\"\")","v":""},{"$f":"IF(B13<>\"\",IF(TNL!DW18<>\"\",TNL!DW18,\"\"),\"\")","v":""},{"$f":"IF(B13<>\"\",IF(TNL!AP46<>\"\",TNL!AP46,\"\"),\"\")","v":""},"Dieser Nachweis ist unbegrenzt gültig!"," /  / 010 / ","","Reg.-Nr.:  /  / 010 / ",{"$f":"CONCATENATE(D13,\" – \",TEXT(E13,\"TT.MM.JJJJ\"),\" | \",Doku!$Y$26)","v":" –  | "},{"$f":"CONCATENATE(D13,\" – \",TEXT(E13,\"TT.MM.JJJJ\"),\" | \",Doku!$Y$26)","v":" –  | "},{"$f":"IF(A13<>\"\",IF(TNL!$A$1<>4,TNL!CX46,\"\"),\"\")","v":""},{"$f":"IF(A13<>\"\",IF(TNL!$A$1<>4,TNL!ED46,\"\"),\"\")","v":""},{"$f":"IF(A13<>\"\",IF(TNL!$A$1<>4,TNL!EX46,\"\"),\"\")","v":""},null,{"$f":"IF(Start!$P$18<>\"\",Start!$P$18,\"\")","v":""}," / ",{"$f":"IF(Start!$I$9<>0,VLOOKUP(Start!$I$9,Data_LD!$A$4:$W$23,3,FALSE),\"\")","v":""}," / ",{"$f":"IF(TNL!$FP$37<>0,AF13,\"\")","v":10}," / ",{"$f":"IF(Doku!$CC$34<>\"\",TEXT(Doku!$CC$34,\"JJ\"),\"\")","v":""},null,9,{"$f":"IF(TNL!$FP$37<>\"\",TNL!$FP$37+AE13,0)","v":10}]
[{"$f":"IF(B14<>\"\",11,\"\")","v":""},{"$f":"IF(TNL!J19<>\"\",TNL!J19,\"\")","v":""},{"$f":"IF(B14<>\"\",TNL!AP19,\"\")","v":""},"",{"$f":"IF(B14<>\"\",TEXT(TNL!BU19,\"TT.MM.JJJJ\"),\"\")","v":""},"",{"$f":"IF(A14<>\"\",CONCATENATE(TNL!$AY$5,\", \"),\"\")","v":""},{"$f":"IF(A14<>\"\",TEXT(TNL!$C$5,\"TT.MM.JJJJ\"),\"\")","v":""},{"$f":"IF(A14<>\"\",TEXT(TNL!$T$5,\"TT.MM.JJJJ\"),\"\")","v":""},{"$f":"IF(B14<>\"\",IF(TNL!CJ19<>\"\",TNL!CJ19,\"\"),\"\")","v":""},{"$f":"IF(B14<>\"\",IF(TNL!DW19<>\"\",TNL!DW19,\"\"),\"\")","v":""},{"$f":"IF(B14<>\"\",IF(TNL!AP47<>\"\",TNL!AP47,\"\"),\"\")","v":""},"Dieser Nachweis ist unbegrenzt gültig!"," /  / 011 / ","","Reg.-Nr.:  /  / 011 / ",{"$f":"CONCATENATE(D14,\" – \",TEXT(E14,\"TT.MM.JJJJ\"),\" | \",Doku!$Y$26)","v":" –  | "},{"$f":"CONCATENATE(D14,\" – \",TEXT(E14,\"TT.MM.JJJJ\"),\" | \",Doku!$Y$26)","v":" –  | "},{"$f":"IF(A14<>\"\",IF(TNL!$A$1<>4,TNL!CX47,\"\"),\"\")","v":""},{"$f":"IF(A14<>\"\",IF(TNL!$A$1<>4,TNL!ED47,\"\"),\"\")","v":""},{"$f":"IF(A14<>\"\",IF(TNL!$A$1<>4,TNL!EX47,\"\"),\"\")","v":""},null,{"$f":"IF(Start!$P$18<>\"\",Start!$P$18,\"\")","v":""}," / ",{"$f":"IF(Start!$I$9<>0,VLOOKUP(Start!$I$9,Data_LD!$A$4:$W$23,3,FALSE),\"\")","v":""}," / ",{"$f":"IF(TNL!$FP$37<>0,AF14,\"\")","v":11}," / ",{"$f":"IF(Doku!$CC$34<>\"\",TEXT(Doku!$CC$34,\"JJ\"),\"\")","v":""},null,10,{"$f":"IF(TNL!$FP$37<>\"\",TNL!$FP$37+AE14,0)","v":11}]
[{"$f":"IF(B15<>\"\",12,\"\")","v":""},{"$f":"IF(TNL!J20<>\"\",TNL!J20,\"\")","v":""},{"$f":"IF(B15<>\"\",TNL!AP20,\"\")","v":""},"",{"$f":"IF(B15<>\"\",TEXT(TNL!BU20,\"TT.MM.JJJJ\"),\"\")","v":""},"",{"$f":"IF(A15<>\"\",CONCATENATE(TNL!$AY$5,\", \"),\"\")","v":""},{"$f":"IF(A15<>\"\",TEXT(TNL!$C$5,\"TT.MM.JJJJ\"),\"\")","v":""},{"$f":"IF(A15<>\"\",TEXT(TNL!$T$5,\"TT.MM.JJJJ\"),\"\")","v":""},{"$f":"IF(B15<>\"\",IF(TNL!CJ20<>\"\",TNL!CJ20,\"\"),\"\")","v":""},{"$f":"IF(B15<>\"\",IF(TNL!DW20<>\"\",TNL!DW20,\"\"),\"\")","v":""},{"$f":"IF(B15<>\"\",IF(TNL!AP48<>\"\",TNL!AP48,\"\"),\"\")","v":""},"Dieser Nachweis ist unbegrenzt gültig!"," /  / 012 / ","","Reg.-Nr.:  /  / 012 / ",{"$f":"CONCATENATE(D15,\" – \",TEXT(E15,\"TT.MM.JJJJ\"),\" | \",Doku!$Y$26)","v":" –  | "},{"$f":"CONCATENATE(D15,\" – \",TEXT(E15,\"TT.MM.JJJJ\"),\" | \",Doku!$Y$26)","v":" –  | "},{"$f":"IF(A15<>\"\",IF(TNL!$A$1<>4,TNL!CX48,\"\"),\"\")","v":""},{"$f":"IF(A15<>\"\",IF(TNL!$A$1<>4,TNL!ED48,\"\"),\"\")","v":""},{"$f":"IF(A15<>\"\",IF(TNL!$A$1<>4,TNL!EX48,\"\"),\"\")","v":""},null,{"$f":"IF(Start!$P$18<>\"\",Start!$P$18,\"\")","v":""}," / ",{"$f":"IF(Start!$I$9<>0,VLOOKUP(Start!$I$9,Data_LD!$A$4:$W$23,3,FALSE),\"\")","v":""}," / ",{"$f":"IF(TNL!$FP$37<>0,AF15,\"\")","v":12}," / ",{"$f":"IF(Doku!$CC$34<>\"\",TEXT(Doku!$CC$34,\"JJ\"),\"\")","v":""},null,11,{"$f":"IF(TNL!$FP$37<>\"\",TNL!$FP$37+AE15,0)","v":12}]
[{"$f":"IF(B16<>\"\",13,\"\")","v":""},{"$f":"IF(TNL!J21<>\"\",TNL!J21,\"\")","v":""},{"$f":"IF(B16<>\"\",TNL!AP21,\"\")","v":""},"",{"$f":"IF(B16<>\"\",TEXT(TNL!BU21,\"TT.MM.JJJJ\"),\"\")","v":""},"",{"$f":"IF(A16<>\"\",CONCATENATE(TNL!$AY$5,\", \"),\"\")","v":""},{"$f":"IF(A16<>\"\",TEXT(TNL!$C$5,\"TT.MM.JJJJ\"),\"\")","v":""},{"$f":"IF(A16<>\"\",TEXT(TNL!$T$5,\"TT.MM.JJJJ\"),\"\")","v":""},{"$f":"IF(B16<>\"\",IF(TNL!CJ21<>\"\",TNL!CJ21,\"\"),\"\")","v":""},{"$f":"IF(B16<>\"\",IF(TNL!DW21<>\"\",TNL!DW21,\"\"),\"\")","v":""},{"$f":"IF(B16<>\"\",IF(TNL!AP49<>\"\",TNL!AP49,\"\"),\"\")","v":""},"Dieser Nachweis ist unbegrenzt gültig!"," /  / 013 / ","","Reg.-Nr.:  /  / 013 / ",{"$f":"CONCATENATE(D16,\" – \",TEXT(E16,\"TT.MM.JJJJ\"),\" | \",Doku!$Y$26)","v":" –  | "},{"$f":"CONCATENATE(D16,\" – \",TEXT(E16,\"TT.MM.JJJJ\"),\" | \",Doku!$Y$26)","v":" –  | "},{"$f":"IF(A16<>\"\",IF(TNL!$A$1<>4,TNL!CX49,\"\"),\"\")","v":""},{"$f":"IF(A16<>\"\",IF(TNL!$A$1<>4,TNL!ED49,\"\"),\"\")","v":""},{"$f":"IF(A16<>\"\",IF(TNL!$A$1<>4,TNL!EX49,\"\"),\"\")","v":""},null,{"$f":"IF(Start!$P$18<>\"\",Start!$P$18,\"\")","v":""}," / ",{"$f":"IF(Start!$I$9<>0,VLOOKUP(Start!$I$9,Data_LD!$A$4:$W$23,3,FALSE),\"\")","v":""}," / ",{"$f":"IF(TNL!$FP$37<>0,AF16,\"\")","v":13}," / ",{"$f":"IF(Doku!$CC$34<>\"\",TEXT(Doku!$CC$34,\"JJ\"),\"\")","v":""},null,12,{"$f":"IF(TNL!$FP$37<>\"\",TNL!$FP$37+AE16,0)","v":13}]
[{"$f":"IF(B17<>\"\",14,\"\")","v":""},{"$f":"IF(TNL!J22<>\"\",TNL!J22,\"\")","v":""},{"$f":"IF(B17<>\"\",TNL!AP22,\"\")","v":""},"",{"$f":"IF(B17<>\"\",TEXT(TNL!BU22,\"TT.MM.JJJJ\"),\"\")","v":""},"",{"$f":"IF(A17<>\"\",CONCATENATE(TNL!$AY$5,\", \"),\"\")","v":""},{"$f":"IF(A17<>\"\",TEXT(TNL!$C$5,\"TT.MM.JJJJ\"),\"\")","v":""},{"$f":"IF(A17<>\"\",TEXT(TNL!$T$5,\"TT.MM.JJJJ\"),\"\")","v":""},{"$f":"IF(B17<>\"\",IF(TNL!CJ22<>\"\",TNL!CJ22,\"\"),\"\")","v":""},{"$f":"IF(B17<>\"\",IF(TNL!DW22<>\"\",TNL!DW22,\"\"),\"\")","v":""},{"$f":"IF(B17<>\"\",IF(TNL!AP50<>\"\",TNL!AP50,\"\"),\"\")","v":""},"Dieser Nachweis ist unbegrenzt gültig!"," /  / 014 / ","","Reg.-Nr.:  /  / 014 / ",{"$f":"CONCATENATE(D17,\" – \",TEXT(E17,\"TT.MM.JJJJ\"),\" | \",Doku!$Y$26)","v":" –  | "},{"$f":"CONCATENATE(D17,\" – \",TEXT(E17,\"TT.MM.JJJJ\"),\" | \",Doku!$Y$26)","v":" –  | "},{"$f":"IF(A17<>\"\",IF(TNL!$A$1<>4,TNL!CX50,\"\"),\"\")","v":""},{"$f":"IF(A17<>\"\",IF(TNL!$A$1<>4,TNL!ED50,\"\"),\"\")","v":""},{"$f":"IF(A17<>\"\",IF(TNL!$A$1<>4,TNL!EX50,\"\"),\"\")","v":""},null,{"$f":"IF(Start!$P$18<>\"\",Start!$P$18,\"\")","v":""}," / ",{"$f":"IF(Start!$I$9<>0,VLOOKUP(Start!$I$9,Data_LD!$A$4:$W$23,3,FALSE),\"\")","v":""}," / ",{"$f":"IF(TNL!$FP$37<>0,AF17,\"\")","v":14}," / ",{"$f":"IF(Doku!$CC$34<>\"\",TEXT(Doku!$CC$34,\"JJ\"),\"\")","v":""},null,13,{"$f":"IF(TNL!$FP$37<>\"\",TNL!$FP$37+AE17,0)","v":14}]
[{"$f":"IF(B18<>\"\",15,\"\")","v":""},{"$f":"IF(TNL!J23<>\"\",TNL!J23,\"\")","v":""},{"$f":"IF(B18<>\"\",TNL!AP23,\"\")","v":""},"",{"$f":"IF(B18<>\"\",TEXT(TNL!BU23,\"TT.MM.JJJJ\"),\"\")","v":""},"",{"$f":"IF(A18<>\"\",CONCATENATE(TNL!$AY$5,\", \"),\"\")","v":""},{"$f":"IF(A18<>\"\",TEXT(TNL!$C$5,\"TT.MM.JJJJ\"),\"\")","v":""},{"$f":"IF(A18<>\"\",TEXT(TNL!$T$5,\"TT.MM.JJJJ\"),\"\")","v":""},{"$f":"IF(B18<>\"\",IF(TNL!CJ23<>\"\",TNL!CJ23,\"\"),\"\")","v":""},{"$f":"IF(B18<>\"\",IF(TNL!DW23<>\"\",TNL!DW23,\"\"),\"\")","v":""},{"$f":"IF(B18<>\"\",IF(TNL!AP51<>\"\",TNL!AP51,\"\"),\"\")","v":""},"Dieser Nachweis ist unbegrenzt gültig!"," /  / 015 / ","","Reg.-Nr.:  /  / 015 / ",{"$f":"CONCATENATE(D18,\" – \",TEXT(E18,\"TT.MM.JJJJ\"),\" | \",Doku!$Y$26)","v":" –  | "},{"$f":"CONCATENATE(D18,\" – \",TEXT(E18,\"TT.MM.JJJJ\"),\" | \",Doku!$Y$26)","v":" –  | "},{"$f":"IF(A18<>\"\",IF(TNL!$A$1<>4,TNL!CX51,\"\"),\"\")","v":""},{"$f":"IF(A18<>\"\",IF(TNL!$A$1<>4,TNL!ED51,\"\"),\"\")","v":""},{"$f":"IF(A18<>\"\",IF(TNL!$A$1<>4,TNL!EX51,\"\"),\"\")","v":""},null,{"$f":"IF(Start!$P$18<>\"\",Start!$P$18,\"\")","v":""}," / ",{"$f":"IF(Start!$I$9<>0,VLOOKUP(Start!$I$9,Data_LD!$A$4:$W$23,3,FALSE),\"\")","v":""}," / ",{"$f":"IF(TNL!$FP$37<>0,AF18,\"\")","v":15}," / ",{"$f":"IF(Doku!$CC$34<>\"\",TEXT(Doku!$CC$34,\"JJ\"),\"\")","v":""},null,14,{"$f":"IF(TNL!$FP$37<>\"\",TNL!$FP$37+AE18,0)","v":15}]
[{"$f":"IF(B19<>\"\",16,\"\")","v":""},{"$f":"IF(TNL!J24<>\"\",TNL!J24,\"\")","v":""},{"$f":"IF(B19<>\"\",TNL!AP24,\"\")","v":""},"",{"$f":"IF(B19<>\"\",TEXT(TNL!BU24,\"TT.MM.JJJJ\"),\"\")","v":""},"",{"$f":"IF(A19<>\"\",CONCATENATE(TNL!$AY$5,\", \"),\"\")","v":""},{"$f":"IF(A19<>\"\",TEXT(TNL!$C$5,\"TT.MM.JJJJ\"),\"\")","v":""},{"$f":"IF(A19<>\"\",TEXT(TNL!$T$5,\"TT.MM.JJJJ\"),\"\")","v":""},{"$f":"IF(B19<>\"\",IF(TNL!CJ24<>\"\",TNL!CJ24,\"\"),\"\")","v":""},{"$f":"IF(B19<>\"\",IF(TNL!DW24<>\"\",TNL!DW24,\"\"),\"\")","v":""},{"$f":"IF(B19<>\"\",IF(TNL!AP52<>\"\",TNL!AP52,\"\"),\"\")","v":""},"Dieser Nachweis ist unbegrenzt gültig!"," /  / 016 / ","","Reg.-Nr.:  /  / 016 / ",{"$f":"CONCATENATE(D19,\" – \",TEXT(E19,\"TT.MM.JJJJ\"),\" | \",Doku!$Y$26)","v":" –  | "},{"$f":"CONCATENATE(D19,\" – \",TEXT(E19,\"TT.MM.JJJJ\"),\" | \",Doku!$Y$26)","v":" –  | "},{"$f":"IF(A19<>\"\",IF(TNL!$A$1<>4,TNL!CX52,\"\"),\"\")","v":""},{"$f":"IF(A19<>\"\",IF(TNL!$A$1<>4,TNL!ED52,\"\"),\"\")","v":""},{"$f":"IF(A19<>\"\",IF(TNL!$A$1<>4,TNL!EX52,\"\"),\"\")","v":""},null,{"$f":"IF(Start!$P$18<>\"\",Start!$P$18,\"\")","v":""}," / ",{"$f":"IF(Start!$I$9<>0,VLOOKUP(Start!$I$9,Data_LD!$A$4:$W$23,3,FALSE),\"\")","v":""}," / ",{"$f":"IF(TNL!$FP$37<>0,AF19,\"\")","v":16}," / ",{"$f":"IF(Doku!$CC$34<>\"\",TEXT(Doku!$CC$34,\"JJ\"),\"\")","v":""},null,15,{"$f":"IF(TNL!$FP$37<>\"\",TNL!$FP$37+AE19,0)","v":16}]
[{"$f":"IF(B20<>\"\",17,\"\")","v":""},{"$f":"IF(TNL!J25<>\"\",TNL!J25,\"\")","v":""},{"$f":"IF(B20<>\"\",TNL!AP25,\"\")","v":""},"",{"$f":"IF(B20<>\"\",TEXT(TNL!BU25,\"TT.MM.JJJJ\"),\"\")","v":""},"",{"$f":"IF(A20<>\"\",CONCATENATE(TNL!$AY$5,\", \"),\"\")","v":""},{"$f":"IF(A20<>\"\",TEXT(TNL!$C$5,\"TT.MM.JJJJ\"),\"\")","v":""},{"$f":"IF(A20<>\"\",TEXT(TNL!$T$5,\"TT.MM.JJJJ\"),\"\")","v":""},{"$f":"IF(B20<>\"\",IF(TNL!CJ25<>\"\",TNL!CJ25,\"\"),\"\")","v":""},{"$f":"IF(B20<>\"\",IF(TNL!DW25<>\"\",TNL!DW25,\"\"),\"\")","v":""},{"$f":"IF(B20<>\"\",IF(TNL!AP53<>\"\",TNL!AP53,\"\"),\"\")","v":""},"Dieser Nachweis ist unbegrenzt gültig!"," /  / 017 / ","","Reg.-Nr.:  /  / 017 / ",{"$f":"CONCATENATE(D20,\" – \",TEXT(E20,\"TT.MM.JJJJ\"),\" | \",Doku!$Y$26)","v":" –  | "},{"$f":"CONCATENATE(D20,\" – \",TEXT(E20,\"TT.MM.JJJJ\"),\" | \",Doku!$Y$26)","v":" –  | "},{"$f":"IF(A20<>\"\",IF(TNL!$A$1<>4,TNL!CX53,\"\"),\"\")","v":""},{"$f":"IF(A20<>\"\",IF(TNL!$A$1<>4,TNL!ED53,\"\"),\"\")","v":""},{"$f":"IF(A20<>\"\",IF(TNL!$A$1<>4,TNL!EX53,\"\"),\"\")","v":""},null,{"$f":"IF(Start!$P$18<>\"\",Start!$P$18,\"\")","v":""}," / ",{"$f":"IF(Start!$I$9<>0,VLOOKUP(Start!$I$9,Data_LD!$A$4:$W$23,3,FALSE),\"\")","v":""}," / ",{"$f":"IF(TNL!$FP$37<>0,AF20,\"\")","v":17}," / ",{"$f":"IF(Doku!$CC$34<>\"\",TEXT(Doku!$CC$34,\"JJ\"),\"\")","v":""},null,16,{"$f":"IF(TNL!$FP$37<>\"\",TNL!$FP$37+AE20,0)","v":17}]
[{"$f":"IF(B21<>\"\",18,\"\")","v":""},{"$f":"IF(TNL!J26<>\"\",TNL!J26,\"\")","v":""},{"$f":"IF(B21<>\"\",TNL!AP26,\"\")","v":""},"",{"$f":"IF(B21<>\"\",TEXT(TNL!BU26,\"TT.MM.JJJJ\"),\"\")","v":""},"",{"$f":"IF(A21<>\"\",CONCATENATE(TNL!$AY$5,\", \"),\"\")","v":""},{"$f":"IF(A21<>\"\",TEXT(TNL!$C$5,\"TT.MM.JJJJ\"),\"\")","v":""},{"$f":"IF(A21<>\"\",TEXT(TNL!$T$5,\"TT.MM.JJJJ\"),\"\")","v":""},{"$f":"IF(B21<>\"\",IF(TNL!CJ26<>\"\",TNL!CJ26,\"\"),\"\")","v":""},{"$f":"IF(B21<>\"\",IF(TNL!DW26<>\"\",TNL!DW26,\"\"),\"\")","v":""},{"$f":"IF(B21<>\"\",IF(TNL!AP54<>\"\",TNL!AP54,\"\"),\"\")","v":""},"Dieser Nachweis ist unbegrenzt gültig!"," /  / 018 / ","","Reg.-Nr.:  /  / 018 / ",{"$f":"CONCATENATE(D21,\" – \",TEXT(E21,\"TT.MM.JJJJ\"),\" | \",Doku!$Y$26)","v":" –  | "},{"$f":"CONCATENATE(D21,\" – \",TEXT(E21,\"TT.MM.JJJJ\"),\" | \",Doku!$Y$26)","v":" –  | "},{"$f":"IF(A21<>\"\",IF(TNL!$A$1<>4,TNL!CX54,\"\"),\"\")","v":""},{"$f":"IF(A21<>\"\",IF(TNL!$A$1<>4,TNL!ED54,\"\"),\"\")","v":""},{"$f":"IF(A21<>\"\",IF(TNL!$A$1<>4,TNL!EX54,\"\"),\"\")","v":""},null,{"$f":"IF(Start!$P$18<>\"\",Start!$P$18,\"\")","v":""}," / ",{"$f":"IF(Start!$I$9<>0,VLOOKUP(Start!$I$9,Data_LD!$A$4:$W$23,3,FALSE),\"\")","v":""}," / ",{"$f":"IF(TNL!$FP$37<>0,AF21,\"\")","v":18}," / ",{"$f":"IF(Doku!$CC$34<>\"\",TEXT(Doku!$CC$34,\"JJ\"),\"\")","v":""},null,17,{"$f":"IF(TNL!$FP$37<>\"\",TNL!$FP$37+AE21,0)","v":18}]
[{"$f":"IF(B22<>\"\",19,\"\")","v":""},{"$f":"IF(TNL!J27<>\"\",TNL!J27,\"\")","v":""},{"$f":"IF(B22<>\"\",TNL!AP27,\"\")","v":""},"",{"$f":"IF(B22<>\"\",TEXT(TNL!BU27,\"TT.MM.JJJJ\"),\"\")","v":""},"",{"$f":"IF(A22<>\"\",CONCATENATE(TNL!$AY$5,\", \"),\"\")","v":""},{"$f":"IF(A22<>\"\",TEXT(TNL!$C$5,\"TT.MM.JJJJ\"),\"\")","v":""},{"$f":"IF(A22<>\"\",TEXT(TNL!$T$5,\"TT.MM.JJJJ\"),\"\")","v":""},{"$f":"IF(B22<>\"\",IF(TNL!CJ27<>\"\",TNL!CJ27,\"\"),\"\")","v":""},{"$f":"IF(B22<>\"\",IF(TNL!DW27<>\"\",TNL!DW27,\"\"),\"\")","v":""},{"$f":"IF(B22<>\"\",IF(TNL!AP55<>\"\",TNL!AP55,\"\"),\"\")","v":""},"Dieser Nachweis ist unbegrenzt gültig!"," /  / 019 / ","","Reg.-Nr.:  /  / 019 / ",{"$f":"CONCATENATE(D22,\" – \",TEXT(E22,\"TT.MM.JJJJ\"),\" | \",Doku!$Y$26)","v":" –  | "},{"$f":"CONCATENATE(D22,\" – \",TEXT(E22,\"TT.MM.JJJJ\"),\" | \",Doku!$Y$26)","v":" –  | "},{"$f":"IF(A22<>\"\",IF(TNL!$A$1<>4,TNL!CX55,\"\"),\"\")","v":""},{"$f":"IF(A22<>\"\",IF(TNL!$A$1<>4,TNL!ED55,\"\"),\"\")","v":""},{"$f":"IF(A22<>\"\",IF(TNL!$A$1<>4,TNL!EX55,\"\"),\"\")","v":""},null,{"$f":"IF(Start!$P$18<>\"\",Start!$P$18,\"\")","v":""}," / ",{"$f":"IF(Start!$I$9<>0,VLOOKUP(Start!$I$9,Data_LD!$A$4:$W$23,3,FALSE),\"\")","v":""}," / ",{"$f":"IF(TNL!$FP$37<>0,AF22,\"\")","v":19}," / ",{"$f":"IF(Doku!$CC$34<>\"\",TEXT(Doku!$CC$34,\"JJ\"),\"\")","v":""},null,18,{"$f":"IF(TNL!$FP$37<>\"\",TNL!$FP$37+AE22,0)","v":19}]
[{"$f":"IF(B23<>\"\",20,\"\")","v":""},{"$f":"IF(TNL!J28<>\"\",TNL!J28,\"\")","v":""},{"$f":"IF(B23<>\"\",TNL!AP28,\"\")","v":""},"",{"$f":"IF(B23<>\"\",TEXT(TNL!BU28,\"TT.MM.JJJJ\"),\"\")","v":""},"",{"$f":"IF(A23<>\"\",CONCATENATE(TNL!$AY$5,\", \"),\"\")","v":""},{"$f":"IF(A23<>\"\",TEXT(TNL!$C$5,\"TT.MM.JJJJ\"),\"\")","v":""},{"$f":"IF(A23<>\"\",TEXT(TNL!$T$5,\"TT.MM.JJJJ\"),\"\")","v":""},{"$f":"IF(B23<>\"\",IF(TNL!CJ28<>\"\",TNL!CJ28,\"\"),\"\")","v":""},{"$f":"IF(B23<>\"\",IF(TNL!DW28<>\"\",TNL!DW28,\"\"),\"\")","v":""},{"$f":"IF(B23<>\"\",IF(TNL!AP56<>\"\",TNL!AP56,\"\"),\"\")","v":""},"Dieser Nachweis ist unbegrenzt gültig!"," /  / 020 / ","","Reg.-Nr.:  /  / 020 / ",{"$f":"CONCATENATE(D23,\" – \",TEXT(E23,\"TT.MM.JJJJ\"),\" | \",Doku!$Y$26)","v":" –  | "},{"$f":"CONCATENATE(D23,\" – \",TEXT(E23,\"TT.MM.JJJJ\"),\" | \",Doku!$Y$26)","v":" –  | "},{"$f":"IF(A23<>\"\",IF(TNL!$A$1<>4,TNL!CX56,\"\"),\"\")","v":""},{"$f":"IF(A23<>\"\",IF(TNL!$A$1<>4,TNL!ED56,\"\"),\"\")","v":""},{"$f":"IF(A23<>\"\",IF(TNL!$A$1<>4,TNL!EX56,\"\"),\"\")","v":""},null,{"$f":"IF(Start!$P$18<>\"\",Start!$P$18,\"\")","v":""}," / ",{"$f":"IF(Start!$I$9<>0,VLOOKUP(Start!$I$9,Data_LD!$A$4:$W$23,3,FALSE),\"\")","v":""}," / ",{"$f":"IF(TNL!$FP$37<>0,AF23,\"\")","v":20}," / ",{"$f":"IF(Doku!$CC$34<>\"\",TEXT(Doku!$CC$34,\"JJ\"),\"\")","v":""},null,19,{"$f":"IF(TNL!$FP$37<>\"\",TNL!$FP$37+AE23,0)","v":20}]
[]
["Nr.","Teilnehmer","Unfallversicherungsträger"]
[{"$f":"IF(B4<>\"\",1,\"\")","v":""},{"$f":"IF(A26<>\"\",CONCATENATE(B4,\", \",C4),\"\")","v":""},{"$f":"IF(A26<>\"\",U4,\"\")","v":""}]
[{"$f":"IF(B5<>\"\",2,\"\")","v":""},{"$f":"IF(A27<>\"\",CONCATENATE(B5,\", \",C5),\"\")","v":""},{"$f":"IF(A27<>\"\",U5,\"\")","v":""},null,null,null,null,null,null,null,null,null,{"$f":"IF(B4<>\"\",CONCATENATE(\"Dieser Nachweis ist gültig bis \",TEXT(O4,\"TT.MM.JJJJ\")),\"Dieser Nachweis ist unbegrenzt gültig!\")","v":"Dieser Nachweis ist unbegrenzt gültig!"}]
[{"$f":"IF(B6<>\"\",3,\"\")","v":""},"",""]
[{"$f":"IF(B7<>\"\",4,\"\")","v":""},"",""]
[{"$f":"IF(B8<>\"\",5,\"\")","v":""},"",""]
[{"$f":"IF(B9<>\"\",6,\"\")","v":""},"",""]
[{"$f":"IF(B10<>\"\",7,\"\")","v":""},"",""]
[{"$f":"IF(B11<>\"\",8,\"\")","v":""},"",""]
[{"$f":"IF(B12<>\"\",9,\"\")","v":""},"",""]
[{"$f":"IF(B13<>\"\",10,\"\")","v":""},"",""]
[{"$f":"IF(B14<>\"\",11,\"\")","v":""},"",""]
[{"$f":"IF(B15<>\"\",12,\"\")","v":""},"",""]
[{"$f":"IF(B16<>\"\",13,\"\")","v":""},"",""]
[{"$f":"IF(B17<>\"\",14,\"\")","v":""},"",""]
[{"$f":"IF(B18<>\"\",15,\"\")","v":""},"",""]
[{"$f":"IF(B19<>\"\",16,\"\")","v":""},"",""]
[{"$f":"IF(B20<>\"\",17,\"\")","v":""},"",""]
[{"$f":"IF(B21<>\"\",18,\"\")","v":""},"",""]
[{"$f":"IF(B22<>\"\",19,\"\")","v":""},"",""]
[{"$f":"IF(B23<>\"\",20,\"\")","v":""},"",""]

{"sheet":"Data_TNB","index":16,"n_rows":24,"n_cols":50,"rows_kept":24,"cut":false,"hidden":true,"merged":[]}
["TNB_Data"]
[1,2,3,4,5,6,7,8,9,10,11,12,13,14,15,16,17,18,19,20,21,22,23,24,25,26,27,28,29,30,31,32,33,34,35,36,37,38,19,40,41,42,43,44,45,46,47,48,49,50]
["Nr.","Nr. V","Orga","Form","Lehrgangsart","PO-Nr.","Titel","Subtitel","Text 1","Text 2","Ausbildende Stelle","Ermächtigte Stelle","Lehrgangs-Nummer","Lehrgangsort","Lehrkraft | Ausbilder","Stempel | Unterschrift"]
[1,{"$f":"IF(Start!$I$9=A4,A4,0)","v":0},"DGUV","Teilnahmebescheinigung","Ausbildung",312,"Erste-Hilfe-Ausbildung","für betriebliche Ersthelfende | EH-Schulung gemäß § 19 FeV","hat an dem 9 Lerneinheiten (à 45 Min.) umfassenden Lehrgang in der Zeit","Die Ausbildung entspricht den Gemeinsamen Grundsätzen der Bundesarbeitsgemeinschaft Erste Hilfe (BAGEH), sowie dem DGUV Grundsatz 304-001. Die Teilnahme an dieser Ausbildung gilt auch als Schulung in Erster Hilfe gemäß § 19 der Fahrerlaubnis-Verordnung (FeV).",{"$f":"IF(D4<>\"\",CONCATENATE(Start!$K$14,\" • \",Start!$K$16,\" • \",Start!$K$18,\" \",Start!$K$20,\" – \",TEXT(Start!$P$18,\"00 00 000\")),\"\")","v":" •  •   – 00 00 000"},{"$f":"CONCATENATE(\"Kennziffer der ermächtigten Stelle gemäß § 26 DGUV Vorschrift 1 – \",Start!$N$25)","v":"Kennziffer der ermächtigten Stelle gemäß § 26 DGUV Vorschrift 1 – "},{"$f":"CONCATENATE(\"Die \",E4,\" wurde unter der QSEH-Registriernummer \",Doku!$Y$26,\" erfasst.\")","v":"Die Ausbildung wurde unter der QSEH-Registriernummer  erfasst."},{"$f":"CONCATENATE(E4,\"sort\")","v":"Ausbildungsort"},"Vorname und Nachname der Lehrkraft","Stempel | Unterschrift Lehrkraft",null,null,null,null,null,null,null,{"$f":"IF(V4=\"Ausbildung\",W4,\"\")","v":""}]
[2,{"$f":"IF(Start!$I$9=A5,A5,0)","v":0},"DGUV","Teilnahmebescheinigung","Schulung",315,"Erste-Hilfe-Schulung","in Bildungs- und Betreuungseinrichtungen für Kinder","hat an dem 9 Lerneinheiten (à 45 Min.) umfassenden Lehrgang in der Zeit","Die Schulung entspricht dem DGUV Grundsatz 304-001. Sie ist eine spezielle Schulung für Lehr- und Betreuungspersonal, um auf Notfälle, die in Schulen und Betreuungseinrichtungen auftreten können, vorbereitet zu sein.",{"$f":"IF(D5<>\"\",CONCATENATE(Start!$K$14,\" • \",Start!$K$16,\" • \",Start!$K$18,\" \",Start!$K$20,\" – \",TEXT(Start!$P$18,\"00 00 000\")),\"\")","v":" •  •   – 00 00 000"},{"$f":"CONCATENATE(\"Kennziffer der ermächtigten Stelle gemäß § 26 DGUV Vorschrift 1 – \",Start!$N$25)","v":"Kennziffer der ermächtigten Stelle gemäß § 26 DGUV Vorschrift 1 – "},{"$f":"CONCATENATE(\"Die \",E5,\" wurde unter der QSEH-Registriernummer \",Doku!$Y$26,\" erfasst.\")","v":"Die Schulung wurde unter der QSEH-Registriernummer  erfasst."},{"$f":"CONCATENATE(E5,\"sort\")","v":"Schulungsort"},"Vorname und Nachname der Lehrkraft","Stempel | Unterschrift Lehrkraft"]
[3,{"$f":"IF(Start!$I$9=A6,A6,0)","v":0},"DGUV","Teilnahmebescheinigung","Fortbildung",321,"Erste-Hilfe-Fortbildung","für betriebliche Ersthelfende","hat an dem 9 Lerneinheiten (à 45 Min.) umfassenden Lehrgang in der Zeit","Die Fortbildung entspricht den Gemeinsamen Grundsätzen der Bundesarbeitsgemeinschaft Erste Hilfe (BAGEH), sowie dem DGUV Grundsatz 304-001.",{"$f":"IF(D6<>\"\",CONCATENATE(Start!$K$14,\" • \",Start!$K$16,\" • \",Start!$K$18,\" \",Start!$K$20,\" – \",TEXT(Start!$P$18,\"00 00 000\")),\"\")","v":" •  •   – 00 00 000"},{"$f":"CONCATENATE(\"Kennziffer der ermächtigten Stelle gemäß § 26 DGUV Vorschrift 1 – \",Start!$N$25)","v":"Kennziffer der ermächtigten Stelle gemäß § 26 DGUV Vorschrift 1 – "},{"$f":"CONCATENATE(\"Die \",E6,\" wurde unter der QSEH-Registriernummer \",Doku!$Y$26,\" erfasst.\")","v":"Die Fortbildung wurde unter der QSEH-Registriernummer  erfasst."},"Fortbildungsort","Vorname und Nachname der Lehrkraft","Stempel | Unterschrift Lehrkraft"]
[4,{"$f":"IF(Start!$I$9=A7,A7,0)","v":0}]
[5,{"$f":"IF(Start!$I$9=A8,A8,0)","v":0},"FeV","Teilnahmebescheinigung","Schulung",312,"Erste-Hilfe-Schulung","gemäß § 19 Fahrerlaubnis-Verordnung (FeV)","hat an dem 9 Lerneinheiten (à 45 Min.) umfassenden Lehrgang in der Zeit","Dieser Lehrgang entspricht der Schulung in Erster Hilfe gemäß dem § 19 der Fahrerlaubnis-Verordnung (FeV), sowie den Gemeinsamen Grundsätzen der Bundesarbeitsgemeinschaft Erste Hilfe (BAGEH) und dem DGUV Grundsatz 304-001.",{"$f":"IF(D8<>\"\",CONCATENATE(Start!$K$14,\" • \",Start!$K$16,\" • \",Start!$K$18,\" \",Start!$K$20,\" – \",TEXT(Start!$P$18,\"00 00 000\")),\"\")","v":" •  •   – 00 00 000"},{"$f":"CONCATENATE(\"Anerkannte Stelle gemäß § 68 FeV\",\" – \",Start!$J$28,\" | \",Start!$L$28,\" | \",TEXT(Start!$N$28,\"TT.MM.JJJJ\"))","v":"Anerkannte Stelle gemäß § 68 FeV –  |  | 00.01.1900"},{"$f":"CONCATENATE(\"Die \",E8,\" wurde unter der DLRG-Lehrgangsnummer \",Doku!$Y$26,\" erfasst.\")","v":"Die Schulung wurde unter der DLRG-Lehrgangsnummer  erfasst."},{"$f":"CONCATENATE(E8,\"sort\")","v":"Schulungsort"},"Vorname und Nachname des Ausbilders","Stempel | Unterschrift Ausbilder"]
[6,{"$f":"IF(Start!$I$9=A9,A9,0)","v":0}]
[7,{"$f":"IF(Start!$I$9=A10,A10,0)","v":0},"DLRG","Teilnahmebescheinigung","Ausbildung",312,"Erste-Hilfe-Ausbildung","gemäß den Gemeinsamen Grundsätzen der BAGEH","hat an dem 9 Lerneinheiten (à 45 Min.) umfassenden Lehrgang in der Zeit","Die Ausbildung entspricht den Gemeinsamen Grundsätzen der Bundesarbeitsgemeinschaft Erste Hilfe (BAGEH), sowie den Vorgaben (Inhalt und Durchführung) dem DGUV Grundsatz 304-001 und dem § 19 der Fahrerlaubnis-Verordnung (FeV).",{"$f":"IF(D10<>\"\",CONCATENATE(Start!$K$14,\" • \",Start!$K$16,\" • \",Start!$K$18,\" \",Start!$K$20,\" – \",TEXT(Start!$P$18,\"00 00 000\")),\"\")","v":" •  •   – 00 00 000"},"Aus- und Fortbildungen gemäß der aktuellen Ausbildungs- und Prüfungsordnung Medizin",{"$f":"CONCATENATE(\"Die \",E10,\" wurde unter der DLRG-Lehrgangsnummer \",Doku!$Y$26,\" erfasst.\")","v":"Die Ausbildung wurde unter der DLRG-Lehrgangsnummer  erfasst."},{"$f":"CONCATENATE(E10,\"sort\")","v":"Ausbildungsort"},"Vorname und Nachname des Ausbilders","Stempel | Unterschrift Ausbilder"]
[8,{"$f":"IF(Start!$I$9=A11,A11,0)","v":0},"DLRG","Teilnahmebescheinigung","Fortbildung",321,"Erste-Hilfe-Fortbildung","gemäß den Gemeinsamen Grundsätzen der BAGEH","hat an dem 9 Lerneinheiten (à 45 Min.) umfassenden Lehrgang in der Zeit","Die Fortbildung entspricht den Gemeinsamen Grundsätzen der Bundesarbeitsgemeinschaft Erste Hilfe (BAGEH), sowie den Vorgaben (Inhalt und Durchführung) dem DGUV Grundsatz 304-001.",{"$f":"IF(D11<>\"\",CONCATENATE(Start!$K$14,\" • \",Start!$K$16,\" • \",Start!$K$18,\" \",Start!$K$20,\" – \",TEXT(Start!$P$18,\"00 00 000\")),\"\")","v":" •  •   – 00 00 000"},"Aus- und Fortbildungen gemäß der aktuellen Ausbildungs- und Prüfungsordnung Medizin",{"$f":"CONCATENATE(\"Die \",E11,\" wurde unter der DLRG-Lehrgangsnummer \",Doku!$Y$26,\" erfasst.\")","v":"Die Fortbildung wurde unter der DLRG-Lehrgangsnummer  erfasst."},{"$f":"CONCATENATE(E11,\"sort\")","v":"Fortbildungsort"},"Vorname und Nachname des Ausbilders","Stempel | Unterschrift Ausbilder"]
[9,{"$f":"IF(Start!$I$9=A12,A12,0)","v":0},"DLRG","Teilnahmebescheinigung","Ausbildung",313,"Erste Hilfe bei Kindernotfällen","Erste Hilfe leisten bei akuten Gefahren, Krankheiten und Notfällen","hat an dem 9 Lerneinheiten (à 45 Min.) umfassenden Lehrgang in der Zeit","Die Ausbildungsinhalte entsprechen dem aktuellen wissenschaftlichen Stand der Kinder- und Jugendmedizin in Deutschalnd sowie der German Resuscitation Council (GRC) und wurden von pädagogisch und fachlich geeigneten Lehrkräften erteilt.",{"$f":"IF(D12<>\"\",CONCATENATE(Start!$K$14,\" • \",Start!$K$16,\" • \",Start!$K$18,\" \",Start!$K$20,\" – \",TEXT(Start!$P$18,\"00 00 000\")),\"\")","v":" •  •   – 00 00 000"},"Aus- und Fortbildungen gemäß der aktuellen Ausbildungs- und Prüfungsordnung Medizin",{"$f":"CONCATENATE(\"Die \",E12,\" wurde unter der DLRG-Lehrgangsnummer \",Doku!$Y$26,\" erfasst.\")","v":"Die Ausbildung wurde unter der DLRG-Lehrgangsnummer  erfasst."},{"$f":"CONCATENATE(E12,\"sort\")","v":"Ausbildungsort"},"Vorname und Nachname des Ausbilders","Stempel | Unterschrift Ausbilder"]
[10,{"$f":"IF(Start!$I$9=A13,A13,0)","v":0},"DLRG","Teilnahmebescheinigung","Fortbildung",322,"Erste-Hilfe-Fortbildung","Auffrischung der Kenntnisse Erste Hilfe bei Kindernotfällen","hat an dem 9 Lerneinheiten (à 45 Min.) umfassenden Lehrgang in der Zeit","Die Fortbildung dient der Reaktivierung und Vertiefung bereits erworbener Kenntnisse und Fertigkeiten aus einer vorherigen Ausbildung, sowie der Vermittlung aktueller Inhalte in der Ersten Hilfe bei Kindernotfällen.",{"$f":"IF(D13<>\"\",CONCATENATE(Start!$K$14,\" • \",Start!$K$16,\" • \",Start!$K$18,\" \",Start!$K$20,\" – \",TEXT(Start!$P$18,\"00 00 000\")),\"\")","v":" •  •   – 00 00 000"},"Aus- und Fortbildungen gemäß der aktuellen Ausbildungs- und Prüfungsordnung Medizin",{"$f":"CONCATENATE(\"Die \",E13,\" wurde unter der DLRG-Lehrgangsnummer \",Doku!$Y$26,\" erfasst.\")","v":"Die Fortbildung wurde unter der DLRG-Lehrgangsnummer  erfasst."},{"$f":"CONCATENATE(E13,\"sort\")","v":"Fortbildungsort"},"Vorname und Nachname des Ausbilders","Stempel | Unterschrift Ausbilder"]
[11,{"$f":"IF(Start!$I$9=A14,A14,0)","v":0},null,null,null,null,null,null,null,null,{"$f":"IF(D14<>\"\",CONCATENATE(Start!$K$14,\" • \",Start!$K$16,\" • \",Start!$K$18,\" \",Start!$K$20,\" – \",TEXT(R14,\"00 00 000\")),\"\")","v":""},{"$f":"IF(D14<>\"\",Start!$N$25,\"\")","v":""},{"$f":"IF(D14<>\"\",CONCATENATE(\"Kennziffer der ermächtigten Stelle gemäß § 26 DGUV Vorschrift = \",L14),\"\")","v":""},{"$f":"IF(D14<>\"\",Start!$J$28,\"\")","v":""},{"$f":"IF(D14<>\"\",Start!$L$28,\"\")","v":""},{"$f":"IF(D14<>\"\",TEXT(Start!$N$28,\"TT.MM.JJJJ\"),\"\")","v":""},{"$f":"IF(D14<>\"\",CONCATENATE(\"Anerkannte Stelle gemäß § 68 FeV\",\" – \",#REF!,\" | \",#REF!,\" | \",#REF!),\"\")","v":""},{"$f":"IF(D14<>\"\",TEXT(Start!$P$18,\"00 00 000\"),\"\")","v":""},{"$f":"IF(D14<>\"\",CONCATENATE(Start!$K$14,\" – Leitung Medizin – \",TEXT(R14,\"00 00 000\")),\"\")","v":""},{"$f":"IF(D14>=0,IF(Start!$N$25<>0,M14,IF(Start!$J$28<>\"\",Q14,IF(Start!$N$25&Start!$J$28<>0,S14,\"\"))))","v":""},{"$f":"IF(D14<>\"\",Doku!$Y$26,\"\")","v":""},{"$f":"IF(D14<>\"\",CONCATENATE(\"Die \",E14,\" wurde unter der Lehrgangsnummer \",U14,\" registriert.\"),\"\")","v":""},{"$f":"IF(D14<>\"\",IF(E14=\"Ausbildung\",\"Ausbildungsort\",IF(E14=\"Fortbildung\",\"Fortbildungsort\",\"\")),\"\")","v":""}]
[12,{"$f":"IF(Start!$I$9=A15,A15,0)","v":0},null,null,null,null,null,null,null,null,{"$f":"IF(D15<>\"\",CONCATENATE(Start!$K$14,\" • \",Start!$K$16,\" • \",Start!$K$18,\" \",Start!$K$20,\" – \",TEXT(R15,\"00 00 000\")),\"\")","v":""},{"$f":"IF(D15<>\"\",Start!$N$25,\"\")","v":""},"",{"$f":"IF(D15<>\"\",Start!$J$28,\"\")","v":""},{"$f":"IF(D15<>\"\",Start!$L$28,\"\")","v":""},{"$f":"IF(D15<>\"\",TEXT(Start!$N$28,\"TT.MM.JJJJ\"),\"\")","v":""},{"$f":"IF(D15<>\"\",CONCATENATE(\"Anerkannte Stelle gemäß § 68 FeV\",\" – \",#REF!,\" | \",#REF!,\" | \",#REF!),\"\")","v":""},{"$f":"IF(D15<>\"\",TEXT(Start!$P$18,\"00 00 000\"),\"\")","v":""},{"$f":"IF(D15<>\"\",CONCATENATE(Start!$K$14,\" – Leitung Medizin – \",TEXT(R15,\"00 00 000\")),\"\")","v":""},{"$f":"IF(D15>=0,IF(Start!$N$25<>0,M15,IF(Start!$J$28<>\"\",Q15,IF(Start!$N$25&Start!$J$28<>0,S15,\"\"))))","v":""},{"$f":"IF(D15<>\"\",Doku!$Y$26,\"\")","v":""},"",""]
[13,{"$f":"IF(Start!$I$9=A16,A16,0)","v":0},null,null,null,null,null,null,null,null,{"$f":"IF(D16<>\"\",CONCATENATE(Start!$K$14,\" • \",Start!$K$16,\" • \",Start!$K$18,\" \",Start!$K$20,\" – \",TEXT(R16,\"00 00 000\")),\"\")","v":""},{"$f":"IF(D16<>\"\",Start!$N$25,\"\")","v":""},"",{"$f":"IF(D16<>\"\",Start!$J$28,\"\")","v":""},{"$f":"IF(D16<>\"\",Start!$L$28,\"\")","v":""},{"$f":"IF(D16<>\"\",TEXT(Start!$N$28,\"TT.MM.JJJJ\"),\"\")","v":""},{"$f":"IF(D16<>\"\",CONCATENATE(\"Anerkannte Stelle gemäß § 68 FeV\",\" – \",#REF!,\" | \",#REF!,\" | \",#REF!),\"\")","v":""},{"$f":"IF(D16<>\"\",TEXT(Start!$P$18,\"00 00 000\"),\"\")","v":""},{"$f":"IF(D16<>\"\",CONCATENATE(Start!$K$14,\" – Leitung Medizin – \",TEXT(R16,\"00 00 000\")),\"\")","v":""},{"$f":"IF(D16>=0,IF(Start!$N$25<>0,M16,IF(Start!$J$28<>\"\",Q16,IF(Start!$N$25&Start!$J$28<>0,S16,\"\"))))","v":""},{"$f":"IF(D16<>\"\",Doku!$Y$26,\"\")","v":""},"",""]
[14,{"$f":"IF(Start!$I$9=A17,A17,0)","v":0},null,null,null,null,null,null,null,null,{"$f":"IF(D17<>\"\",CONCATENATE(Start!$K$14,\" • \",Start!$K$16,\" • \",Start!$K$18,\" \",Start!$K$20,\" – \",TEXT(R17,\"00 00 000\")),\"\")","v":""},{"$f":"IF(D17<>\"\",Start!$N$25,\"\")","v":""},"",{"$f":"IF(D17<>\"\",Start!$J$28,\"\")","v":""},{"$f":"IF(D17<>\"\",Start!$L$28,\"\")","v":""},{"$f":"IF(D17<>\"\",TEXT(Start!$N$28,\"TT.MM.JJJJ\"),\"\")","v":""},{"$f":"IF(D17<>\"\",CONCATENATE(\"Anerkannte Stelle gemäß § 68 FeV\",\" – \",#REF!,\" | \",#REF!,\" | \",#REF!),\"\")","v":""},{"$f":"IF(D17<>\"\",TEXT(Start!$P$18,\"00 00 000\"),\"\")","v":""},{"$f":"IF(D17<>\"\",CONCATENATE(Start!$K$14,\" – Leitung Medizin – \",TEXT(R17,\"00 00 000\")),\"\")","v":""},{"$f":"IF(D17>=0,IF(Start!$N$25<>0,M17,IF(Start!$J$28<>\"\",Q17,IF(Start!$N$25&Start!$J$28<>0,S17,\"\"))))","v":""},{"$f":"IF(D17<>\"\",Doku!$Y$26,\"\")","v":""},"",""]
[15,{"$f":"IF(Start!$I$9=A18,A18,0)","v":0},null,null,null,null,null,null,null,null,{"$f":"IF(D18<>\"\",CONCATENATE(Start!$K$14,\" • \",Start!$K$16,\" • \",Start!$K$18,\" \",Start!$K$20,\" – \",TEXT(R18,\"00 00 000\")),\"\")","v":""},{"$f":"IF(D18<>\"\",Start!$N$25,\"\")","v":""},"",{"$f":"IF(D18<>\"\",Start!$J$28,\"\")","v":""},{"$f":"IF(D18<>\"\",Start!$L$28,\"\")","v":""},{"$f":"IF(D18<>\"\",TEXT(Start!$N$28,\"TT.MM.JJJJ\"),\"\")","v":""},{"$f":"IF(D18<>\"\",CONCATENATE(\"Anerkannte Stelle gemäß § 68 FeV\",\" – \",#REF!,\" | \",#REF!,\" | \",#REF!),\"\")","v":""},{"$f":"IF(D18<>\"\",TEXT(Start!$P$18,\"00 00 000\"),\"\")","v":""},{"$f":"IF(D18<>\"\",CONCATENATE(Start!$K$14,\" – Leitung Medizin – \",TEXT(R18,\"00 00 000\")),\"\")","v":""},{"$f":"IF(D18>=0,IF(Start!$N$25<>0,M18,IF(Start!$J$28<>\"\",Q18,IF(Start!$N$25&Start!$J$28<>0,S18,\"\"))))","v":""},{"$f":"IF(D18<>\"\",Doku!$Y$26,\"\")","v":""},"",""]
[16,{"$f":"IF(Start!$I$9=A19,A19,0)","v":0},null,null,null,null,null,null,null,null,{"$f":"IF(D19<>\"\",CONCATENATE(Start!$K$14,\" • \",Start!$K$16,\" • \",Start!$K$18,\" \",Start!$K$20,\" – \",TEXT(R19,\"00 00 000\")),\"\")","v":""},{"$f":"IF(D19<>\"\",Start!$N$25,\"\")","v":""},"",{"$f":"IF(D19<>\"\",Start!$J$28,\"\")","v":""},{"$f":"IF(D19<>\"\",Start!$L$28,\"\")","v":""},{"$f":"IF(D19<>\"\",TEXT(Start!$N$28,\"TT.MM.JJJJ\"),\"\")","v":""},{"$f":"IF(D19<>\"\",CONCATENATE(\"Anerkannte Stelle gemäß § 68 FeV\",\" – \",#REF!,\" | \",#REF!,\" | \",#REF!),\"\")","v":""},{"$f":"IF(D19<>\"\",TEXT(Start!$P$18,\"00 00 000\"),\"\")","v":""},{"$f":"IF(D19<>\"\",CONCATENATE(Start!$K$14,\" – Leitung Medizin – \",TEXT(R19,\"00 00 000\")),\"\")","v":""},{"$f":"IF(D19>=0,IF(Start!$N$25<>0,M19,IF(Start!$J$28<>\"\",Q19,IF(Start!$N$25&Start!$J$28<>0,S19,\"\"))))","v":""},{"$f":"IF(D19<>\"\",Doku!$Y$26,\"\")","v":""},"",""]
[17,{"$f":"IF(Start!$I$9=A20,A20,0)","v":0},null,null,null,null,null,null,null,null,{"$f":"IF(D20<>\"\",CONCATENATE(Start!$K$14,\" • \",Start!$K$16,\" • \",Start!$K$18,\" \",Start!$K$20,\" – \",TEXT(R20,\"00 00 000\")),\"\")","v":""},{"$f":"IF(D20<>\"\",Start!$N$25,\"\")","v":""},"",{"$f":"IF(D20<>\"\",Start!$J$28,\"\")","v":""},{"$f":"IF(D20<>\"\",Start!$L$28,\"\")","v":""},{"$f":"IF(D20<>\"\",TEXT(Start!$N$28,\"TT.MM.JJJJ\"),\"\")","v":""},{"$f":"IF(D20<>\"\",CONCATENATE(\"Anerkannte Stelle gemäß § 68 FeV\",\" – \",#REF!,\" | \",#REF!,\" | \",#REF!),\"\")","v":""},{"$f":"IF(D20<>\"\",TEXT(Start!$P$18,\"00 00 000\"),\"\")","v":""},{"$f":"IF(D20<>\"\",CONCATENATE(Start!$K$14,\" – Leitung Medizin – \",TEXT(R20,\"00 00 000\")),\"\")","v":""},{"$f":"IF(D20>=0,IF(Start!$N$25<>0,M20,IF(Start!$J$28<>\"\",Q20,IF(Start!$N$25&Start!$J$28<>0,S20,\"\"))))","v":""},{"$f":"IF(D20<>\"\",Doku!$Y$26,\"\")","v":""},"",""]
[18,{"$f":"IF(Start!$I$9=A21,A21,0)","v":0},null,null,null,null,null,null,null,null,{"$f":"IF(D21<>\"\",CONCATENATE(Start!$K$14,\" • \",Start!$K$16,\" • \",Start!$K$18,\" \",Start!$K$20,\" – \",TEXT(R21,\"00 00 000\")),\"\")","v":""},{"$f":"IF(D21<>\"\",Start!$N$25,\"\")","v":""},"",{"$f":"IF(D21<>\"\",Start!$J$28,\"\")","v":""},{"$f":"IF(D21<>\"\",Start!$L$28,\"\")","v":""},{"$f":"IF(D21<>\"\",TEXT(Start!$N$28,\"TT.MM.JJJJ\"),\"\")","v":""},{"$f":"IF(D21<>\"\",CONCATENATE(\"Anerkannte Stelle gemäß § 68 FeV\",\" – \",#REF!,\" | \",#REF!,\" | \",#REF!),\"\")","v":""},{"$f":"IF(D21<>\"\",TEXT(Start!$P$18,\"00 00 000\"),\"\")","v":""},{"$f":"IF(D21<>\"\",CONCATENATE(Start!$K$14,\" – Leitung Medizin – \",TEXT(R21,\"00 00 000\")),\"\")","v":""},{"$f":"IF(D21>=0,IF(Start!$N$25<>0,M21,IF(Start!$J$28<>\"\",Q21,IF(Start!$N$25&Start!$J$28<>0,S21,\"\"))))","v":""},{"$f":"IF(D21<>\"\",Doku!$Y$26,\"\")","v":""},"",""]
[19,{"$f":"IF(Start!$I$9=A22,A22,0)","v":0},null,null,null,null,null,null,null,null,{"$f":"IF(D22<>\"\",CONCATENATE(Start!$K$14,\" • \",Start!$K$16,\" • \",Start!$K$18,\" \",Start!$K$20,\" – \",TEXT(R22,\"00 00 000\")),\"\")","v":""},{"$f":"IF(D22<>\"\",Start!$N$25,\"\")","v":""},"",{"$f":"IF(D22<>\"\",Start!$J$28,\"\")","v":""},{"$f":"IF(D22<>\"\",Start!$L$28,\"\")","v":""},{"$f":"IF(D22<>\"\",TEXT(Start!$N$28,\"TT.MM.JJJJ\"),\"\")","v":""},{"$f":"IF(D22<>\"\",CONCATENATE(\"Anerkannte Stelle gemäß § 68 FeV\",\" – \",#REF!,\" | \",#REF!,\" | \",#REF!),\"\")","v":""},{"$f":"IF(D22<>\"\",TEXT(Start!$P$18,\"00 00 000\"),\"\")","v":""},{"$f":"IF(D22<>\"\",CONCATENATE(Start!$K$14,\" – Leitung Medizin – \",TEXT(R22,\"00 00 000\")),\"\")","v":""},{"$f":"IF(D22>=0,IF(Start!$N$25<>0,M22,IF(Start!$J$28<>\"\",Q22,IF(Start!$N$25&Start!$J$28<>0,S22,\"\"))))","v":""},{"$f":"IF(D22<>\"\",Doku!$Y$26,\"\")","v":""},"",""]
[20,{"$f":"IF(Start!$I$9=A23,A23,0)","v":0},null,null,null,null,null,null,null,null,{"$f":"IF(D23<>\"\",CONCATENATE(Start!$K$14,\" • \",Start!$K$16,\" • \",Start!$K$18,\" \",Start!$K$20,\" – \",TEXT(R23,\"00 00 000\")),\"\")","v":""},{"$f":"IF(D23<>\"\",Start!$N$25,\"\")","v":""},"",{"$f":"IF(D23<>\"\",Start!$J$28,\"\")","v":""},{"$f":"IF(D23<>\"\",Start!$L$28,\"\")","v":""},{"$f":"IF(D23<>\"\",TEXT(Start!$N$28,\"TT.MM.JJJJ\"),\"\")","v":""},{"$f":"IF(D23<>\"\",CONCATENATE(\"Anerkannte Stelle gemäß § 68 FeV\",\" – \",#REF!,\" | \",#REF!,\" | \",#REF!),\"\")","v":""},{"$f":"IF(D23<>\"\",TEXT(Start!$P$18,\"00 00 000\"),\"\")","v":""},{"$f":"IF(D23<>\"\",CONCATENATE(Start!$K$14,\" – Leitung Medizin – \",TEXT(R23,\"00 00 000\")),\"\")","v":""},{"$f":"IF(D23>=0,IF(Start!$N$25<>0,M23,IF(Start!$J$28<>\"\",Q23,IF(Start!$N$25&Start!$J$28<>0,S23,\"\"))))","v":""},{"$f":"IF(D23<>\"\",Doku!$Y$26,\"\")","v":""},"",""]
[null,{"$f":"SUM(B4:B23)","v":0}]

{"sheet":"Data_UR","index":17,"n_rows":115,"n_cols":45,"rows_kept":115,"cut":false,"hidden":true,"merged":[]}
["Vorderseite – Abn, Fbn, Urkunde"]
[1,2,3,4,5,6,7,8,9,10,11,12,13,14,15,16,17,18,19,20,21,22,23,24,25,26,27,28,29,30,31,32,33,34,35,36,37,38,39,40,41,42,43,44,45]
["Nr.","Nr. V","Form","Bezeichnung","Bezeichnung 2","Urkunde_1 | Gültigkeit","Urkunde_2 | Gültigkeit","Zeile 1","Zeile 2","Zeile 3","Zeile 4","Zeile 5","Zeile 6","Ort","vom","bis","Ausbilder | Lehrbeauftragter","Unterschrift","Aussfertigungsstelle","Stempel | Unterschrift","Rückseite","Registiert unter","Adresse","Kennziffer QSEH","Ermächtigte Stelle","FEV Behörde","FEV Aktenzeichen","FEV vom","FEV anerkannte Stelle","Stelle?","DLRG-intern"]
[1,{"$f":"IF(Data_LD!B4<>0,Data_LD!B4,0)","v":0},{"$f":"IF(UR_Data!$B2<>\"\",UR_Data!$B2,\"\")","v":"Teilnahmebescheinigung"},{"$f":"IF(UR_Data!$B4<>\"\",UR_Data!$B4,\"\")","v":"Erste Hilfe-Ausbildung"},{"$f":"IF(UR_Data!$B5<>\"\",UR_Data!$B5,\"\")","v":"für betriebliche Ersthelfende | EH-Schulung gemäß § 19 FeV"}," ",null,{"$f":"IF(UR_Data!$B$18<>\"\",UR_Data!$B$18,\"\")","v":""},{"$f":"IF(UR_Data!$B$19<>\"\",UR_Data!$B$19,\"\")","v":""},{"$f":"IF(UR_Data!$B$20<>\"\",UR_Data!$B$20,\"\")","v":""},{"$f":"IF(UR_Data!$B$21<>\"\",UR_Data!$B$21,\"\")","v":""},{"$f":"IF(UR_Data!$B$22<>\"\",UR_Data!$B$22,\"\")","v":""},{"$f":"IF(UR_Data!$B$23<>\"\",UR_Data!$B$23,\"\")","v":""},{"$f":"IF(UR_Data!$B$26<>\"\",UR_Data!$B$26,\"\")","v":"Ausbildungsort"},{"$f":"IF(UR_Data!$Q$26<>\"\",UR_Data!$Q$26,\"\")","v":"vom"},{"$f":"IF(UR_Data!$V$26<>\"\",UR_Data!$V$26,\"\")","v":"bis"},{"$f":"IF(UR_Data!$B$30<>\"\",UR_Data!$B$30,\"\")","v":"Name und Nr. des Lehrbeauftragten"},{"$f":"IF(UR_Data!$O$30<>\"\",UR_Data!$O$30,\"\")","v":"Unterschrift des Lehrbeauftragten"},{"$f":"IF(UR_Data!$B$34<>\"\",UR_Data!$B$34,\"\")","v":"Ausfertigungsstelle"},{"$f":"IF(UR_Data!$Q$34<>\"\",UR_Data!$Q$34,\"\")","v":"Stempel | Unterschrift"},{"$f":"IF(UR_Data!$B$36<>\"\",UR_Data!$B$36,\"\")","v":"Nur gültig mit aufgedruckter Rückseite!"},{"$f":"IF(UR_Data!$B$37<>\"\",UR_Data!$B$37,\"\")","v":"Die Ausbildung wurde unter der Lehrgangsnummer  registriert."},{"$f":"IF(UR_Data!$B$38<>\"\",UR_Data!$B$38,\"\")","v":" •  •  "},{"$f":"IF(B4<>0,Start!$N$25,\"\")","v":""},{"$f":"IF(B4<>0,CONCATENATE(\"Kennziffer der ermächtigten Stelle gemäß § 26 DGUV Vorschrift = \",X4),\"\")","v":""},{"$f":"Start!$J$28","v":0},{"$f":"Start!$L$28","v":0},{"$f":"TEXT(Start!$N$28,\"TT.MM.JJJJ\")","v":"00.01.1900"},{"$f":"CONCATENATE(\"Anerkannte Stelle gemäß § 68 FeV\",\" – \",Z4,\" | \",AA4,\" | \",AB4)","v":"Anerkannte Stelle gemäß § 68 FeV – 0 | 0 | 00.01.1900"},{"$f":"IF(B4>=0,IF(Start!$N$25<>0,Data_UR!$Y4,IF(Start!$J$28<>\"\",$AC$4,IF(Start!$N$25&Start!$J$28<>0,Data_UR!$AE$4,\"\"))))","v":"Aus- oder Fortbildung für Einsatzkräfte im Wasserrettungsdienst und Kathastrophenschutz."},"Aus- oder Fortbildung für Einsatzkräfte im Wasserrettungsdienst und Kathastrophenschutz."," "]
[2,{"$f":"IF(Data_LD!B5<>0,Data_LD!B5,0)","v":0},{"$f":"IF(UR_Data!$AB$2<>\"\",UR_Data!$AB$2,\"\")","v":"Teilnahmebescheinigung"},{"$f":"IF(UR_Data!$AB$4<>\"\",UR_Data!$AB$4,\"\")","v":"Erste Hilfe-Schulung"},{"$f":"IF(UR_Data!$AB$5<>\"\",UR_Data!$AB$5,\"\")","v":"in Bildungs- und Betreuungseinrichtungen für Kinder"}," ",null,{"$f":"IF(UR_Data!$AB$18<>\"\",UR_Data!$AB$18,\"\")","v":""},{"$f":"IF(UR_Data!$AB$19<>\"\",UR_Data!$AB$19,\"\")","v":""},{"$f":"IF(UR_Data!$AB$20<>\"\",UR_Data!$AB$20,\"\")","v":""},{"$f":"IF(UR_Data!$AB$21<>\"\",UR_Data!$AB$21,\"\")","v":""},{"$f":"IF(UR_Data!$AB$22<>\"\",UR_Data!$AB$22,\"\")","v":""},{"$f":"IF(UR_Data!$AB$23<>\"\",UR_Data!$AB$23,\"\")","v":""},{"$f":"IF(UR_Data!$AB$26<>\"\",UR_Data!$AB$26,\"\")","v":"Ausbildungsort"},{"$f":"IF(UR_Data!$AQ$26<>\"\",UR_Data!$AQ$26,\"\")","v":"vom"},{"$f":"IF(UR_Data!$AV$26<>\"\",UR_Data!$AV$26,\"\")","v":"bis"},{"$f":"IF(UR_Data!$AB$30<>\"\",UR_Data!$AB$30,\"\")","v":"Name und Nr. des Lehrbeauftragten"},{"$f":"IF(UR_Data!$AO$30<>\"\",UR_Data!$AO$30,\"\")","v":"Unterschrift des Lehrbeauftragten"},{"$f":"IF(UR_Data!$AB$34<>\"\",UR_Data!$AB$34,\"\")","v":"Ausfertigungsstelle"},{"$f":"IF(UR_Data!$AQ$34<>\"\",UR_Data!$AQ$34,\"\")","v":"Stempel | Unterschrift"},{"$f":"IF(UR_Data!$AB$36<>\"\",UR_Data!$AB$36,\"\")","v":"Nur gültig mit aufgedruckter Rückseite!"},{"$f":"IF(UR_Data!$AB$37<>\"\",UR_Data!$AB$37,\"\")","v":"Die Ausbildung wurde unter der Lehrgangsnummer  registriert."},{"$f":"IF(UR_Data!$AB$38<>\"\",UR_Data!$AB$38,\"\")","v":" •  •  "},{"$f":"IF(B5<>0,Start!$N$25,\"\")","v":""},{"$f":"IF(B5<>0,CONCATENATE(X5,\" – \",W5),\"\")","v":""},{"$f":"Start!$J$28","v":0},{"$f":"Start!$L$28","v":0},{"$f":"TEXT(Start!$N$28,\"TT.MM.JJJJ\")","v":"00.01.1900"},{"$f":"CONCATENATE(\"Anerkannte Stelle gemäß § 68 FeV\",\" – \",Z5,\" | \",AA5,\" | \",AB5)","v":"Anerkannte Stelle gemäß § 68 FeV – 0 | 0 | 00.01.1900"},{"$f":"IF(B5>=0,IF(Start!$N$25<>0,Data_UR!$Y5,IF(Start!$J$28<>\"\",$AC$4,IF(Start!$N$25&Start!$J$28<>0,Data_UR!$AE$4,\"\"))))","v":"Aus- oder Fortbildung für Einsatzkräfte im Wasserrettungsdienst und Kathastrophenschutz."},"Aus- oder Fortbildung für Einsatzkräfte im Wasserrettungsdienst und Kathastrophenschutz."," "]
[3,{"$f":"IF(Data_LD!B6<>0,Data_LD!B6,0)","v":0},{"$f":"IF(UR_Data!$BB$2<>\"\",UR_Data!$BB$2,\"\")","v":"Teilnahmebescheinigung"},{"$f":"IF(UR_Data!$BB$4<>\"\",UR_Data!$BB$4,\"\")","v":"Erste Hilfe-Fortbildung"},{"$f":"IF(UR_Data!$BB$5<>\"\",UR_Data!$BB$5,\"\")","v":"für betriebliche Ersthelfende"}," ",null,{"$f":"IF(UR_Data!$BB$18<>\"\",UR_Data!$BB$18,\"\")","v":""},{"$f":"IF(UR_Data!$BB$19<>\"\",UR_Data!$BB$19,\"\")","v":""},{"$f":"IF(UR_Data!$BB$20<>\"\",UR_Data!$BB$20,\"\")","v":""},{"$f":"IF(UR_Data!$BB$21<>\"\",UR_Data!$BB$21,\"\")","v":""},{"$f":"IF(UR_Data!$BB$22<>\"\",UR_Data!$BB$22,\"\")","v":""},{"$f":"IF(UR_Data!$BB$23<>\"\",UR_Data!$BB$23,\"\")","v":""},{"$f":"IF(UR_Data!$BB$26<>\"\",UR_Data!$BB$26,\"\")","v":"Ausbildungsort"},{"$f":"IF(UR_Data!$BQ$26<>\"\",UR_Data!$BQ$26,\"\")","v":"vom"},{"$f":"IF(UR_Data!$BV$26<>\"\",UR_Data!$BV$26,\"\")","v":"bis"},{"$f":"IF(UR_Data!$BB$30<>\"\",UR_Data!$BB$30,\"\")","v":"Name und Nr. des Lehrbeauftragten"},{"$f":"IF(UR_Data!$BO$30<>\"\",UR_Data!$BO$30,\"\")","v":"Unterschrift des Lehrbeauftragten"},{"$f":"IF(UR_Data!$BB$34<>\"\",UR_Data!$BB$34,\"\")","v":"Ausfertigungsstelle"},{"$f":"IF(UR_Data!$BQ$34<>\"\",UR_Data!$BQ$34,\"\")","v":"Stempel | Unterschrift"},{"$f":"IF(UR_Data!$BB$36<>\"\",UR_Data!$BB$36,\"\")","v":"Nur gültig mit aufgedruckter Rückseite!"},{"$f":"IF(UR_Data!$BB$37<>\"\",UR_Data!$BB$37,\"\")","v":"Die Ausbildung wurde unter der Lehrgangsnummer  registriert."},{"$f":"IF(UR_Data!$BB$38<>\"\",UR_Data!$BB$38,\"\")","v":" •  •  "},{"$f":"IF(B6<>0,Start!$N$25,\"\")","v":""},"",{"$f":"Start!$J$28","v":0},{"$f":"Start!$L$28","v":0},{"$f":"TEXT(Start!$N$28,\"TT.MM.JJJJ\")","v":"00.01.1900"},"Anerkannte Stelle gemäß § 68 FeV – 0 | 0 | 00.01.1900",{"$f":"IF(B6>=0,IF(Start!$N$25<>0,Data_UR!$Y6,IF(Start!$J$28<>\"\",$AC$4,IF(Start!$N$25&Start!$J$28<>0,Data_UR!$AE$4,\"\"))))","v":"Aus- oder Fortbildung für Einsatzkräfte im Wasserrettungsdienst und Kathastrophenschutz."},"Aus- oder Fortbildung für Einsatzkräfte im Wasserrettungsdienst und Kathastrophenschutz."," "]
[4,{"$f":"IF(Data_LD!B7<>0,Data_LD!B7,0)","v":0},{"$f":"IF(UR_Data!$CB$2<>\"\",UR_Data!$CB$2,\"\")","v":""},{"$f":"IF(UR_Data!$CB$4<>\"\",UR_Data!$CB$4,\"\")","v":""},{"$f":"IF(UR_Data!$CB$5<>\"\",UR_Data!$CB$5,\"\")","v":""}," ",null,{"$f":"IF(UR_Data!$CB$18<>\"\",UR_Data!$CB$18,\"\")","v":""},{"$f":"IF(UR_Data!$CB$19<>\"\",UR_Data!$CB$19,\"\")","v":""},{"$f":"IF(UR_Data!$CB$20<>\"\",UR_Data!$CB$20,\"\")","v":""},{"$f":"IF(UR_Data!$CB$21<>\"\",UR_Data!$CB$21,\"\")","v":""},{"$f":"IF(UR_Data!$CB$22<>\"\",UR_Data!$CB$22,\"\")","v":""},{"$f":"IF(UR_Data!$CB$23<>\"\",UR_Data!$CB$23,\"\")","v":""},{"$f":"IF(UR_Data!$CB$26<>\"\",UR_Data!$CB$26,\"\")","v":"Ausbildungsort"},{"$f":"IF(UR_Data!$CQ$26<>\"\",UR_Data!$CQ$26,\"\")","v":"vom"},{"$f":"IF(UR_Data!$CV$26<>\"\",UR_Data!$CV$26,\"\")","v":"bis"},{"$f":"IF(UR_Data!$CB$30<>\"\",UR_Data!$CB$30,\"\")","v":"Name und Nr. des Lehrbeauftragten"},{"$f":"IF(UR_Data!$CO$30<>\"\",UR_Data!$CO$30,\"\")","v":"Unterschrift des Lehrbeauftragten"},{"$f":"IF(UR_Data!$CB$34<>\"\",UR_Data!$CB$34,\"\")","v":"Ausfertigungsstelle"},{"$f":"IF(UR_Data!$CQ$34<>\"\",UR_Data!$CQ$34,\"\")","v":"Stempel | Unterschrift"},{"$f":"IF(UR_Data!$CB$36<>\"\",UR_Data!$CB$36,\"\")","v":"Nur gültig mit aufgedruckter Rückseite!"},{"$f":"IF(UR_Data!$CB$37<>\"\",UR_Data!$CB$37,\"\")","v":"Die Ausbildung wurde unter der Lehrgangsnummer  registriert."},{"$f":"IF(UR_Data!$CB$38<>\"\",UR_Data!$CB$38,\"\")","v":" •  •  "},{"$f":"IF(B7<>0,Start!$N$25,\"\")","v":""},"",{"$f":"Start!$J$28","v":0},{"$f":"Start!$L$28","v":0},{"$f":"TEXT(Start!$N$28,\"TT.MM.JJJJ\")","v":"00.01.1900"},"Anerkannte Stelle gemäß § 68 FeV – 0 | 0 | 00.01.1900",{"$f":"IF(B7>=0,IF(Start!$N$25<>0,Data_UR!$Y7,IF(Start!$J$28<>\"\",$AC$4,IF(Start!$N$25&Start!$J$28<>0,Data_UR!$AE$4,\"\"))))","v":"Aus- oder Fortbildung für Einsatzkräfte im Wasserrettungsdienst und Kathastrophenschutz."},"Aus- oder Fortbildung für Einsatzkräfte im Wasserrettungsdienst und Kathastrophenschutz."," "]
[5,{"$f":"IF(Data_LD!B8<>0,Data_LD!B8,0)","v":0},{"$f":"IF(UR_Data!$DB$2<>\"\",UR_Data!$DB$2,\"\")","v":"Teilnahmebescheinigung"},{"$f":"IF(UR_Data!$DB$4<>\"\",UR_Data!$DB$4,\"\")","v":"Erste Hilfe-Schulung"},{"$f":"IF(UR_Data!$DB$5<>\"\",UR_Data!$DB$5,\"\")","v":"gemäß § 19 Fahrerlaubnis-Verordnung (FeV)"}," ",null,{"$f":"IF(UR_Data!$DB$18<>\"\",UR_Data!$DB$18,\"\")","v":""},{"$f":"IF(UR_Data!$DB$19<>\"\",UR_Data!$DB$19,\"\")","v":""},{"$f":"IF(UR_Data!$DB$20<>\"\",UR_Data!$DB$20,\"\")","v":""},{"$f":"IF(UR_Data!$DB$21<>\"\",UR_Data!$DB$21,\"\")","v":""},{"$f":"IF(UR_Data!$DB$22<>\"\",UR_Data!$DB$22,\"\")","v":""},{"$f":"IF(UR_Data!$DB$23<>\"\",UR_Data!$DB$23,\"\")","v":""},{"$f":"IF(UR_Data!$DB$26<>\"\",UR_Data!$DB$26,\"\")","v":"Ausbildungsort"},{"$f":"IF(UR_Data!$DQ$26<>\"\",UR_Data!$DQ$26,\"\")","v":"vom"},{"$f":"IF(UR_Data!$DV$26<>\"\",UR_Data!$DV$26,\"\")","v":"bis"},{"$f":"IF(UR_Data!$DB$30<>\"\",UR_Data!$DB$30,\"\")","v":"Name und Nr. des Lehrbeauftragten"},{"$f":"IF(UR_Data!$DO$30<>\"\",UR_Data!$DO$30,\"\")","v":"Unterschrift des Lehrbeauftragten"},{"$f":"IF(UR_Data!$DB$34<>\"\",UR_Data!$DB$34,\"\")","v":"Ausfertigungsstelle"},{"$f":"IF(UR_Data!$DQ$34<>\"\",UR_Data!$DQ$34,\"\")","v":"Stempel | Unterschrift"},{"$f":"IF(UR_Data!$DB$36<>\"\",UR_Data!$DB$36,\"\")","v":""},{"$f":"IF(UR_Data!$DB$37<>\"\",UR_Data!$DB$37,\"\")","v":""},{"$f":"IF(UR_Data!$DB$38<>\"\",UR_Data!$DB$38,\"\")","v":""},{"$f":"IF(B8<>0,Start!$N$25,\"\")","v":""},"",{"$f":"Start!$J$28","v":0},{"$f":"Start!$L$28","v":0},{"$f":"TEXT(Start!$N$28,\"TT.MM.JJJJ\")","v":"00.01.1900"},"Anerkannte Stelle gemäß § 68 FeV – 0 | 0 | 00.01.1900",{"$f":"IF(B8>=0,IF(Start!$N$25<>0,Data_UR!$Y8,IF(Start!$J$28<>\"\",$AC$4,IF(Start!$N$25&Start!$J$28<>0,Data_UR!$AE$4,\"\"))))","v":"Aus- oder Fortbildung für Einsatzkräfte im Wasserrettungsdienst und Kathastrophenschutz."},"Aus- oder Fortbildung für Einsatzkräfte im Wasserrettungsdienst und Kathastrophenschutz."," "]
[6,{"$f":"IF(Data_LD!B9<>0,Data_LD!B9,0)","v":0},{"$f":"IF(UR_Data!$EB$2<>\"\",UR_Data!$EB$2,\"\")","v":""},{"$f":"IF(UR_Data!$EB$4<>\"\",UR_Data!$EB$4,\"\")","v":""},{"$f":"IF(UR_Data!$EB$5<>\"\",UR_Data!$EB$5,\"\")","v":""}," ",null,{"$f":"IF(UR_Data!$EB$18<>\"\",UR_Data!$EB$18,\"\")","v":""},{"$f":"IF(UR_Data!$EB$19<>\"\",UR_Data!$EB$19,\"\")","v":""},{"$f":"IF(UR_Data!$EB$20<>\"\",UR_Data!$EB$20,\"\")","v":""},{"$f":"IF(UR_Data!$EB$21<>\"\",UR_Data!$EB$21,\"\")","v":""},{"$f":"IF(UR_Data!$EB$22<>\"\",UR_Data!$EB$22,\"\")","v":""},{"$f":"IF(UR_Data!$EB$23<>\"\",UR_Data!$EB$23,\"\")","v":""},{"$f":"IF(UR_Data!$EB$26<>\"\",UR_Data!$EB$26,\"\")","v":"Ausbildungsort"},{"$f":"IF(UR_Data!$EQ$26<>\"\",UR_Data!$EQ$26,\"\")","v":"vom"},{"$f":"IF(UR_Data!$EV$26<>\"\",UR_Data!$EV$26,\"\")","v":"bis"},{"$f":"IF(UR_Data!$EB$30<>\"\",UR_Data!$EB$30,\"\")","v":"Name und Nr. des Ausbilders"},{"$f":"IF(UR_Data!$EO$30<>\"\",UR_Data!$EO$30,\"\")","v":"Unterschrift des Ausbilders"},{"$f":"IF(UR_Data!$EB$34<>\"\",UR_Data!$EB$34,\"\")","v":"Ausfertigungsstelle"},{"$f":"IF(UR_Data!$EQ$34<>\"\",UR_Data!$EQ$34,\"\")","v":"Stempel | Unterschrift"},{"$f":"IF(UR_Data!$EB$36<>\"\",UR_Data!$EB$36,\"\")","v":"Nur gültig mit aufgedruckter Rückseite!"},{"$f":"IF(UR_Data!$EB$37<>\"\",UR_Data!$EB$37,\"\")","v":"Die Ausbildung wurde unter der Lehrgangsnummer  registriert."},{"$f":"IF(UR_Data!$EB$38<>\"\",UR_Data!$EB$38,\"\")","v":" •  •  "},{"$f":"IF(B9<>0,Start!$N$25,\"\")","v":""},"",{"$f":"Start!$J$28","v":0},{"$f":"Start!$L$28","v":0},{"$f":"TEXT(Start!$N$28,\"TT.MM.JJJJ\")","v":"00.01.1900"},"Anerkannte Stelle gemäß § 68 FeV – 0 | 0 | 00.01.1900",{"$f":"IF(B9>=0,IF(Start!$N$25<>0,Data_UR!$Y9,IF(Start!$J$28<>\"\",$AC$4,IF(Start!$N$25&Start!$J$28<>0,Data_UR!$AE$4,\"\"))))","v":"Aus- oder Fortbildung für Einsatzkräfte im Wasserrettungsdienst und Kathastrophenschutz."},"Aus- oder Fortbildung für Einsatzkräfte im Wasserrettungsdienst und Kathastrophenschutz."," "]
[7,{"$f":"IF(Data_LD!B10<>0,Data_LD!B10,0)","v":0},{"$f":"IF(UR_Data!$FB$2<>\"\",UR_Data!$FB$2,\"\")","v":"Teilnahmebescheinigung"},{"$f":"IF(UR_Data!$FB$4<>\"\",UR_Data!$FB$4,\"\")","v":"Erste Hilfe-Ausbildung"},{"$f":"IF(UR_Data!$FB$5<>\"\",UR_Data!$FB$5,\"\")","v":"gemäß den Gemeinsamen Grundsätzen der BAGEH"}," ",null,{"$f":"IF(UR_Data!$FB$18<>\"\",UR_Data!$FB$18,\"\")","v":""},{"$f":"IF(UR_Data!$FB$19<>\"\",UR_Data!$FB$19,\"\")","v":""},{"$f":"IF(UR_Data!$FB$20<>\"\",UR_Data!$FB$20,\"\")","v":""},{"$f":"IF(UR_Data!$FB$21<>\"\",UR_Data!$FB$21,\"\")","v":""},{"$f":"IF(UR_Data!$FB$22<>\"\",UR_Data!$FB$22,\"\")","v":""},{"$f":"IF(UR_Data!$FB$23<>\"\",UR_Data!$FB$23,\"\")","v":""},{"$f":"IF(UR_Data!$FB$26<>\"\",UR_Data!$FB$26,\"\")","v":"Ausbildungsort"},{"$f":"IF(UR_Data!$FQ$26<>\"\",UR_Data!$FQ$26,\"\")","v":"vom"},{"$f":"IF(UR_Data!$FV$26<>\"\",UR_Data!$FV$26,\"\")","v":"bis"},{"$f":"IF(UR_Data!$FB$30<>\"\",UR_Data!$FB$30,\"\")","v":"Name und Nr. des Lehrbeauftragten"},{"$f":"IF(UR_Data!$FO$30<>\"\",UR_Data!$FO$30,\"\")","v":"Unterschrift des Lehrbeauftragten"},{"$f":"IF(UR_Data!$FB$34<>\"\",UR_Data!$FB$34,\"\")","v":"Ausfertigungsstelle"},{"$f":"IF(UR_Data!$FQ$34<>\"\",UR_Data!$FQ$34,\"\")","v":"Stempel | Unterschrift"},{"$f":"IF(UR_Data!$FB$36<>\"\",UR_Data!$FB$36,\"\")","v":"Nur gültig mit aufgedruckter Rückseite!"},{"$f":"IF(UR_Data!$FB$37<>\"\",UR_Data!$FB$37,\"\")","v":"Die Ausbildung wurde unter der Lehrgangsnummer  registriert."},{"$f":"IF(UR_Data!$FB$38<>\"\",UR_Data!$FB$38,\"\")","v":" •  •  "},{"$f":"IF(B10<>0,Start!$N$25,\"\")","v":""},"",{"$f":"Start!$J$28","v":0},{"$f":"Start!$L$28","v":0},{"$f":"TEXT(Start!$N$28,\"TT.MM.JJJJ\")","v":"00.01.1900"},"Anerkannte Stelle gemäß § 68 FeV – 0 | 0 | 00.01.1900",{"$f":"IF(B10>=0,IF(Start!$N$25<>0,Data_UR!$Y10,IF(Start!$J$28<>\"\",$AC$4,IF(Start!$N$25&Start!$J$28<>0,Data_UR!$AE$4,\"\"))))","v":"Aus- oder Fortbildung für Einsatzkräfte im Wasserrettungsdienst und Kathastrophenschutz."},"Aus- oder Fortbildung für Einsatzkräfte im Wasserrettungsdienst und Kathastrophenschutz."," "]
[8,{"$f":"IF(Data_LD!B11<>0,Data_LD!B11,0)","v":0},{"$f":"IF(UR_Data!$GB$2<>\"\",UR_Data!$GB$2,\"\")","v":"Teilnahmebescheinigung"},{"$f":"IF(UR_Data!$GB$4<>\"\",UR_Data!$GB$4,\"\")","v":"Erste Hilfe-Fortbildung"},{"$f":"IF(UR_Data!$GB$5<>\"\",UR_Data!$GB$5,\"\")","v":"gemäß den Gemeinsamen Grundsätzen der BAGEH"}," ",null,{"$f":"IF(UR_Data!$GB$18<>\"\",UR_Data!$GB$18,\"\")","v":""},{"$f":"IF(UR_Data!$GB$19<>\"\",UR_Data!$GB$19,\"\")","v":""},{"$f":"IF(UR_Data!$GB$20<>\"\",UR_Data!$GB$20,\"\")","v":""},{"$f":"IF(UR_Data!$GB$21<>\"\",UR_Data!$GB$21,\"\")","v":""},{"$f":"IF(UR_Data!$GB$22<>\"\",UR_Data!$GB$22,\"\")","v":""},{"$f":"IF(UR_Data!$GB$23<>\"\",UR_Data!$GB$23,\"\")","v":""},{"$f":"IF(UR_Data!$GB$26<>\"\",UR_Data!$GB$26,\"\")","v":"Ausbildungsort"},{"$f":"IF(UR_Data!$GQ$26<>\"\",UR_Data!$GQ$26,\"\")","v":"vom"},{"$f":"IF(UR_Data!$GV$26<>\"\",UR_Data!$GV$26,\"\")","v":"bis"},{"$f":"IF(UR_Data!$GB$30<>\"\",UR_Data!$GB$30,\"\")","v":"Name und Nr. des Ausbilders"},{"$f":"IF(UR_Data!$GO$30<>\"\",UR_Data!$GO$30,\"\")","v":"Unterschrift des Ausbilders"},{"$f":"IF(UR_Data!$GB$34<>\"\",UR_Data!$GB$34,\"\")","v":"Ausfertigungsstelle"},{"$f":"IF(UR_Data!$GQ$34<>\"\",UR_Data!$GQ$34,\"\")","v":"Stempel | Unterschrift"},{"$f":"IF(UR_Data!$GB$36<>\"\",UR_Data!$GB$36,\"\")","v":"Nur gültig mit aufgedruckter Rückseite!"},{"$f":"IF(UR_Data!$GB$37<>\"\",UR_Data!$GB$37,\"\")","v":"Die Ausbildung wurde unter der Lehrgangsnummer  registriert."},{"$f":"IF(UR_Data!$GB$38<>\"\",UR_Data!$GB$38,\"\")","v":" •  •  "},{"$f":"IF(B11<>0,Start!$N$25,\"\")","v":""},"",{"$f":"Start!$J$28","v":0},{"$f":"Start!$L$28","v":0},{"$f":"TEXT(Start!$N$28,\"TT.MM.JJJJ\")","v":"00.01.1900"},"Anerkannte Stelle gemäß § 68 FeV – 0 | 0 | 00.01.1900",{"$f":"IF(B11>=0,IF(Start!$N$25<>0,Data_UR!$Y11,IF(Start!$J$28<>\"\",$AC$4,IF(Start!$N$25&Start!$J$28<>0,Data_UR!$AE$4,\"\"))))","v":"Aus- oder Fortbildung für Einsatzkräfte im Wasserrettungsdienst und Kathastrophenschutz."},"Aus- oder Fortbildung für Einsatzkräfte im Wasserrettungsdienst und Kathastrophenschutz."," "]
[9,{"$f":"IF(Data_LD!B12<>0,Data_LD!B12,0)","v":0},{"$f":"IF(UR_Data!$HB$2<>\"\",UR_Data!$HB$2,\"\")","v":"Teilnahmebescheinigung"},{"$f":"IF(UR_Data!$HB$4<>\"\",UR_Data!$HB$4,\"\")","v":"Erste Hilfe bei Kindernotfällen"},{"$f":"IF(UR_Data!$HB$5<>\"\",UR_Data!$HB$5,\"\")","v":"Erste Hilfe leisten bei akuten Gefahren, Krankheiten und Notfällen"}," ",null,{"$f":"IF(UR_Data!$HB$18<>\"\",UR_Data!$HB$18,\"\")","v":""},{"$f":"IF(UR_Data!$HB$19<>\"\",UR_Data!$HB$19,\"\")","v":""},{"$f":"IF(UR_Data!$HB$20<>\"\",UR_Data!$HB$20,\"\")","v":""},{"$f":"IF(UR_Data!$HB$21<>\"\",UR_Data!$HB$21,\"\")","v":""},{"$f":"IF(UR_Data!$HB$22<>\"\",UR_Data!$HB$22,\"\")","v":""},{"$f":"IF(UR_Data!$HB$23<>\"\",UR_Data!$HB$23,\"\")","v":""},{"$f":"IF(UR_Data!$HB$26<>\"\",UR_Data!$HB$26,\"\")","v":"Ausbildungsort"},{"$f":"IF(UR_Data!$HQ$26<>\"\",UR_Data!$HQ$26,\"\")","v":"vom"},{"$f":"IF(UR_Data!$HV$26<>\"\",UR_Data!$HV$26,\"\")","v":"bis"},{"$f":"IF(UR_Data!$HB$30<>\"\",UR_Data!$HB$30,\"\")","v":"Name und Nr. des Ausbilders"},{"$f":"IF(UR_Data!$HO$30<>\"\",UR_Data!$HO$30,\"\")","v":"Unterschrift des Ausbilders"},{"$f":"IF(UR_Data!$HB$34<>\"\",UR_Data!$HB$34,\"\")","v":"Ausfertigungsstelle"},{"$f":"IF(UR_Data!$HQ$34<>\"\",UR_Data!$HQ$34,\"\")","v":"Stempel | Unterschrift"},{"$f":"IF(UR_Data!$HB$36<>\"\",UR_Data!$HB$36,\"\")","v":"Nur gültig mit aufgedruckter Rückseite!"},{"$f":"IF(UR_Data!$HB$37<>\"\",UR_Data!$HB$37,\"\")","v":"Die Ausbildung wurde unter der Lehrgangsnummer  registriert."},{"$f":"IF(UR_Data!$HB$38<>\"\",UR_Data!$HB$38,\"\")","v":" •  •  "},{"$f":"IF(B12<>0,Start!$N$25,\"\")","v":""},"",{"$f":"Start!$J$28","v":0},{"$f":"Start!$L$28","v":0},{"$f":"TEXT(Start!$N$28,\"TT.MM.JJJJ\")","v":"00.01.1900"},"Anerkannte Stelle gemäß § 68 FeV – 0 | 0 | 00.01.1900",{"$f":"IF(B12>=0,IF(Start!$N$25<>0,Data_UR!$Y12,IF(Start!$J$28<>\"\",$AC$4,IF(Start!$N$25&Start!$J$28<>0,Data_UR!$AE$4,\"\"))))","v":"Aus- oder Fortbildung für Einsatzkräfte im Wasserrettungsdienst und Kathastrophenschutz."},"Aus- oder Fortbildung für Einsatzkräfte im Wasserrettungsdienst und Kathastrophenschutz."," "]
[10,{"$f":"IF(Data_LD!B13<>0,Data_LD!B13,0)","v":0},{"$f":"IF(UR_Data!$IB$2<>\"\",UR_Data!$IB$2,\"\")","v":"Teilnahmebescheinigung"},{"$f":"IF(UR_Data!$IB$4<>\"\",UR_Data!$IB$4,\"\")","v":"Erste Hilfe-Fortbildung"},{"$f":"IF(UR_Data!$IB$5<>\"\",UR_Data!$IB$5,\"\")","v":"Auffrischung der Kenntnisse Erste Hilfe bei Kindernotfällen"}," ",null,{"$f":"IF(UR_Data!$IB$18<>\"\",UR_Data!$IB$18,\"\")","v":""},{"$f":"IF(UR_Data!$IB$19<>\"\",UR_Data!$IB$19,\"\")","v":""},{"$f":"IF(UR_Data!$IB$20<>\"\",UR_Data!$IB$20,\"\")","v":""},{"$f":"IF(UR_Data!$IB$21<>\"\",UR_Data!$IB$21,\"\")","v":""},{"$f":"IF(UR_Data!$IB$22<>\"\",UR_Data!$IB$22,\"\")","v":""},{"$f":"IF(UR_Data!$IB$23<>\"\",UR_Data!$IB$23,\"\")","v":""},{"$f":"IF(UR_Data!$IB$26<>\"\",UR_Data!$IB$26,\"\")","v":"Ausbildungsort"},{"$f":"IF(UR_Data!$IQ$26<>\"\",UR_Data!$IQ$26,\"\")","v":"vom"},{"$f":"IF(UR_Data!$IV$26<>\"\",UR_Data!$IV$26,\"\")","v":"bis"},{"$f":"IF(UR_Data!$IB$30<>\"\",UR_Data!$IB$30,\"\")","v":"Name und Nr. des Multiplikators"},{"$f":"IF(UR_Data!$IO$30<>\"\",UR_Data!$IO$30,\"\")","v":"Unterschrift des Multiplikators"},{"$f":"IF(UR_Data!$IB$34<>\"\",UR_Data!$IB$34,\"\")","v":"Ausfertigungsstelle"},{"$f":"IF(UR_Data!$IQ$34<>\"\",UR_Data!$IQ$34,\"\")","v":"Stempel | Unterschrift"},{"$f":"IF(UR_Data!$IB$36<>\"\",UR_Data!$IB$36,\"\")","v":"Nur gültig mit aufgedruckter Rückseite!"},{"$f":"IF(UR_Data!$IB$37<>\"\",UR_Data!$IB$37,\"\")","v":"Die Ausbildung wurde unter der Lehrgangsnummer  registriert."},{"$f":"IF(UR_Data!$IB$38<>\"\",UR_Data!$IB$38,\"\")","v":" •  •  "},{"$f":"IF(B13<>0,Start!$N$25,\"\")","v":""},"",{"$f":"Start!$J$28","v":0},{"$f":"Start!$L$28","v":0},{"$f":"TEXT(Start!$N$28,\"TT.MM.JJJJ\")","v":"00.01.1900"},"Anerkannte Stelle gemäß § 68 FeV – 0 | 0 | 00.01.1900",{"$f":"IF(B13>=0,IF(Start!$N$25<>0,Data_UR!$Y13,IF(Start!$J$28<>\"\",$AC$4,IF(Start!$N$25&Start!$J$28<>0,Data_UR!$AE$4,\"\"))))","v":"Aus- oder Fortbildung für Einsatzkräfte im Wasserrettungsdienst und Kathastrophenschutz."},"Aus- oder Fortbildung für Einsatzkräfte im Wasserrettungsdienst und Kathastrophenschutz."," "]
[11,{"$f":"IF(Data_LD!B14<>0,Data_LD!B14,0)","v":0},{"$f":"IF(UR_Data!$JB$2<>\"\",UR_Data!$JB$2,\"\")","v":""},{"$f":"IF(UR_Data!$JB$4<>\"\",UR_Data!$JB$4,\"\")","v":""},{"$f":"IF(UR_Data!$JB$5<>\"\",UR_Data!$JB$5,\"\")","v":""},null,null,{"$f":"IF(UR_Data!$JB$18<>\"\",UR_Data!$JB$18,\"\")","v":""},{"$f":"IF(UR_Data!$JB$19<>\"\",UR_Data!$JB$19,\"\")","v":""},{"$f":"IF(UR_Data!$JB$20<>\"\",UR_Data!$JB$20,\"\")","v":""},{"$f":"IF(UR_Data!$JB$21<>\"\",UR_Data!$JB$21,\"\")","v":""},{"$f":"IF(UR_Data!$JB$22<>\"\",UR_Data!$JB$22,\"\")","v":""},{"$f":"IF(UR_Data!$JB$23<>\"\",UR_Data!$JB$23,\"\")","v":""},{"$f":"IF(UR_Data!$JB$26<>\"\",UR_Data!$JB$26,\"\")","v":"Ausbildungsort"},{"$f":"IF(UR_Data!$JQ$26<>\"\",UR_Data!$JQ$26,\"\")","v":"vom"},{"$f":"IF(UR_Data!$JV$26<>\"\",UR_Data!$JV$26,\"\")","v":"bis"},{"$f":"IF(UR_Data!$JB$30<>\"\",UR_Data!$JB$30,\"\")","v":"Name und Nr. des Ausbilders"},{"$f":"IF(UR_Data!$JO$30<>\"\",UR_Data!$JO$30,\"\")","v":"Unterschrift des Ausbilders"},{"$f":"IF(UR_Data!$JB$34<>\"\",UR_Data!$JB$34,\"\")","v":"Ausfertigungsstelle"},{"$f":"IF(UR_Data!$JQ$34<>\"\",UR_Data!$JQ$34,\"\")","v":"Stempel | Unterschrift"},{"$f":"IF(UR_Data!$JB$36<>\"\",UR_Data!$JB$36,\"\")","v":"Nur gültig mit aufgedruckter Rückseite!"},{"$f":"IF(UR_Data!$JB$37<>\"\",UR_Data!$JB$37,\"\")","v":"Die Ausbildung wurde unter der Lehrgangsnummer  registriert."},{"$f":"IF(UR_Data!$JB$38<>\"\",UR_Data!$JB$38,\"\")","v":" •  •  "},{"$f":"IF(B14<>0,Start!$N$25,\"\")","v":""},"",{"$f":"Start!$J$28","v":0},{"$f":"Start!$L$28","v":0},{"$f":"TEXT(Start!$N$28,\"TT.MM.JJJJ\")","v":"00.01.1900"},"Anerkannte Stelle gemäß § 68 FeV – 0 | 0 | 00.01.1900",{"$f":"IF(B14>=0,IF(Start!$N$25<>0,Data_UR!$Y14,IF(Start!$J$28<>\"\",$AC$4,IF(Start!$N$25&Start!$J$28<>0,Data_UR!$AE$4,\"\"))))","v":"Aus- oder Fortbildung für Einsatzkräfte im Wasserrettungsdienst und Kathastrophenschutz."},"Aus- oder Fortbildung für Einsatzkräfte im Wasserrettungsdienst und Kathastrophenschutz."," "]
[12,{"$f":"IF(Data_LD!B15<>0,Data_LD!B15,0)","v":0},{"$f":"IF(UR_Data!$KB$2<>\"\",UR_Data!$KB$2,\"\")","v":"Ausbildungsnachweis"},{"$f":"IF(UR_Data!$KB$4<>\"\",UR_Data!$KB$4,\"\")","v":"Sanitätsausbildung A"},{"$f":"IF(UR_Data!$KB$5<>\"\",UR_Data!$KB$5,\"\")","v":""},{"$f":"IF(UR_Data!$KB$7<>\"\",UR_Data!$KB$7,\"\")","v":{"$error":"#N/A"}},null,{"$f":"IF(UR_Data!$KB$18<>\"\",UR_Data!$KB$18,\"\")","v":"hat die Sanitätsausbildung A (Sanitätshelfer)"},{"$f":"IF(UR_Data!$KB$19<>\"\",UR_Data!$KB$19,\"\")","v":"mit mindestens 24 Lerneinheiten"},{"$f":"IF(UR_Data!$KB$20<>\"\",UR_Data!$KB$20,\"\")","v":"erfolgreich abgeschlossen."},{"$f":"IF(UR_Data!$KB$21<>\"\",UR_Data!$KB$21,\"\")","v":"1 Lerneinheit (LE) = 45 Minuten."},{"$f":"IF(UR_Data!$KB$22<>\"\",UR_Data!$KB$22,\"\")","v":""},{"$f":"IF(UR_Data!$KB$23<>\"\",UR_Data!$KB$23,\"\")","v":""},{"$f":"IF(UR_Data!$KB$26<>\"\",UR_Data!$KB$26,\"\")","v":"Ausbildungsort"},{"$f":"IF(UR_Data!$KQ$26<>\"\",UR_Data!$KQ$26,\"\")","v":"vom"},{"$f":"IF(UR_Data!$KV$26<>\"\",UR_Data!$KV$26,\"\")","v":"bis"},{"$f":"IF(UR_Data!$KB$30<>\"\",UR_Data!$KB$30,\"\")","v":"Name und Nr. des Ausbilders"},{"$f":"IF(UR_Data!$KO$30<>\"\",UR_Data!$KO$30,\"\")","v":"Unterschrift des Ausbilders"},{"$f":"IF(UR_Data!$KB$34<>\"\",UR_Data!$KB$34,\"\")","v":"Ausfertigungsstelle"},{"$f":"IF(UR_Data!$KQ$34<>\"\",UR_Data!$KQ$34,\"\")","v":"Stempel | Unterschrift"},{"$f":"IF(UR_Data!$KB$36<>\"\",UR_Data!$KB$36,\"\")","v":"Nur gültig mit aufgedruckter Rückseite!"},{"$f":"IF(UR_Data!$KB$37<>\"\",UR_Data!$KB$37,\"\")","v":"Die Ausbildung wurde unter der Lehrgangsnummer  registriert."},{"$f":"IF(UR_Data!$KB$38<>\"\",UR_Data!$KB$38,\"\")","v":" •  •  "},{"$f":"IF(B15<>0,Start!$N$25,\"\")","v":""},"",{"$f":"Start!$J$28","v":0},{"$f":"Start!$L$28","v":0},{"$f":"TEXT(Start!$N$28,\"TT.MM.JJJJ\")","v":"00.01.1900"},"Anerkannte Stelle gemäß § 68 FeV – 0 | 0 | 00.01.1900",{"$f":"IF(B15>=0,IF(Start!$N$25<>0,Data_UR!$Y15,IF(Start!$J$28<>\"\",$AC$4,IF(Start!$N$25&Start!$J$28<>0,Data_UR!$AE$4,\"\"))))","v":"Aus- oder Fortbildung für Einsatzkräfte im Wasserrettungsdienst und Kathastrophenschutz."},"Aus- oder Fortbildung für Einsatzkräfte im Wasserrettungsdienst und Kathastrophenschutz."," "]
[13,{"$f":"IF(Data_LD!B16<>0,Data_LD!B16,0)","v":0},{"$f":"IF(UR_Data!$LB$2<>\"\",UR_Data!$LB$2,\"\")","v":"Ausbildungsnachweis"},{"$f":"IF(UR_Data!$LB$4<>\"\",UR_Data!$LB$4,\"\")","v":"Sanitätsausbildung B"},{"$f":"IF(UR_Data!$LB$5<>\"\",UR_Data!$LB$5,\"\")","v":""},{"$f":"IF(UR_Data!$LB$7<>\"\",UR_Data!$LB$7,\"\")","v":{"$error":"#N/A"}},null,{"$f":"IF(UR_Data!$LB$18<>\"\",UR_Data!$LB$18,\"\")","v":"hat die Sanitätsausbildung B (Sanitäter)"},{"$f":"IF(UR_Data!$LB$19<>\"\",UR_Data!$LB$19,\"\")","v":"mit mindestens 24 Lerneinheiten"},{"$f":"IF(UR_Data!$LB$20<>\"\",UR_Data!$LB$20,\"\")","v":"erfolgreich abgeschlossen."},{"$f":"IF(UR_Data!$LB$21<>\"\",UR_Data!$LB$21,\"\")","v":"1 Lerneinheit (LE) = 45 Minuten."},{"$f":"IF(UR_Data!$LB$22<>\"\",UR_Data!$LB$22,\"\")","v":""},{"$f":"IF(UR_Data!$LB$23<>\"\",UR_Data!$LB$23,\"\")","v":""},{"$f":"IF(UR_Data!$LB$26<>\"\",UR_Data!$LB$26,\"\")","v":""},{"$f":"IF(UR_Data!$LQ$26<>\"\",UR_Data!$LQ$26,\"\")","v":""},{"$f":"IF(UR_Data!$LV$26<>\"\",UR_Data!$LV$26,\"\")","v":""},{"$f":"IF(UR_Data!$LB$30<>\"\",UR_Data!$LB$30,\"\")","v":""},{"$f":"IF(UR_Data!$LO$30<>\"\",UR_Data!$LO$30,\"\")","v":""},{"$f":"IF(UR_Data!$LB$34<>\"\",UR_Data!$LB$34,\"\")","v":""},{"$f":"IF(UR_Data!$LQ$34<>\"\",UR_Data!$LQ$34,\"\")","v":""},{"$f":"IF(UR_Data!$LB$36<>\"\",UR_Data!$LB$36,\"\")","v":"Nur gültig mit aufgedruckter Rückseite!"},{"$f":"IF(UR_Data!$LB$37<>\"\",UR_Data!$LB$37,\"\")","v":"Die Ausbildung wurde unter der Lehrgangsnummer  registriert."},{"$f":"IF(UR_Data!$LB$38<>\"\",UR_Data!$LB$38,\"\")","v":" •  •  "},{"$f":"IF(B16<>0,Start!$N$25,\"\")","v":""},"",{"$f":"Start!$J$28","v":0},{"$f":"Start!$L$28","v":0},{"$f":"TEXT(Start!$N$28,\"TT.MM.JJJJ\")","v":"00.01.1900"},"Anerkannte Stelle gemäß § 68 FeV – 0 | 0 | 00.01.1900",{"$f":"IF(B16>=0,IF(Start!$N$25<>0,Data_UR!$Y16,IF(Start!$J$28<>\"\",$AC$4,IF(Start!$N$25&Start!$J$28<>0,Data_UR!$AE$4,\"\"))))","v":"Aus- oder Fortbildung für Einsatzkräfte im Wasserrettungsdienst und Kathastrophenschutz."},"Aus- oder Fortbildung für Einsatzkräfte im Wasserrettungsdienst und Kathastrophenschutz."," "]
[14,{"$f":"IF(Data_LD!B17<>0,Data_LD!B17,0)","v":0},{"$f":"IF(UR_Data!$MB$2<>\"\",UR_Data!$MB$2,\"\")","v":""},{"$f":"IF(UR_Data!$MB$4<>\"\",UR_Data!$MB$4,\"\")","v":""},{"$f":"IF(UR_Data!$MB$5<>\"\",UR_Data!$MB$5,\"\")","v":""},null,null,{"$f":"IF(UR_Data!$MB$18<>\"\",UR_Data!$MB$18,\"\")","v":""},{"$f":"IF(UR_Data!$MB$19<>\"\",UR_Data!$MB$19,\"\")","v":""},{"$f":"IF(UR_Data!$MB$20<>\"\",UR_Data!$MB$20,\"\")","v":""},{"$f":"IF(UR_Data!$MB$21<>\"\",UR_Data!$MB$21,\"\")","v":""},{"$f":"IF(UR_Data!$MB$22<>\"\",UR_Data!$MB$22,\"\")","v":""},{"$f":"IF(UR_Data!$MB$23<>\"\",UR_Data!$MB$23,\"\")","v":""},{"$f":"IF(UR_Data!$MB$26<>\"\",UR_Data!$MB$26,\"\")","v":"Ausbildungsort"},{"$f":"IF(UR_Data!$MQ$26<>\"\",UR_Data!$MQ$26,\"\")","v":"vom"},{"$f":"IF(UR_Data!$MV$26<>\"\",UR_Data!$MV$26,\"\")","v":"bis"},{"$f":"IF(UR_Data!$MB$30<>\"\",UR_Data!$MB$30,\"\")","v":"Name und Nr. des Ausbilders"},{"$f":"IF(UR_Data!$MO$30<>\"\",UR_Data!$MO$30,\"\")","v":"Unterschrift des Ausbilders"},{"$f":"IF(UR_Data!$MB$34<>\"\",UR_Data!$MB$34,\"\")","v":"Ausfertigungsstelle"},{"$f":"IF(UR_Data!$MQ$34<>\"\",UR_Data!$MQ$34,\"\")","v":"Stempel | Unterschrift"},{"$f":"IF(UR_Data!$MB$36<>\"\",UR_Data!$MB$36,\"\")","v":"Nur gültig mit aufgedruckter Rückseite!"},{"$f":"IF(UR_Data!$MB$37<>\"\",UR_Data!$MB$37,\"\")","v":"Die Ausbildung wurde unter der Lehrgangsnummer  registriert."},{"$f":"IF(UR_Data!$MB$38<>\"\",UR_Data!$MB$38,\"\")","v":" •  •  "},{"$f":"IF(B17<>0,Start!$N$25,\"\")","v":""},"",{"$f":"Start!$J$28","v":0},{"$f":"Start!$L$28","v":0},{"$f":"TEXT(Start!$N$28,\"TT.MM.JJJJ\")","v":"00.01.1900"},"Anerkannte Stelle gemäß § 68 FeV – 0 | 0 | 00.01.1900",{"$f":"IF(B17>=0,IF(Start!$N$25<>0,Data_UR!$Y17,IF(Start!$J$28<>\"\",$AC$4,IF(Start!$N$25&Start!$J$28<>0,Data_UR!$AE$4,\"\"))))","v":"Aus- oder Fortbildung für Einsatzkräfte im Wasserrettungsdienst und Kathastrophenschutz."},"Aus- oder Fortbildung für Einsatzkräfte im Wasserrettungsdienst und Kathastrophenschutz."," "]
[15,{"$f":"IF(Data_LD!B18<>0,Data_LD!B18,0)","v":0},{"$f":"IF(UR_Data!$NB$2<>\"\",UR_Data!$NB$2,\"\")","v":"Ausbildungsnachweis"},{"$f":"IF(UR_Data!$NB$4<>\"\",UR_Data!$NB$4,\"\")","v":"RUND-Grundkurs"},{"$f":"IF(UR_Data!$NB$5<>\"\",UR_Data!$NB$5,\"\")","v":"(Realistische Unfall- und Notfall-Darstellung)"},{"$f":"IF(UR_Data!$NB$7<>\"\",UR_Data!$NB$7,\"\")","v":{"$error":"#N/A"}},null,{"$f":"IF(UR_Data!$NB$18<>\"\",UR_Data!$NB$18,\"\")","v":"hat den RUND-Grundkurs mit"},{"$f":"IF(UR_Data!$NB$19<>\"\",UR_Data!$NB$19,\"\")","v":"mindestens 16 Lerneinheiten"},{"$f":"IF(UR_Data!$NB$20<>\"\",UR_Data!$NB$20,\"\")","v":"erfolgreich abgeschlossen."},{"$f":"IF(UR_Data!$NB$21<>\"\",UR_Data!$NB$21,\"\")","v":"1 Lerneinheit (LE) = 45 Minuten."},{"$f":"IF(UR_Data!$NB$22<>\"\",UR_Data!$NB$22,\"\")","v":""},{"$f":"IF(UR_Data!$NB$23<>\"\",UR_Data!$NB$23,\"\")","v":""},{"$f":"IF(UR_Data!$NB$26<>\"\",UR_Data!$NB$26,\"\")","v":"Ausbildungsort"},{"$f":"IF(UR_Data!$NQ$26<>\"\",UR_Data!$NQ$26,\"\")","v":"vom"},{"$f":"IF(UR_Data!$NV$26<>\"\",UR_Data!$NV$26,\"\")","v":"bis"},{"$f":"IF(UR_Data!$NB$30<>\"\",UR_Data!$NB$30,\"\")","v":"Name und Nr. des Ausbilders"},{"$f":"IF(UR_Data!$NO$30<>\"\",UR_Data!$NO$30,\"\")","v":"Unterschrift des Ausbilders"},{"$f":"IF(UR_Data!$NB$34<>\"\",UR_Data!$NB$34,\"\")","v":"Ausfertigungsstelle"},{"$f":"IF(UR_Data!$NQ$34<>\"\",UR_Data!$NQ$34,\"\")","v":"Stempel | Unterschrift"},{"$f":"IF(UR_Data!$NB$36<>\"\",UR_Data!$NB$36,\"\")","v":"Nur gültig mit aufgedruckter Rückseite!"},{"$f":"IF(UR_Data!$NB$37<>\"\",UR_Data!$NB$37,\"\")","v":"Die Ausbildung wurde unter der Lehrgangsnummer  registriert."},{"$f":"IF(UR_Data!$NB$38<>\"\",UR_Data!$NB$38,\"\")","v":" •  •  "},{"$f":"IF(B18<>0,Start!$N$25,\"\")","v":""},"",{"$f":"Start!$J$28","v":0},{"$f":"Start!$L$28","v":0},{"$f":"TEXT(Start!$N$28,\"TT.MM.JJJJ\")","v":"00.01.1900"},"Anerkannte Stelle gemäß § 68 FeV – 0 | 0 | 00.01.1900",{"$f":"IF(B18>=0,IF(Start!$N$25<>0,Data_UR!$Y18,IF(Start!$J$28<>\"\",$AC$4,IF(Start!$N$25&Start!$J$28<>0,Data_UR!$AE$4,\"\"))))","v":"Aus- oder Fortbildung für Einsatzkräfte im Wasserrettungsdienst und Kathastrophenschutz."},"Aus- oder Fortbildung für Einsatzkräfte im Wasserrettungsdienst und Kathastrophenschutz."," "]
[16,{"$f":"IF(Data_LD!B19<>0,Data_LD!B19,0)","v":0},{"$f":"IF(UR_Data!$OB$2<>\"\",UR_Data!$OB$2,\"\")","v":"Ausbildungsnachweis"},{"$f":"IF(UR_Data!$OB$4<>\"\",UR_Data!$OB$4,\"\")","v":"RUND-Aufbaukurs"},{"$f":"IF(UR_Data!$OB$5<>\"\",UR_Data!$OB$5,\"\")","v":"(Realistische Unfall- und Notfall-Darstellung)"},{"$f":"IF(UR_Data!$OB$7<>\"\",UR_Data!$OB$7,\"\")","v":{"$error":"#N/A"}},null,{"$f":"IF(UR_Data!$OB$18<>\"\",UR_Data!$OB$18,\"\")","v":"hat den RUND-Aufbaukurs mit"},{"$f":"IF(UR_Data!$OB$19<>\"\",UR_Data!$OB$19,\"\")","v":"mindestens 16 Lerneinheiten"},{"$f":"IF(UR_Data!$OB$20<>\"\",UR_Data!$OB$20,\"\")","v":"erfolgreich abgeschlossen."},{"$f":"IF(UR_Data!$OB$21<>\"\",UR_Data!$OB$21,\"\")","v":"1 Lerneinheit (LE) = 45 Minuten."},{"$f":"IF(UR_Data!$OB$22<>\"\",UR_Data!$OB$22,\"\")","v":""},{"$f":"IF(UR_Data!$OB$23<>\"\",UR_Data!$OB$23,\"\")","v":""},{"$f":"IF(UR_Data!$OB$26<>\"\",UR_Data!$OB$26,\"\")","v":""},{"$f":"IF(UR_Data!$OQ$26<>\"\",UR_Data!$OQ$26,\"\")","v":""},{"$f":"IF(UR_Data!$OV$26<>\"\",UR_Data!$OV$26,\"\")","v":""},{"$f":"IF(UR_Data!$OB$30<>\"\",UR_Data!$OB$30,\"\")","v":""},{"$f":"IF(UR_Data!$OO$30<>\"\",UR_Data!$OO$30,\"\")","v":""},{"$f":"IF(UR_Data!$OB$34<>\"\",UR_Data!$OB$34,\"\")","v":""},{"$f":"IF(UR_Data!$OQ$34<>\"\",UR_Data!$OQ$34,\"\")","v":""},{"$f":"IF(UR_Data!$OB$36<>\"\",UR_Data!$OB$36,\"\")","v":"Nur gültig mit aufgedruckter Rückseite!"},{"$f":"IF(UR_Data!$OB$37<>\"\",UR_Data!$OB$37,\"\")","v":"Die Ausbildung wurde unter der Lehrgangsnummer  registriert."},{"$f":"IF(UR_Data!$OB$38<>\"\",UR_Data!$OB$38,\"\")","v":" •  •  "},{"$f":"IF(B19<>0,Start!$N$25,\"\")","v":""},"",{"$f":"Start!$J$28","v":0},{"$f":"Start!$L$28","v":0},{"$f":"TEXT(Start!$N$28,\"TT.MM.JJJJ\")","v":"00.01.1900"},"Anerkannte Stelle gemäß § 68 FeV – 0 | 0 | 00.01.1900",{"$f":"IF(B19>=0,IF(Start!$N$25<>0,Data_UR!$Y19,IF(Start!$J$28<>\"\",$AC$4,IF(Start!$N$25&Start!$J$28<>0,Data_UR!$AE$4,\"\"))))","v":"Aus- oder Fortbildung für Einsatzkräfte im Wasserrettungsdienst und Kathastrophenschutz."},"Aus- oder Fortbildung für Einsatzkräfte im Wasserrettungsdienst und Kathastrophenschutz."," "]
[17,{"$f":"IF(Data_LD!B20<>0,Data_LD!B20,0)","v":0},{"$f":"IF(UR_Data!$PB$2<>\"\",UR_Data!$PB$2,\"\")","v":""},{"$f":"IF(UR_Data!$PB$4<>\"\",UR_Data!$PB$4,\"\")","v":""},{"$f":"IF(UR_Data!$PB$5<>\"\",UR_Data!$PB$5,\"\")","v":""},null,null,{"$f":"IF(UR_Data!$QB$18<>\"\",UR_Data!$QB$18,\"\")","v":"hat an einer Sanitätsfortbildung für"},{"$f":"IF(UR_Data!$QB$19<>\"\",UR_Data!$QB$19,\"\")","v":"sämtliche Sanitätsausbildungen"},{"$f":"IF(UR_Data!$QB$20<>\"\",UR_Data!$QB$20,\"\")","v":"erfolgreich teilgenommen."},{"$f":"IF(UR_Data!$QB$21<>\"\",UR_Data!$QB$21,\"\")","v":"Diese Fortbildung umfasste 12 Lerneinheiten (LE)."},{"$f":"IF(UR_Data!$QB$22<>\"\",UR_Data!$QB$22,\"\")","v":"Sie  erfolgte gemäß der Ausbildungs- und"},{"$f":"IF(UR_Data!$QB$23<>\"\",UR_Data!$QB$23,\"\")","v":"Prüfungsordnung Medizin der DLRG."},{"$f":"IF(UR_Data!$PB$26<>\"\",UR_Data!$PB$26,\"\")","v":"Fortbildungsort"},{"$f":"IF(UR_Data!$PQ$26<>\"\",UR_Data!$PQ$26,\"\")","v":"vom"},{"$f":"IF(UR_Data!$PV$26<>\"\",UR_Data!$PV$26,\"\")","v":"bis"},{"$f":"IF(UR_Data!$PB$30<>\"\",UR_Data!$PB$30,\"\")","v":"Name und Nr. des Ausbilders"},{"$f":"IF(UR_Data!$PO$30<>\"\",UR_Data!$PO$30,\"\")","v":"Unterschrift des Ausbilders"},{"$f":"IF(UR_Data!$PB$34<>\"\",UR_Data!$PB$34,\"\")","v":"Ausfertigungsstelle"},{"$f":"IF(UR_Data!$PQ$34<>\"\",UR_Data!$PQ$34,\"\")","v":"Stempel | Unterschrift"},{"$f":"IF(UR_Data!$PB$36<>\"\",UR_Data!$PB$36,\"\")","v":"Nur gültig mit aufgedruckter Rückseite!"},{"$f":"IF(UR_Data!$PB$37<>\"\",UR_Data!$PB$37,\"\")","v":"Die Fortbildung wurde unter der Lehrgangsnummer  registriert."},{"$f":"IF(UR_Data!$PB$38<>\"\",UR_Data!$PB$38,\"\")","v":" •  •  "},{"$f":"IF(B20<>0,Start!$N$25,\"\")","v":""},"",{"$f":"Start!$J$28","v":0},{"$f":"Start!$L$28","v":0},{"$f":"TEXT(Start!$N$28,\"TT.MM.JJJJ\")","v":"00.01.1900"},"Anerkannte Stelle gemäß § 68 FeV – 0 | 0 | 00.01.1900",{"$f":"IF(B20>=0,IF(Start!$N$25<>0,Data_UR!$Y20,IF(Start!$J$28<>\"\",$AC$4,IF(Start!$N$25&Start!$J$28<>0,Data_UR!$AE$4,\"\"))))","v":"Aus- oder Fortbildung für Einsatzkräfte im Wasserrettungsdienst und Kathastrophenschutz."},"Aus- oder Fortbildung für Einsatzkräfte im Wasserrettungsdienst und Kathastrophenschutz."," "]
[18,{"$f":"IF(Data_LD!B21<>0,Data_LD!B21,0)","v":0},{"$f":"IF(UR_Data!$QB$2<>\"\",UR_Data!$QB$2,\"\")","v":"Fortbildungsnachweis"},{"$f":"IF(UR_Data!$QB$4<>\"\",UR_Data!$QB$4,\"\")","v":"Sanitätsfortbildung"},{"$f":"IF(UR_Data!$QB$5<>\"\",UR_Data!$QB$5,\"\")","v":""},null,{"$f":"IF(UR_Data!$QB$7<>\"\",UR_Data!$QB$7,\"\")","v":"Der Nachweis ist gültig bis 30.12.1902"},{"$f":"IF(UR_Data!$QB$18<>\"\",UR_Data!$QB$18,\"\")","v":"hat an einer Sanitätsfortbildung für"},{"$f":"IF(UR_Data!$QB$19<>\"\",UR_Data!$QB$19,\"\")","v":"sämtliche Sanitätsausbildungen"},{"$f":"IF(UR_Data!$QB$20<>\"\",UR_Data!$QB$20,\"\")","v":"erfolgreich teilgenommen."},{"$f":"IF(UR_Data!$QB$21<>\"\",UR_Data!$QB$21,\"\")","v":"Diese Fortbildung umfasste 12 Lerneinheiten (LE)."},{"$f":"IF(UR_Data!$QB$22<>\"\",UR_Data!$QB$22,\"\")","v":"Sie  erfolgte gemäß der Ausbildungs- und"},{"$f":"IF(UR_Data!$QB$23<>\"\",UR_Data!$QB$23,\"\")","v":"Prüfungsordnung Medizin der DLRG."},{"$f":"IF(UR_Data!$QB$26<>\"\",UR_Data!$QB$26,\"\")","v":"Fortbildungsort"},{"$f":"IF(UR_Data!$QQ$26<>\"\",UR_Data!$QQ$26,\"\")","v":"vom"},{"$f":"IF(UR_Data!$QV$26<>\"\",UR_Data!$QV$26,\"\")","v":"bis"},{"$f":"IF(UR_Data!$QB$30<>\"\",UR_Data!$QB$30,\"\")","v":"Name und Nr. des Lehrbeauftragten"},{"$f":"IF(UR_Data!$QO$30<>\"\",UR_Data!$QO$30,\"\")","v":"Unterschrift des Lehrbeauftragten"},{"$f":"IF(UR_Data!$QB$34<>\"\",UR_Data!$QB$34,\"\")","v":"Ausfertigungsstelle"},{"$f":"IF(UR_Data!$QQ$34<>\"\",UR_Data!$QQ$34,\"\")","v":"Stempel | Unterschrift"},{"$f":"IF(UR_Data!$QB$36<>\"\",UR_Data!$QB$36,\"\")","v":"Nur gültig mit aufgedruckter Rückseite!"},{"$f":"IF(UR_Data!$QB$37<>\"\",UR_Data!$QB$37,\"\")","v":"Die Fortbildung wurde unter der Lehrgangsnummer  erfasst."},{"$f":"IF(UR_Data!$QB$38<>\"\",UR_Data!$QB$38,\"\")","v":" •  •  "},{"$f":"IF(B21<>0,Start!$N$25,\"\")","v":""},"",{"$f":"Start!$J$28","v":0},{"$f":"Start!$L$28","v":0},{"$f":"TEXT(Start!$N$28,\"TT.MM.JJJJ\")","v":"00.01.1900"},"Anerkannte Stelle gemäß § 68 FeV – 0 | 0 | 00.01.1900",{"$f":"IF(B21>=0,IF(Start!$N$25<>0,Data_UR!$Y21,IF(Start!$J$28<>\"\",$AC$4,IF(Start!$N$25&Start!$J$28<>0,Data_UR!$AE$4,\"\"))))","v":"Aus- oder Fortbildung für Einsatzkräfte im Wasserrettungsdienst und Kathastrophenschutz."},"Aus- oder Fortbildung für Einsatzkräfte im Wasserrettungsdienst und Kathastrophenschutz."," "]
[19,{"$f":"IF(Data_LD!B22<>0,Data_LD!B22,0)","v":0},{"$f":"IF(UR_Data!$RB$2<>\"\",UR_Data!$RB$2,\"\")","v":""},{"$f":"IF(UR_Data!$RB$4<>\"\",UR_Data!$RB$4,\"\")","v":""},{"$f":"IF(UR_Data!$RB$5<>\"\",UR_Data!$RB$5,\"\")","v":""},null,null,{"$f":"IF(UR_Data!$RB$18<>\"\",UR_Data!$RB$18,\"\")","v":""},{"$f":"IF(UR_Data!$RB$19<>\"\",UR_Data!$RB$19,\"\")","v":""},{"$f":"IF(UR_Data!$RB$20<>\"\",UR_Data!$RB$20,\"\")","v":""},{"$f":"IF(UR_Data!$RB$21<>\"\",UR_Data!$RB$21,\"\")","v":""},{"$f":"IF(UR_Data!$RB$22<>\"\",UR_Data!$RB$22,\"\")","v":""},{"$f":"IF(UR_Data!$RB$23<>\"\",UR_Data!$RB$23,\"\")","v":""},{"$f":"IF(UR_Data!$RB$26<>\"\",UR_Data!$RB$26,\"\")","v":"Fortbildungsort"},{"$f":"IF(UR_Data!$RQ$26<>\"\",UR_Data!$RQ$26,\"\")","v":"vom"},{"$f":"IF(UR_Data!$RV$26<>\"\",UR_Data!$RV$26,\"\")","v":"bis"},{"$f":"IF(UR_Data!$RB$30<>\"\",UR_Data!$RB$30,\"\")","v":"Name und Nr. des Lehrbeauftragten"},{"$f":"IF(UR_Data!$RO$30<>\"\",UR_Data!$RO$30,\"\")","v":"Unterschrift des Lehrbeauftragten"},{"$f":"IF(UR_Data!$RB$34<>\"\",UR_Data!$RB$34,\"\")","v":"Ausfertigungsstelle"},{"$f":"IF(UR_Data!$RQ$34<>\"\",UR_Data!$RQ$34,\"\")","v":"Stempel | Unterschrift"},{"$f":"IF(UR_Data!$RB$36<>\"\",UR_Data!$RB$36,\"\")","v":"Nur gültig mit aufgedruckter Rückseite!"},{"$f":"IF(UR_Data!$RB$37<>\"\",UR_Data!$RB$37,\"\")","v":"Die Fortbildung wurde unter der Lehrgangsnummer  registriert."},{"$f":"IF(UR_Data!$RB$38<>\"\",UR_Data!$RB$38,\"\")","v":" •  •  "},{"$f":"IF(B22<>0,Start!$N$25,\"\")","v":""},"",{"$f":"Start!$J$28","v":0},{"$f":"Start!$L$28","v":0},{"$f":"TEXT(Start!$N$28,\"TT.MM.JJJJ\")","v":"00.01.1900"},"Anerkannte Stelle gemäß § 68 FeV – 0 | 0 | 00.01.1900",{"$f":"IF(B22>=0,IF(Start!$N$25<>0,Data_UR!$Y22,IF(Start!$J$28<>\"\",$AC$4,IF(Start!$N$25&Start!$J$28<>0,Data_UR!$AE$4,\"\"))))","v":"Aus- oder Fortbildung für Einsatzkräfte im Wasserrettungsdienst und Kathastrophenschutz."},"Aus- oder Fortbildung für Einsatzkräfte im Wasserrettungsdienst und Kathastrophenschutz."," "]
[20,{"$f":"IF(Data_LD!B23<>0,Data_LD!B23,0)","v":0},{"$f":"IF(UR_Data!$SB$2<>\"\",UR_Data!$RB$2,\"\")","v":""},{"$f":"IF(UR_Data!$SB$4<>\"\",UR_Data!$RB$4,\"\")","v":""},{"$f":"IF(UR_Data!$SB$5<>\"\",UR_Data!$RB$5,\"\")","v":""},null,null,{"$f":"IF(UR_Data!$SB$18<>\"\",UR_Data!$SB$18,\"\")","v":""},{"$f":"IF(UR_Data!$SB$19<>\"\",UR_Data!$SB$19,\"\")","v":""},{"$f":"IF(UR_Data!$SB$20<>\"\",UR_Data!$SB$20,\"\")","v":""},{"$f":"IF(UR_Data!$SB$21<>\"\",UR_Data!$SB$21,\"\")","v":""},{"$f":"IF(UR_Data!$SB$22<>\"\",UR_Data!$SB$22,\"\")","v":""},{"$f":"IF(UR_Data!$SB$23<>\"\",UR_Data!$SB$23,\"\")","v":""},{"$f":"IF(UR_Data!$SB$26<>\"\",UR_Data!$SB$26,\"\")","v":"Fortbildungsort"},{"$f":"IF(UR_Data!$SQ$26<>\"\",UR_Data!$SQ$26,\"\")","v":"vom"},{"$f":"IF(UR_Data!$SV$26<>\"\",UR_Data!$SV$26,\"\")","v":"bis"},{"$f":"IF(UR_Data!$SB$30<>\"\",UR_Data!$SB$30,\"\")","v":"Name und Nr. des Multiplikators"},{"$f":"IF(UR_Data!$SO$30<>\"\",UR_Data!$SO$30,\"\")","v":"Unterschrift des Multiplikators"},{"$f":"IF(UR_Data!$SB$34<>\"\",UR_Data!$SB$34,\"\")","v":"Ausfertigungsstelle"},{"$f":"IF(UR_Data!$SQ$34<>\"\",UR_Data!$SQ$34,\"\")","v":"Stempel | Unterschrift"},{"$f":"IF(UR_Data!$SB$36<>\"\",UR_Data!$SB$36,\"\")","v":"Nur gültig mit aufgedruckter Rückseite!"},{"$f":"IF(UR_Data!$SB$37<>\"\",UR_Data!$SB$37,\"\")","v":"Die Fortbildung wurde unter der Lehrgangsnummer  registriert."},{"$f":"IF(UR_Data!$SB$38<>\"\",UR_Data!$SB$38,\"\")","v":" •  •  "},{"$f":"IF(B23<>0,Start!$N$25,\"\")","v":""},"",{"$f":"Start!$J$28","v":0},{"$f":"Start!$L$28","v":0},{"$f":"TEXT(Start!$N$28,\"TT.MM.JJJJ\")","v":"00.01.1900"},"Anerkannte Stelle gemäß § 68 FeV – 0 | 0 | 00.01.1900",{"$f":"IF(B23>=0,IF(Start!$N$25<>0,Data_UR!$Y23,IF(Start!$J$28<>\"\",$AC$4,IF(Start!$N$25&Start!$J$28<>0,Data_UR!$AE$4,\"\"))))","v":"Aus- oder Fortbildung für Einsatzkräfte im Wasserrettungsdienst und Kathastrophenschutz."},"Aus- oder Fortbildung für Einsatzkräfte im Wasserrettungsdienst und Kathastrophenschutz."," "]
[null,{"$f":"SUM(B4:B23)","v":0}]
[]
[]
["Rückseite – Themen"]
[1,2,3,4,5,6,7,8,9,10,11,12,13,14,15,16,17,18,19,20,21,22,23,24,25,26,27,28,29,30,31,32,33,34,35,36,37,38,19,40,41,42,43,44,45]
["Nr.","Nr. V","Form","Bezeichnung 1","Bezeichnung 2","Name Rückseite 1","Name Rückseite 2","Voraussetzungen Zeile 1","Voraussetzungen Zeile 2","Voraussetzungen Zeile 3","Voraussetzungen Zeile 4","Voraussetzungen Zeile 5","Voraussetzungen Zeile 6","Voraussetzungen Zeile 7","Voraussetzungen Zeile 8","Voraussetzungen Zeile 9","Voraussetzungen Zeile 10","Voraussetzungen Zeile 11","Voraussetzungen Zeile 12","Inhalte Zeile 0","Inhalte Zeile 1","Inhalte Zeile 2","Inhalte Zeile 3","Inhalte Zeile 4","Inhalte Zeile 5","Inhalte Zeile 6","Inhalte Zeile 7","Inhalte Zeile 8","Inhalte Zeile 9","Inhalte Zeile 10","Inhalte Zeile 11","Inhalte Zeile 12","Inhalte Zeile 13","Inhalte Zeile 14","Inhalte Zeile 15","Inhalte Zeile 16","Inhalte Zeile 17","Inhalte Zeile 18","Inhalte Zeile 19","Inhalte Zeile 20","Schlussbemerkung"]
[1,{"$f":"IF(B4<>0,B4,0)","v":0},{"$f":"IF(C4<>\"\",C4,\"\")","v":"Teilnahmebescheinigung"},{"$f":"IF(D4<>\"\",D4,\"\")","v":"Erste Hilfe-Ausbildung"},{"$f":"IF(E4<>\"\",E4,\"\")","v":"für betriebliche Ersthelfende | EH-Schulung gemäß § 19 FeV"},{"$f":"CONCATENATE(VLOOKUP(Urkunde_1!$AG$4,Data_PD!$A$4:$U$23,4,FALSE),\" – \",VLOOKUP(Urkunde_1!$AG$4,Data_PD!$A$4:$U$23,5,FALSE),\" | \",Doku!$Y$26)","v":{"$error":"#N/A"}},{"$f":"CONCATENATE(VLOOKUP(Urkunde_2!$AG$4,Data_PD!$A$4:$U$23,4,FALSE),\" – \",VLOOKUP(Urkunde_2!$AG$4,Data_PD!$A$4:$U$23,5,FALSE),\" | \",Doku!$Y$26)","v":{"$error":"#N/A"}},{"$f":"IF(UR_Data!$B$49<>\"\",UR_Data!$B$49,\"\")","v":""},{"$f":"IF(UR_Data!$B$50<>\"\",UR_Data!$B$50,\"\")","v":""},{"$f":"IF(UR_Data!$B$51<>\"\",UR_Data!$B$51,\"\")","v":""},{"$f":"IF(UR_Data!$B$52<>\"\",UR_Data!$B$52,\"\")","v":""},{"$f":"IF(UR_Data!$B$53<>\"\",UR_Data!$B$53,\"\")","v":""},{"$f":"IF(UR_Data!$B$54<>\"\",UR_Data!$B$54,\"\")","v":""},{"$f":"IF(UR_Data!$B$55<>\"\",UR_Data!$B$55,\"\")","v":""},{"$f":"IF(UR_Data!$B$56<>\"\",UR_Data!$B$56,\"\")","v":""},{"$f":"IF(UR_Data!$B$57<>\"\",UR_Data!$B$57,\"\")","v":""},{"$f":"IF(UR_Data!$B$58<>\"\",UR_Data!$B$58,\"\")","v":""},{"$f":"IF(UR_Data!$B$59<>\"\",UR_Data!$B$59,\"\")","v":""},{"$f":"IF(UR_Data!$B$60<>\"\",UR_Data!$B$60,\"\")","v":""},{"$f":"IF(UR_Data!$B$62<>\"\",UR_Data!$B$62,\"\")","v":"Folgende Inhalte wurden in der pädagogischen Lehrkräfteschulung (Themenbereich I) vermittelt:"},{"$f":"IF(UR_Data!$B$65<>\"\",UR_Data!$B$65,\"\")","v":""},{"$f":"IF(UR_Data!$B$66<>\"\",UR_Data!$B$66,\"\")","v":""},{"$f":"IF(UR_Data!$B$67<>\"\",UR_Data!$B$67,\"\")","v":""},{"$f":"IF(UR_Data!$B$68<>\"\",UR_Data!$B$68,\"\")","v":""},{"$f":"IF(UR_Data!$B$69<>\"\",UR_Data!$B$69,\"\")","v":""},{"$f":"IF(UR_Data!$B$70<>\"\",UR_Data!$B$70,\"\")","v":""},{"$f":"IF(UR_Data!$B$71<>\"\",UR_Data!$B$71,\"\")","v":""},{"$f":"IF(UR_Data!$B$72<>\"\",UR_Data!$B$72,\"\")","v":""},{"$f":"IF(UR_Data!$B$73<>\"\",UR_Data!$B$73,\"\")","v":""},{"$f":"IF(UR_Data!$B$74<>\"\",UR_Data!$B$74,\"\")","v":""},{"$f":"IF(UR_Data!$B$75<>\"\",UR_Data!$B$75,\"\")","v":""},{"$f":"IF(UR_Data!$B$76<>\"\",UR_Data!$B$76,\"\")","v":""},{"$f":"IF(UR_Data!$B$77<>\"\",UR_Data!$B$77,\"\")","v":""},{"$f":"IF(UR_Data!$B$78<>\"\",UR_Data!$B$78,\"\")","v":""},{"$f":"IF(UR_Data!$B$79<>\"\",UR_Data!$B$79,\"\")","v":""},{"$f":"IF(UR_Data!$B$80<>\"\",UR_Data!$B$80,\"\")","v":""},{"$f":"IF(UR_Data!$B$81<>\"\",UR_Data!$B$81,\"\")","v":""},{"$f":"IF(UR_Data!$B$82<>\"\",UR_Data!$B$82,\"\")","v":""},{"$f":"IF(UR_Data!$B$83<>\"\",UR_Data!$B$83,\"\")","v":""},{"$f":"IF(UR_Data!$B$84<>\"\",UR_Data!$B$84,\"\")","v":""},null," ",null," "," "]
[2,{"$f":"IF(B5<>0,B5,0)","v":0},{"$f":"IF(C5<>\"\",C5,\"\")","v":"Teilnahmebescheinigung"},"Erste Hilfe-Schulung","in Bildungs- und Betreuungseinrichtungen für Kinder",{"$f":"CONCATENATE(VLOOKUP(Urkunde_1!$AG$4,Data_PD!$A$4:$U$23,4,FALSE),\" – \",VLOOKUP(Urkunde_1!$AG$4,Data_PD!$A$4:$U$23,5,FALSE),\" | \",Doku!$Y$26)","v":{"$error":"#N/A"}},{"$f":"CONCATENATE(VLOOKUP(Urkunde_2!$AG$4,Data_PD!$A$4:$U$23,4,FALSE),\" – \",VLOOKUP(Urkunde_2!$AG$4,Data_PD!$A$4:$U$23,5,FALSE),\" | \",Doku!$Y$26)","v":{"$error":"#N/A"}},{"$f":"IF(UR_Data!$AB$49<>\"\",UR_Data!$AB$49,\"\")","v":""},{"$f":"IF(UR_Data!$AB$50<>\"\",UR_Data!$AB$50,\"\")","v":""},{"$f":"IF(UR_Data!$AB$51<>\"\",UR_Data!$AB$51,\"\")","v":""},{"$f":"IF(UR_Data!$AB$52<>\"\",UR_Data!$AB$52,\"\")","v":""},{"$f":"IF(UR_Data!$AB$53<>\"\",UR_Data!$AB$53,\"\")","v":""},{"$f":"IF(UR_Data!$AB$54<>\"\",UR_Data!$AB$54,\"\")","v":""},{"$f":"IF(UR_Data!$AB$55<>\"\",UR_Data!$AB$55,\"\")","v":""},{"$f":"IF(UR_Data!$AB$56<>\"\",UR_Data!$AB$56,\"\")","v":""},{"$f":"IF(UR_Data!$AB$57<>\"\",UR_Data!$AB$57,\"\")","v":""},{"$f":"IF(UR_Data!$AB$58<>\"\",UR_Data!$AB$58,\"\")","v":""},{"$f":"IF(UR_Data!$AB$59<>\"\",UR_Data!$AB$59,\"\")","v":""},{"$f":"IF(UR_Data!$AB$60<>\"\",UR_Data!$AB$60,\"\")","v":""},{"$f":"IF(UR_Data!$AB$62<>\"\",UR_Data!$AB$62,\"\")","v":"Folgende Inhalte wurden in der Pädagogischen Lehrkräfteschulung (Themenbereich II) vermittelt:"},{"$f":"IF(UR_Data!$AB$65<>\"\",UR_Data!$AB$65,\"\")","v":""},{"$f":"IF(UR_Data!$AB$66<>\"\",UR_Data!$AB$66,\"\")","v":""},{"$f":"IF(UR_Data!$AB$67<>\"\",UR_Data!$AB$67,\"\")","v":""},{"$f":"IF(UR_Data!$AB$68<>\"\",UR_Data!$AB$68,\"\")","v":""},{"$f":"IF(UR_Data!$AB$69<>\"\",UR_Data!$AB$69,\"\")","v":""},{"$f":"IF(UR_Data!$AB$70<>\"\",UR_Data!$AB$70,\"\")","v":""},{"$f":"IF(UR_Data!$AB$71<>\"\",UR_Data!$AB$71,\"\")","v":""},{"$f":"IF(UR_Data!$AB$72<>\"\",UR_Data!$AB$72,\"\")","v":""},{"$f":"IF(UR_Data!$AB$73<>\"\",UR_Data!$AB$73,\"\")","v":""},{"$f":"IF(UR_Data!$AB$74<>\"\",UR_Data!$AB$74,\"\")","v":""},{"$f":"IF(UR_Data!$AB$75<>\"\",UR_Data!$AB$75,\"\")","v":""},{"$f":"IF(UR_Data!$AB$76<>\"\",UR_Data!$AB$76,\"\")","v":""},{"$f":"IF(UR_Data!$AB$77<>\"\",UR_Data!$AB$77,\"\")","v":""},{"$f":"IF(UR_Data!$AB$78<>\"\",UR_Data!$AB$78,\"\")","v":""},{"$f":"IF(UR_Data!$AB$79<>\"\",UR_Data!$AB$79,\"\")","v":""},{"$f":"IF(UR_Data!$AB$80<>\"\",UR_Data!$AB$80,\"\")","v":""},{"$f":"IF(UR_Data!$AB$81<>\"\",UR_Data!$AB$81,\"\")","v":""},{"$f":"IF(UR_Data!$AB$82<>\"\",UR_Data!$AB$82,\"\")","v":""},{"$f":"IF(UR_Data!$AB$83<>\"\",UR_Data!$AB$83,\"\")","v":""},{"$f":"IF(UR_Data!$AB$84<>\"\",UR_Data!$AB$84,\"\")","v":""},null," ",null," "," "]
[3,0,"Teilnahmebescheinigung","Erste Hilfe-Fortbildung","für betriebliche Ersthelfende",{"$f":"CONCATENATE(VLOOKUP(Urkunde_1!$AG$4,Data_PD!$A$4:$U$23,4,FALSE),\" – \",VLOOKUP(Urkunde_1!$AG$4,Data_PD!$A$4:$U$23,5,FALSE),\" | \",Doku!$Y$26)","v":{"$error":"#N/A"}},{"$f":"CONCATENATE(VLOOKUP(Urkunde_2!$AG$4,Data_PD!$A$4:$U$23,4,FALSE),\" – \",VLOOKUP(Urkunde_2!$AG$4,Data_PD!$A$4:$U$23,5,FALSE),\" | \",Doku!$Y$26)","v":{"$error":"#N/A"}},{"$f":"IF(UR_Data!$BB$49<>\"\",UR_Data!$BB$49,\"\")","v":""},{"$f":"IF(UR_Data!$BB$50<>\"\",UR_Data!$BB$50,\"\")","v":""},{"$f":"IF(UR_Data!$BB$51<>\"\",UR_Data!$BB$51,\"\")","v":""},{"$f":"IF(UR_Data!$BB$52<>\"\",UR_Data!$BB$52,\"\")","v":""},{"$f":"IF(UR_Data!$BB$53<>\"\",UR_Data!$BB$53,\"\")","v":""},{"$f":"IF(UR_Data!$BB$54<>\"\",UR_Data!$BB$54,\"\")","v":""},{"$f":"IF(UR_Data!$BB$55<>\"\",UR_Data!$BB$55,\"\")","v":""},{"$f":"IF(UR_Data!$BB$56<>\"\",UR_Data!$BB$56,\"\")","v":""},{"$f":"IF(UR_Data!$BB$57<>\"\",UR_Data!$BB$57,\"\")","v":""},{"$f":"IF(UR_Data!$BB$58<>\"\",UR_Data!$BB$58,\"\")","v":""},{"$f":"IF(UR_Data!$BB$59<>\"\",UR_Data!$BB$59,\"\")","v":""},{"$f":"IF(UR_Data!$BB$60<>\"\",UR_Data!$BB$60,\"\")","v":""},{"$f":"IF(UR_Data!$BB$62<>\"\",UR_Data!$BB$62,\"\")","v":"Folgende Inhalte wurden in der Pädagogischen Lehrkräfteschulung (Themenbereich II) für Pädagogen vermittelt:"},{"$f":"IF(UR_Data!$BB$65<>\"\",UR_Data!$BB$65,\"\")","v":""},{"$f":"IF(UR_Data!$BB$66<>\"\",UR_Data!$BB$66,\"\")","v":""},{"$f":"IF(UR_Data!$BB$67<>\"\",UR_Data!$BB$67,\"\")","v":""},{"$f":"IF(UR_Data!$BB$68<>\"\",UR_Data!$BB$68,\"\")","v":""},{"$f":"IF(UR_Data!$BB$69<>\"\",UR_Data!$BB$69,\"\")","v":""},{"$f":"IF(UR_Data!$BB$70<>\"\",UR_Data!$BB$70,\"\")","v":""},{"$f":"IF(UR_Data!$BB$71<>\"\",UR_Data!$BB$71,\"\")","v":""},{"$f":"IF(UR_Data!$BB$72<>\"\",UR_Data!$BB$72,\"\")","v":""},{"$f":"IF(UR_Data!$BB$73<>\"\",UR_Data!$BB$73,\"\")","v":""},{"$f":"IF(UR_Data!$BB$74<>\"\",UR_Data!$BB$74,\"\")","v":""},{"$f":"IF(UR_Data!$BB$75<>\"\",UR_Data!$BB$75,\"\")","v":""},{"$f":"IF(UR_Data!$BB$76<>\"\",UR_Data!$BB$76,\"\")","v":""},{"$f":"IF(UR_Data!$BB$77<>\"\",UR_Data!$BB$77,\"\")","v":""},{"$f":"IF(UR_Data!$BB$78<>\"\",UR_Data!$BB$78,\"\")","v":""},{"$f":"IF(UR_Data!$BB$79<>\"\",UR_Data!$BB$79,\"\")","v":""},{"$f":"IF(UR_Data!$BB$80<>\"\",UR_Data!$BB$80,\"\")","v":""},{"$f":"IF(UR_Data!$BB$81<>\"\",UR_Data!$BB$81,\"\")","v":""},{"$f":"IF(UR_Data!$BB$82<>\"\",UR_Data!$BB$82,\"\")","v":""},{"$f":"IF(UR_Data!$BB$83<>\"\",UR_Data!$BB$83,\"\")","v":""},{"$f":"IF(UR_Data!$BB$84<>\"\",UR_Data!$BB$84,\"\")","v":""},null," ",null," "," "]
[4,0,"","","",null,null,{"$f":"IF(UR_Data!$CB$49<>\"\",UR_Data!$CB$49,\"\")","v":""},{"$f":"IF(UR_Data!$CB$50<>\"\",UR_Data!$CB$50,\"\")","v":""},{"$f":"IF(UR_Data!$CB$51<>\"\",UR_Data!$CB$51,\"\")","v":""},{"$f":"IF(UR_Data!$CB$52<>\"\",UR_Data!$CB$52,\"\")","v":""},{"$f":"IF(UR_Data!$CB$53<>\"\",UR_Data!$CB$53,\"\")","v":""},{"$f":"IF(UR_Data!$CB$54<>\"\",UR_Data!$CB$54,\"\")","v":""},{"$f":"IF(UR_Data!$CB$55<>\"\",UR_Data!$CB$55,\"\")","v":""},{"$f":"IF(UR_Data!$CB$56<>\"\",UR_Data!$CB$56,\"\")","v":""},{"$f":"IF(UR_Data!$CB$57<>\"\",UR_Data!$CB$57,\"\")","v":""},{"$f":"IF(UR_Data!$CB$58<>\"\",UR_Data!$CB$58,\"\")","v":""},{"$f":"IF(UR_Data!$CB$59<>\"\",UR_Data!$CB$59,\"\")","v":""},{"$f":"IF(UR_Data!$CB$60<>\"\",UR_Data!$CB$60,\"\")","v":""},{"$f":"IF(UR_Data!$CB$62<>\"\",UR_Data!$CB$62,\"\")","v":"Folgende Inhalte wurden in der Pädagogischen Lehrkräfteschulung vermittelt:"},{"$f":"IF(UR_Data!$CB$65<>\"\",UR_Data!$CB$65,\"\")","v":""},{"$f":"IF(UR_Data!$CB$66<>\"\",UR_Data!$CB$66,\"\")","v":""},{"$f":"IF(UR_Data!$CB$67<>\"\",UR_Data!$CB$67,\"\")","v":""},{"$f":"IF(UR_Data!$CB$68<>\"\",UR_Data!$CB$68,\"\")","v":""},{"$f":"IF(UR_Data!$CB$69<>\"\",UR_Data!$CB$69,\"\")","v":""},{"$f":"IF(UR_Data!$CB$70<>\"\",UR_Data!$CB$70,\"\")","v":""},{"$f":"IF(UR_Data!$CB$71<>\"\",UR_Data!$CB$71,\"\")","v":""},{"$f":"IF(UR_Data!$CB$72<>\"\",UR_Data!$CB$72,\"\")","v":""},{"$f":"IF(UR_Data!$CB$73<>\"\",UR_Data!$CB$73,\"\")","v":""},{"$f":"IF(UR_Data!$CB$74<>\"\",UR_Data!$CB$74,\"\")","v":""},{"$f":"IF(UR_Data!$CB$75<>\"\",UR_Data!$CB$75,\"\")","v":""},{"$f":"IF(UR_Data!$CB$76<>\"\",UR_Data!$CB$76,\"\")","v":""},{"$f":"IF(UR_Data!$CB$77<>\"\",UR_Data!$CB$77,\"\")","v":""},{"$f":"IF(UR_Data!$CB$78<>\"\",UR_Data!$CB$78,\"\")","v":""},{"$f":"IF(UR_Data!$CB$79<>\"\",UR_Data!$CB$79,\"\")","v":""},{"$f":"IF(UR_Data!$CB$80<>\"\",UR_Data!$CB$80,\"\")","v":""},{"$f":"IF(UR_Data!$CB$81<>\"\",UR_Data!$CB$81,\"\")","v":""},{"$f":"IF(UR_Data!$CB$82<>\"\",UR_Data!$CB$82,\"\")","v":""},{"$f":"IF(UR_Data!$CB$83<>\"\",UR_Data!$CB$83,\"\")","v":""},{"$f":"IF(UR_Data!$CB$84<>\"\",UR_Data!$CB$84,\"\")","v":""},null," ",null," "," "]
[5,0,"Teilnahmebescheinigung","Erste Hilfe-Schulung","gemäß § 19 Fahrerlaubnis-Verordnung (FeV)",{"$f":"CONCATENATE(VLOOKUP(Urkunde_1!$AG$4,Data_PD!$A$4:$U$23,4,FALSE),\" – \",VLOOKUP(Urkunde_1!$AG$4,Data_PD!$A$4:$U$23,5,FALSE),\" | \",Doku!$Y$26)","v":{"$error":"#N/A"}},{"$f":"CONCATENATE(VLOOKUP(Urkunde_2!$AG$4,Data_PD!$A$4:$U$23,4,FALSE),\" – \",VLOOKUP(Urkunde_2!$AG$4,Data_PD!$A$4:$U$23,5,FALSE),\" | \",Doku!$Y$26)","v":{"$error":"#N/A"}},{"$f":"IF(UR_Data!$DB$49<>\"\",UR_Data!$DB$49,\"\")","v":""},{"$f":"IF(UR_Data!$DB$50<>\"\",UR_Data!$DB$50,\"\")","v":""},{"$f":"IF(UR_Data!$DB$51<>\"\",UR_Data!$DB$51,\"\")","v":""},{"$f":"IF(UR_Data!$DB$52<>\"\",UR_Data!$DB$52,\"\")","v":""},{"$f":"IF(UR_Data!$DB$53<>\"\",UR_Data!$DB$53,\"\")","v":""},{"$f":"IF(UR_Data!$DB$54<>\"\",UR_Data!$DB$54,\"\")","v":""},{"$f":"IF(UR_Data!$DB$55<>\"\",UR_Data!$DB$55,\"\")","v":""},{"$f":"IF(UR_Data!$DB$56<>\"\",UR_Data!$DB$56,\"\")","v":""},{"$f":"IF(UR_Data!$DB$57<>\"\",UR_Data!$DB$57,\"\")","v":""},{"$f":"IF(UR_Data!$DB$58<>\"\",UR_Data!$DB$58,\"\")","v":""},{"$f":"IF(UR_Data!$DB$59<>\"\",UR_Data!$DB$59,\"\")","v":""},{"$f":"IF(UR_Data!$DB$60<>\"\",UR_Data!$DB$60,\"\")","v":""},{"$f":"IF(UR_Data!$DB$62<>\"\",UR_Data!$DB$62,\"\")","v":"Folgende Inhalte wurden in der Ausbildung zum Erste Hilfe-Ausbilder mit mindestens 5 Lerneinheiten (LE) vermittelt:"},{"$f":"IF(UR_Data!$DB$65<>\"\",UR_Data!$DB$65,\"\")","v":""},{"$f":"IF(UR_Data!$DB$66<>\"\",UR_Data!$DB$66,\"\")","v":""},{"$f":"IF(UR_Data!$DB$67<>\"\",UR_Data!$DB$67,\"\")","v":""},{"$f":"IF(UR_Data!$DB$68<>\"\",UR_Data!$DB$68,\"\")","v":""},{"$f":"IF(UR_Data!$DB$69<>\"\",UR_Data!$DB$69,\"\")","v":""},{"$f":"IF(UR_Data!$DB$70<>\"\",UR_Data!$DB$70,\"\")","v":""},{"$f":"IF(UR_Data!$DB$71<>\"\",UR_Data!$DB$71,\"\")","v":""},{"$f":"IF(UR_Data!$DB$72<>\"\",UR_Data!$DB$72,\"\")","v":""},{"$f":"IF(UR_Data!$DB$73<>\"\",UR_Data!$DB$73,\"\")","v":""},{"$f":"IF(UR_Data!$DB$74<>\"\",UR_Data!$DB$74,\"\")","v":""},{"$f":"IF(UR_Data!$DB$75<>\"\",UR_Data!$DB$75,\"\")","v":""},{"$f":"IF(UR_Data!$DB$76<>\"\",UR_Data!$DB$76,\"\")","v":""},{"$f":"IF(UR_Data!$DB$77<>\"\",UR_Data!$DB$77,\"\")","v":""},{"$f":"IF(UR_Data!$DB$78<>\"\",UR_Data!$DB$78,\"\")","v":""},{"$f":"IF(UR_Data!$DB$79<>\"\",UR_Data!$DB$79,\"\")","v":""},{"$f":"IF(UR_Data!$DB$80<>\"\",UR_Data!$DB$80,\"\")","v":""},{"$f":"IF(UR_Data!$DB$81<>\"\",UR_Data!$DB$81,\"\")","v":""},{"$f":"IF(UR_Data!$DB$82<>\"\",UR_Data!$DB$82,\"\")","v":""},{"$f":"IF(UR_Data!$DB$83<>\"\",UR_Data!$DB$83,\"\")","v":""},{"$f":"IF(UR_Data!$DB$84<>\"\",UR_Data!$DB$84,\"\")","v":""},null," ",null," "," "]
[6,0,"","","",null,null,{"$f":"IF(UR_Data!$EB$49<>\"\",UR_Data!$EB$49,\"\")","v":""},{"$f":"IF(UR_Data!$EB$50<>\"\",UR_Data!$EB$50,\"\")","v":""},{"$f":"IF(UR_Data!$EB$51<>\"\",UR_Data!$EB$51,\"\")","v":""},{"$f":"IF(UR_Data!$EB$52<>\"\",UR_Data!$EB$52,\"\")","v":""},{"$f":"IF(UR_Data!$EB$53<>\"\",UR_Data!$EB$53,\"\")","v":""},{"$f":"IF(UR_Data!$EB$54<>\"\",UR_Data!$EB$54,\"\")","v":""},{"$f":"IF(UR_Data!$EB$55<>\"\",UR_Data!$EB$55,\"\")","v":""},{"$f":"IF(UR_Data!$EB$56<>\"\",UR_Data!$EB$56,\"\")","v":""},{"$f":"IF(UR_Data!$EB$57<>\"\",UR_Data!$EB$57,\"\")","v":""},{"$f":"IF(UR_Data!$EB$58<>\"\",UR_Data!$EB$58,\"\")","v":""},{"$f":"IF(UR_Data!$EB$59<>\"\",UR_Data!$EB$59,\"\")","v":""},{"$f":"IF(UR_Data!$EB$60<>\"\",UR_Data!$EB$60,\"\")","v":""},{"$f":"IF(UR_Data!$EB$62<>\"\",UR_Data!$EB$62,\"\")","v":"Folgende Inhalte wurden in der Ausbildung zum Erste Hilfe-Ausbilder mit mindestens 5 Lerneinheiten (LE) vermittelt:"},{"$f":"IF(UR_Data!$EB$65<>\"\",UR_Data!$EB$65,\"\")","v":""},{"$f":"IF(UR_Data!$EB$66<>\"\",UR_Data!$EB$66,\"\")","v":""},{"$f":"IF(UR_Data!$EB$67<>\"\",UR_Data!$EB$67,\"\")","v":""},{"$f":"IF(UR_Data!$EB$68<>\"\",UR_Data!$EB$68,\"\")","v":""},{"$f":"IF(UR_Data!$EB$69<>\"\",UR_Data!$EB$69,\"\")","v":""},{"$f":"IF(UR_Data!$EB$70<>\"\",UR_Data!$EB$70,\"\")","v":""},{"$f":"IF(UR_Data!$EB$71<>\"\",UR_Data!$EB$71,\"\")","v":""},{"$f":"IF(UR_Data!$EB$72<>\"\",UR_Data!$EB$72,\"\")","v":""},{"$f":"IF(UR_Data!$EB$73<>\"\",UR_Data!$EB$73,\"\")","v":""},{"$f":"IF(UR_Data!$EB$74<>\"\",UR_Data!$EB$74,\"\")","v":""},{"$f":"IF(UR_Data!$EB$75<>\"\",UR_Data!$EB$75,\"\")","v":""},{"$f":"IF(UR_Data!$EB$76<>\"\",UR_Data!$EB$76,\"\")","v":""},{"$f":"IF(UR_Data!$EB$77<>\"\",UR_Data!$EB$77,\"\")","v":""},{"$f":"IF(UR_Data!$EB$78<>\"\",UR_Data!$EB$78,\"\")","v":""},{"$f":"IF(UR_Data!$EB$79<>\"\",UR_Data!$EB$79,\"\")","v":""},{"$f":"IF(UR_Data!$EB$80<>\"\",UR_Data!$EB$80,\"\")","v":""},{"$f":"IF(UR_Data!$EB$81<>\"\",UR_Data!$EB$81,\"\")","v":""},{"$f":"IF(UR_Data!$EB$82<>\"\",UR_Data!$EB$82,\"\")","v":""},{"$f":"IF(UR_Data!$EB$83<>\"\",UR_Data!$EB$83,\"\")","v":""},{"$f":"IF(UR_Data!$EB$84<>\"\",UR_Data!$EB$84,\"\")","v":""},null," ",null," "," "]
[7,0,"Teilnahmebescheinigung","Erste Hilfe-Ausbildung","gemäß den Gemeinsamen Grundsätzen der BAGEH",{"$f":"CONCATENATE(VLOOKUP(Urkunde_1!$AG$4,Data_PD!$A$4:$U$23,4,FALSE),\" – \",VLOOKUP(Urkunde_1!$AG$4,Data_PD!$A$4:$U$23,5,FALSE),\" | \",Doku!$Y$26)","v":{"$error":"#N/A"}},{"$f":"CONCATENATE(VLOOKUP(Urkunde_2!$AG$4,Data_PD!$A$4:$U$23,4,FALSE),\" – \",VLOOKUP(Urkunde_2!$AG$4,Data_PD!$A$4:$U$23,5,FALSE),\" | \",Doku!$Y$26)","v":{"$error":"#N/A"}},{"$f":"IF(UR_Data!$FB$49<>\"\",UR_Data!$FB$49,\"\")","v":""},{"$f":"IF(UR_Data!$FB$50<>\"\",UR_Data!$FB$50,\"\")","v":""},{"$f":"IF(UR_Data!$FB$51<>\"\",UR_Data!$FB$51,\"\")","v":""},{"$f":"IF(UR_Data!$FB$52<>\"\",UR_Data!$FB$52,\"\")","v":""},{"$f":"IF(UR_Data!$FB$53<>\"\",UR_Data!$FB$53,\"\")","v":""},{"$f":"IF(UR_Data!$FB$54<>\"\",UR_Data!$FB$54,\"\")","v":""},{"$f":"IF(UR_Data!$FB$55<>\"\",UR_Data!$FB$55,\"\")","v":""},{"$f":"IF(UR_Data!$FB$56<>\"\",UR_Data!$FB$56,\"\")","v":""},{"$f":"IF(UR_Data!$FB$57<>\"\",UR_Data!$FB$57,\"\")","v":""},{"$f":"IF(UR_Data!$FB$58<>\"\",UR_Data!$FB$58,\"\")","v":""},{"$f":"IF(UR_Data!$FB$59<>\"\",UR_Data!$FB$59,\"\")","v":""},{"$f":"IF(UR_Data!$FB$60<>\"\",UR_Data!$FB$60,\"\")","v":""},{"$f":"IF(UR_Data!$FB$62<>\"\",UR_Data!$FB$62,\"\")","v":"Folgende Inhalte für die Zusatzqualifikation wurden dem Erste Hilfe-Ausbilder mit mindestens 16 Lerneinheiten (LE) vermittelt:"},{"$f":"IF(UR_Data!$FB$65<>\"\",UR_Data!$FB$65,\"\")","v":"•  Strukturellen Merkmale dieser Ausbildungsform"},{"$f":"IF(UR_Data!$FB$66<>\"\",UR_Data!$FB$66,\"\")","v":"•  Das Kind als besonderer Patient"},{"$f":"IF(UR_Data!$FB$67<>\"\",UR_Data!$FB$67,\"\")","v":"•  Kenntnisse über kinderbezogene Notfälle und Kinderkrankheiten"},{"$f":"IF(UR_Data!$FB$68<>\"\",UR_Data!$FB$68,\"\")","v":"•  Auffinden eines bewusstlosen Kleinkindes bzw. Säuglings"},{"$f":"IF(UR_Data!$FB$69<>\"\",UR_Data!$FB$69,\"\")","v":"•  Seitenlage Kleinkinder bzw. Bauchlage (Säugling)"},{"$f":"IF(UR_Data!$FB$70<>\"\",UR_Data!$FB$70,\"\")","v":"•  Beatmung von Kleinkindern und Säuglingen"},{"$f":"IF(UR_Data!$FB$71<>\"\",UR_Data!$FB$71,\"\")","v":"•  Herz-Lungen-Wiederbelebung bei Säuglingen"},{"$f":"IF(UR_Data!$FB$72<>\"\",UR_Data!$FB$72,\"\")","v":"•  Herz-Lungen-Wiederbelebung bei Kleinkindern"},{"$f":"IF(UR_Data!$FB$73<>\"\",UR_Data!$FB$73,\"\")","v":""},{"$f":"IF(UR_Data!$FB$74<>\"\",UR_Data!$FB$74,\"\")","v":""},{"$f":"IF(UR_Data!$FB$75<>\"\",UR_Data!$FB$75,\"\")","v":""},{"$f":"IF(UR_Data!$FB$76<>\"\",UR_Data!$FB$76,\"\")","v":""},{"$f":"IF(UR_Data!$FB$77<>\"\",UR_Data!$FB$77,\"\")","v":""},{"$f":"IF(UR_Data!$FB$78<>\"\",UR_Data!$FB$78,\"\")","v":""},{"$f":"IF(UR_Data!$FB$79<>\"\",UR_Data!$FB$79,\"\")","v":""},{"$f":"IF(UR_Data!$FB$80<>\"\",UR_Data!$FB$80,\"\")","v":""},{"$f":"IF(UR_Data!$FB$81<>\"\",UR_Data!$FB$81,\"\")","v":""},{"$f":"IF(UR_Data!$FB$82<>\"\",UR_Data!$FB$82,\"\")","v":""},{"$f":"IF(UR_Data!$FB$83<>\"\",UR_Data!$FB$83,\"\")","v":""},{"$f":"IF(UR_Data!$FB$84<>\"\",UR_Data!$FB$84,\"\")","v":""},null," ",null," "," "]
[8,0,"Teilnahmebescheinigung","Erste Hilfe-Fortbildung","gemäß den Gemeinsamen Grundsätzen der BAGEH",{"$f":"CONCATENATE(VLOOKUP(Urkunde_1!$AG$4,Data_PD!$A$4:$U$23,4,FALSE),\" – \",VLOOKUP(Urkunde_1!$AG$4,Data_PD!$A$4:$U$23,5,FALSE),\" | \",Doku!$Y$26)","v":{"$error":"#N/A"}},{"$f":"CONCATENATE(VLOOKUP(Urkunde_2!$AG$4,Data_PD!$A$4:$U$23,4,FALSE),\" – \",VLOOKUP(Urkunde_2!$AG$4,Data_PD!$A$4:$U$23,5,FALSE),\" | \",Doku!$Y$26)","v":{"$error":"#N/A"}},{"$f":"IF(UR_Data!$GB$47<>\"\",UR_Data!$GB$47,\"\")","v":""},{"$f":"IF(UR_Data!$GB$49<>\"\",UR_Data!$GB$49,\"\")","v":""},{"$f":"IF(UR_Data!$GB$52<>\"\",UR_Data!$GB$52,\"\")","v":""},{"$f":"IF(UR_Data!$GB$55<>\"\",UR_Data!$GB$55,\"\")","v":""},{"$f":"IF(UR_Data!$GB$58<>\"\",UR_Data!$GB$58,\"\")","v":""},{"$f":"IF(UR_Data!$GB$61<>\"\",UR_Data!$GB$61,\"\")","v":""},{"$f":"IF(UR_Data!$GB$64<>\"\",UR_Data!$GB$64,\"\")","v":""},{"$f":"IF(UR_Data!$GB$67<>\"\",UR_Data!$GB$67,\"\")","v":""},{"$f":"IF(UR_Data!$GB$70<>\"\",UR_Data!$GB$70,\"\")","v":""},{"$f":"IF(UR_Data!$GB$73<>\"\",UR_Data!$GB$73,\"\")","v":""},{"$f":"IF(UR_Data!$GB$76<>\"\",UR_Data!$GB$76,\"\")","v":""},{"$f":"IF(UR_Data!$GB$79<>\"\",UR_Data!$GB$79,\"\")","v":""},{"$f":"IF(UR_Data!$GB$62<>\"\",UR_Data!$GB$62,\"\")","v":""},{"$f":"IF(UR_Data!$GB$65<>\"\",UR_Data!$GB$65,\"\")","v":""},{"$f":"IF(UR_Data!$GB$67<>\"\",UR_Data!$GB$67,\"\")","v":""},{"$f":"IF(UR_Data!$GB$68<>\"\",UR_Data!$GB$68,\"\")","v":""},{"$f":"IF(UR_Data!$GB$70<>\"\",UR_Data!$GB$70,\"\")","v":""},{"$f":"IF(UR_Data!$GB$71<>\"\",UR_Data!$GB$71,\"\")","v":""},{"$f":"IF(UR_Data!$GB$73<>\"\",UR_Data!$GB$73,\"\")","v":""},{"$f":"IF(UR_Data!$GB$74<>\"\",UR_Data!$GB$74,\"\")","v":""},{"$f":"IF(UR_Data!$GB$75<>\"\",UR_Data!$GB$75,\"\")","v":""},{"$f":"IF(UR_Data!#REF!<>\"\",UR_Data!#REF!,\"\")","v":{"$error":"#REF!"}},{"$f":"IF(UR_Data!#REF!<>\"\",UR_Data!#REF!,\"\")","v":{"$error":"#REF!"}},{"$f":"IF(UR_Data!$GB$76<>\"\",UR_Data!$GB$76,\"\")","v":""},{"$f":"IF(UR_Data!$GB$77<>\"\",UR_Data!$GB$77,\"\")","v":""},{"$f":"IF(UR_Data!$GB$79<>\"\",UR_Data!$GB$79,\"\")","v":""},null,null,null,null,null,null,null,null," ",null," "," "]
[9,0,"Teilnahmebescheinigung","Erste Hilfe bei Kindernotfällen","Erste Hilfe leisten bei akuten Gefahren, Krankheiten und Notfällen",{"$f":"CONCATENATE(VLOOKUP(Urkunde_1!$AG$4,Data_PD!$A$4:$U$23,4,FALSE),\" – \",VLOOKUP(Urkunde_1!$AG$4,Data_PD!$A$4:$U$23,5,FALSE),\" | \",Doku!$Y$26)","v":{"$error":"#N/A"}},{"$f":"CONCATENATE(VLOOKUP(Urkunde_2!$AG$4,Data_PD!$A$4:$U$23,4,FALSE),\" – \",VLOOKUP(Urkunde_2!$AG$4,Data_PD!$A$4:$U$23,5,FALSE),\" | \",Doku!$Y$26)","v":{"$error":"#N/A"}},{"$f":"IF(UR_Data!$HB$47<>\"\",UR_Data!$HB$47,\"\")","v":""},{"$f":"IF(UR_Data!$HB$49<>\"\",UR_Data!$HB$49,\"\")","v":""},{"$f":"IF(UR_Data!$HB$52<>\"\",UR_Data!$HB$52,\"\")","v":""},{"$f":"IF(UR_Data!$HB$55<>\"\",UR_Data!$HB$55,\"\")","v":""},{"$f":"IF(UR_Data!$HB$58<>\"\",UR_Data!$HB$58,\"\")","v":""},{"$f":"IF(UR_Data!$HB$61<>\"\",UR_Data!$HB$61,\"\")","v":""},{"$f":"IF(UR_Data!$HB$64<>\"\",UR_Data!$HB$64,\"\")","v":""},{"$f":"IF(UR_Data!$HB$67<>\"\",UR_Data!$HB$67,\"\")","v":""},{"$f":"IF(UR_Data!$HB$70<>\"\",UR_Data!$HB$70,\"\")","v":""},{"$f":"IF(UR_Data!$HB$73<>\"\",UR_Data!$HB$73,\"\")","v":""},{"$f":"IF(UR_Data!$HB$76<>\"\",UR_Data!$HB$76,\"\")","v":""},{"$f":"IF(UR_Data!$HB$79<>\"\",UR_Data!$HB$79,\"\")","v":""},{"$f":"IF(UR_Data!$HB$62<>\"\",UR_Data!$HB$62,\"\")","v":""},{"$f":"IF(UR_Data!$HB$64<>\"\",UR_Data!$HB$64,\"\")","v":""},{"$f":"IF(UR_Data!$HB$65<>\"\",UR_Data!$HB$65,\"\")","v":""},{"$f":"IF(UR_Data!$HB$67<>\"\",UR_Data!$HB$67,\"\")","v":""},{"$f":"IF(UR_Data!$HB$68<>\"\",UR_Data!$HB$68,\"\")","v":""},{"$f":"IF(UR_Data!$HB$69<>\"\",UR_Data!$HB$69,\"\")","v":""},{"$f":"IF(UR_Data!#REF!<>\"\",UR_Data!#REF!,\"\")","v":{"$error":"#REF!"}},{"$f":"IF(UR_Data!$HB$70<>\"\",UR_Data!$HB$70,\"\")","v":""},{"$f":"IF(UR_Data!$HB$71<>\"\",UR_Data!$HB$71,\"\")","v":""},{"$f":"IF(UR_Data!$HB$72<>\"\",UR_Data!$HB$72,\"\")","v":""},{"$f":"IF(UR_Data!$HB$73<>\"\",UR_Data!$HB$73,\"\")","v":""},{"$f":"IF(UR_Data!$HB$74<>\"\",UR_Data!$HB$74,\"\")","v":""},{"$f":"IF(UR_Data!$HB$76<>\"\",UR_Data!$HB$76,\"\")","v":""},{"$f":"IF(UR_Data!$HB$77<>\"\",UR_Data!$HB$77,\"\")","v":""},null,null,null,null,null,null,null,null," ",null," "," "]
[10,0,"Teilnahmebescheinigung","Erste Hilfe-Fortbildung","Auffrischung der Kenntnisse Erste Hilfe bei Kindernotfällen",{"$f":"CONCATENATE(VLOOKUP(Urkunde_1!$AG$4,Data_PD!$A$4:$U$23,4,FALSE),\" – \",VLOOKUP(Urkunde_1!$AG$4,Data_PD!$A$4:$U$23,5,FALSE),\" | \",Doku!$Y$26)","v":{"$error":"#N/A"}},{"$f":"CONCATENATE(VLOOKUP(Urkunde_2!$AG$4,Data_PD!$A$4:$U$23,4,FALSE),\" – \",VLOOKUP(Urkunde_2!$AG$4,Data_PD!$A$4:$U$23,5,FALSE),\" | \",Doku!$Y$26)","v":{"$error":"#N/A"}},{"$f":"IF(UR_Data!$IB$49<>\"\",UR_Data!$IB$49,\"\")","v":""},{"$f":"IF(UR_Data!$IB$50<>\"\",UR_Data!$IB$50,\"\")","v":""},{"$f":"IF(UR_Data!$IB$51<>\"\",UR_Data!$IB$51,\"\")","v":""},{"$f":"IF(UR_Data!$IB$52<>\"\",UR_Data!$IB$52,\"\")","v":""},{"$f":"IF(UR_Data!$IB$53<>\"\",UR_Data!$IB$53,\"\")","v":""},{"$f":"IF(UR_Data!$IB$54<>\"\",UR_Data!$IB$54,\"\")","v":""},{"$f":"IF(UR_Data!$IB$55<>\"\",UR_Data!$IB$55,\"\")","v":""},{"$f":"IF(UR_Data!$IB$56<>\"\",UR_Data!$IB$56,\"\")","v":""},{"$f":"IF(UR_Data!$IB$57<>\"\",UR_Data!$IB$57,\"\")","v":""},{"$f":"IF(UR_Data!$IB$58<>\"\",UR_Data!$IB$58,\"\")","v":""},{"$f":"IF(UR_Data!$IB$59<>\"\",UR_Data!$IB$59,\"\")","v":""},{"$f":"IF(UR_Data!$IB$60<>\"\",UR_Data!$IB$60,\"\")","v":""},{"$f":"IF(UR_Data!$IB$62<>\"\",UR_Data!$IB$62,\"\")","v":""},{"$f":"IF(UR_Data!$IB$65<>\"\",UR_Data!$IB$65,\"\")","v":""},{"$f":"IF(UR_Data!$IB$66<>\"\",UR_Data!$IB$66,\"\")","v":""},{"$f":"IF(UR_Data!$IB$67<>\"\",UR_Data!$IB$67,\"\")","v":""},{"$f":"IF(UR_Data!$IB$68<>\"\",UR_Data!$IB$68,\"\")","v":""},{"$f":"IF(UR_Data!$IB$69<>\"\",UR_Data!$IB$69,\"\")","v":""},{"$f":"IF(UR_Data!$IB$70<>\"\",UR_Data!$IB$70,\"\")","v":""},{"$f":"IF(UR_Data!$IB$71<>\"\",UR_Data!$IB$71,\"\")","v":""},{"$f":"IF(UR_Data!$IB$72<>\"\",UR_Data!$IB$72,\"\")","v":""},{"$f":"IF(UR_Data!$IB$73<>\"\",UR_Data!$IB$73,\"\")","v":""},{"$f":"IF(UR_Data!$IB$74<>\"\",UR_Data!$IB$74,\"\")","v":""},{"$f":"IF(UR_Data!$IB$75<>\"\",UR_Data!$IB$75,\"\")","v":""},{"$f":"IF(UR_Data!$IB$76<>\"\",UR_Data!$IB$76,\"\")","v":""},{"$f":"IF(UR_Data!$IB$77<>\"\",UR_Data!$IB$77,\"\")","v":""},null,null,null,null,null,null,null,null,"  ",null," "," "]
[11,0,"","","",null,null,{"$f":"IF(UR_Data!$JB$47<>\"\",UR_Data!$JB$47,\"\")","v":""},{"$f":"IF(UR_Data!$JB$49<>\"\",UR_Data!$JB$49,\"\")","v":""},{"$f":"IF(UR_Data!$JB$52<>\"\",UR_Data!$JB$52,\"\")","v":""},{"$f":"IF(UR_Data!$JB$55<>\"\",UR_Data!$JB$55,\"\")","v":""},{"$f":"IF(UR_Data!$JB$58<>\"\",UR_Data!$JB$58,\"\")","v":""},{"$f":"IF(UR_Data!$JB$61<>\"\",UR_Data!$JB$61,\"\")","v":""},{"$f":"IF(UR_Data!$JB$64<>\"\",UR_Data!$JB$64,\"\")","v":""},{"$f":"IF(UR_Data!$JB$67<>\"\",UR_Data!$JB$67,\"\")","v":""},{"$f":"IF(UR_Data!$JB$70<>\"\",UR_Data!$JB$70,\"\")","v":""},{"$f":"IF(UR_Data!$JB$73<>\"\",UR_Data!$JB$73,\"\")","v":""},{"$f":"IF(UR_Data!$JB$76<>\"\",UR_Data!$JB$76,\"\")","v":""},null,{"$f":"IF(UR_Data!$JB$68<>\"\",UR_Data!$JB$68,\"\")","v":""},{"$f":"IF(UR_Data!$JB$71<>\"\",UR_Data!$JB$71,\"\")","v":""},{"$f":"IF(UR_Data!$JB$72<>\"\",UR_Data!$JB$72,\"\")","v":""},{"$f":"IF(UR_Data!$JB$73<>\"\",UR_Data!$JB$73,\"\")","v":""},{"$f":"IF(UR_Data!$JB$74<>\"\",UR_Data!$JB$74,\"\")","v":""},{"$f":"IF(UR_Data!$JB$75<>\"\",UR_Data!$JB$75,\"\")","v":""},{"$f":"IF(UR_Data!$JB$76<>\"\",UR_Data!$JB$76,\"\")","v":""},{"$f":"IF(UR_Data!$JB$77<>\"\",UR_Data!$JB$77,\"\")","v":""},{"$f":"IF(UR_Data!$JB$78<>\"\",UR_Data!$JB$78,\"\")","v":""},{"$f":"IF(UR_Data!$JB$79<>\"\",UR_Data!$JB$79,\"\")","v":""},{"$f":"IF(UR_Data!$JB$80<>\"\",UR_Data!$JB$80,\"\")","v":""},{"$f":"IF(UR_Data!$JB$81<>\"\",UR_Data!$JB$81,\"\")","v":""},{"$f":"IF(UR_Data!$JB$82<>\"\",UR_Data!$JB$82,\"\")","v":""},{"$f":"IF(UR_Data!$JB$83<>\"\",UR_Data!$JB$83,\"\")","v":""},null,null,null,null,null,null,null,null," ",null," "," "]
[12,0,"Ausbildungsnachweis","Sanitätsausbildung A","",{"$f":"CONCATENATE(VLOOKUP(Urkunde_1!$AG$4,Data_PD!$A$4:$U$23,4,FALSE),\" – \",VLOOKUP(Urkunde_1!$AG$4,Data_PD!$A$4:$U$23,5,FALSE),\" | \",Doku!$Y$26)","v":{"$error":"#N/A"}},{"$f":"CONCATENATE(VLOOKUP(Urkunde_2!$AG$4,Data_PD!$A$4:$U$23,4,FALSE),\" – \",VLOOKUP(Urkunde_2!$AG$4,Data_PD!$A$4:$U$23,5,FALSE),\" | \",Doku!$Y$26)","v":{"$error":"#N/A"}},{"$f":"IF(UR_Data!$KB$47<>\"\",UR_Data!$KB$47,\"\")","v":"Folgende Inhalte wurden in der Sanitätsausbildung A vermittelt:"},{"$f":"IF(UR_Data!$KB$49<>\"\",UR_Data!$KB$49,\"\")","v":"•  Notfall, Überlebenskette, Notruf, Verhaltensweisen, Einsatz, Auftreten,\n   Feststellen von Lebensfunktionen, Bewusstsein, Bewusstseinslage,\n   Auffinden eines Ansprechbaren Notfallpatienten"},{"$f":"IF(UR_Data!$KB$52<>\"\",UR_Data!$KB$52,\"\")","v":"•  Atmung, Funktion der Atmung, Atemsteuerung, Atemgase, Blut, Blutgefäße,\n   Herz, Lage, Aufbau, Reizleitungssystem, Funktion, Blutkreislauf, Gestörte\n   Funktion, Puls fühlen, Blutdruck, Blutdruckmessung"},{"$f":"IF(UR_Data!$KB$55<>\"\",UR_Data!$KB$55,\"\")","v":"•  Atemstillstand, Guedeltubus, Beatmung, Sauerstoff, Druckminderer, \n   Flascheninhalt, Beatmung mit Beatmungsbeutel und Sauerstoff, \n   Sauerstoffinhalation (Maske, Brille), Sauerstoffreservoir, Demandventil"},{"$f":"IF(UR_Data!$KB$58<>\"\",UR_Data!$KB$58,\"\")","v":"•  Störungen der Atmung, Atemnot, Ungenügende Atmung, Hyperventilation,\n   Ertrinkungsunfall, Stilles Ertrinken, Schwimmbad-Blackout, Kälteschock,\n   Schwimmversagen"},{"$f":"IF(UR_Data!$KB$61<>\"\",UR_Data!$KB$61,\"\")","v":"•  Auffinden eines Notfallpatienten II, Kreislaufstillstand, AED, Herz-Lungen-\n   Wiederbelebung mit 2 Helfern mit AED und Sauerstoff, Verlegung der\n   Atemwege"},{"$f":"IF(UR_Data!$KB$64<>\"\",UR_Data!$KB$64,\"\")","v":"•  Herz-Kreislauf-Störung, akutes Koronarsyndrom, Schock, \n   Volumenmangelschock\n"},{"$f":"IF(UR_Data!$KB$67<>\"\",UR_Data!$KB$67,\"\")","v":"•  Sportverletzungen, Gelenkverletzungen, Knochenbruch, Alu-Polster-\n   schiene, Halswirbelsäulenbruch, HWS-Stützkragen\n"},{"$f":"IF(UR_Data!$KB$70<>\"\",UR_Data!$KB$70,\"\")","v":"•  Schlaganfall, Krampfanfälle, Blutzuckerentgleisung, Akuter Bauch, \n   Gynäkologischer Notfall\n"},{"$f":"IF(UR_Data!$KB$73<>\"\",UR_Data!$KB$73,\"\")","v":"•  Verletzungen durch Nesseltiere, Insektenstiche, Zeckenstich, Wunden,\n   Verbände – Praxis, Notverband, Bedrohliche Blutungen, Tourniquet,\n   Hygiene, Hygiene im Einsatz, Händewaschen, Händedesinfektion"},{"$f":"IF(UR_Data!$KB$76<>\"\",UR_Data!$KB$76,\"\")","v":"•  Persönliche Schutzausrüstung, Entsorgung bzw. Aufbereitung von \n   Materialien, Sonnenstich, Hitzschlag, Hitzeerschöpfung, Verbrennungen, \n   Verbrühungen, Unterkühlung, Stadien der Unterkühlung, Erfrierungen"},{"$f":"IF(UR_Data!$KB$79<>\"\",UR_Data!$KB$79,\"\")","v":"•  Transportieren, Schultertragegriff nach Rautek, Patienten aufnehmen und\n   Tragen, Rettungstuch, Krankentrage\n"},{"$f":"IF(UR_Data!$KB$82<>\"\",UR_Data!$KB$82,\"\")","v":""},{"$f":"IF(UR_Data!$KB$83<>\"\",UR_Data!$KB$83,\"\")","v":""},{"$f":"IF(UR_Data!$KB$84<>\"\",UR_Data!$KB$84,\"\")","v":""},null,null,null,null,null,null,null,null,null,null,null,null,null,null,null,null,null,null,{"$f":"IF(UR_Data!$KB$86<>\"\",UR_Data!$KB$86,\"\")","v":"Die hier aufgeführten Themen wurden ausschließlich von pädagogisch und fachlich geeigneten Lehrkräften erteilt."}," "]
[13,0,"Ausbildungsnachweis","Sanitätsausbildung B","",{"$f":"CONCATENATE(VLOOKUP(Urkunde_1!$AG$4,Data_PD!$A$4:$U$23,4,FALSE),\" – \",VLOOKUP(Urkunde_1!$AG$4,Data_PD!$A$4:$U$23,5,FALSE),\" | \",Doku!$Y$26)","v":{"$error":"#N/A"}},{"$f":"CONCATENATE(VLOOKUP(Urkunde_2!$AG$4,Data_PD!$A$4:$U$23,4,FALSE),\" – \",VLOOKUP(Urkunde_2!$AG$4,Data_PD!$A$4:$U$23,5,FALSE),\" | \",Doku!$Y$26)","v":{"$error":"#N/A"}},{"$f":"IF(UR_Data!$LB$47<>\"\",UR_Data!$LB$47,\"\")","v":"Folgende Inhalte wurden in der Sanitätsausbildung B vermittelt:"},{"$f":"IF(UR_Data!$LB$49<>\"\",UR_Data!$LB$49,\"\")","v":"•  Auffinden eines Notfallpatienten I und II, Auffinden eines ansprechbaren\n   Notfallpatienten, Störungen der Atmung, Atemnot, Physiologie der Atmung,\n   Aufbau der Atmungsorgane, Asthma, Reizgasvergiftung, Lungenödem"},{"$f":"IF(UR_Data!$LB$52<>\"\",UR_Data!$LB$52,\"\")","v":"•  Pneumothorax, Atemstillstand, Sekret absaugen, Atemwegssicherung\n   durch Tuben, Guedeltubus, Wendltubus, Anwendung des Larynxtubus,\n   Herz-Lungen-Wiederbelebung mit AED und Sauerstoff"},{"$f":"IF(UR_Data!$LB$55<>\"\",UR_Data!$LB$55,\"\")","v":"•  Herz-Lungen-Wiederbelebung bei Kindern, Medikamente, Beschaffung\n   von Arzneimittel, Injektion und Infusion, Vorbereitung einer Infusion, \n   Vorbereitung einer Injektion"},{"$f":"IF(UR_Data!$LB$58<>\"\",UR_Data!$LB$58,\"\")","v":"•  Allgemeine Übersicht der Tauchunfälle, Barotraumen, Gasvergiftungen \n   beim Tauchen, Tauchunfälle, Dekompressionskrankheit (DCS), \n   Lungenüberdruckunfall (AGE)"},{"$f":"IF(UR_Data!$LB$61<>\"\",UR_Data!$LB$61,\"\")","v":"•  Vergiftungen (allg.), Alkohol-, Schlaf- und Beruhigungsmittelvergiftung,\n   Vergiftungen durch Drogen, Heroin, Weckamine, Vergiftungen mit Gasen\n   und Dämpfen, Vergiftungen mit Kontaktgiften, Kontakt mit Phosphor"},{"$f":"IF(UR_Data!$LB$64<>\"\",UR_Data!$LB$64,\"\")","v":"•   Vergiftungen durch Injektionen und Tierbisse, Schock (allgemein), \n    Volumenmangelschock, Kardiogener Schock, Neurogener Schock, \n    Vasovagale Synkope, Anaphylaktischer Schock"},{"$f":"IF(UR_Data!$LB$67<>\"\",UR_Data!$LB$67,\"\")","v":"•  Schaufeltrage, mögl. zum Einsatz der Schaufeltrage, Vakuummatratze,\n   Einsatz der Vakuummatratze, CombiCarrier, Besonderheiten des \n   CombiCarrier, Spineboard, praktisches Vorgehen an Land"},{"$f":"IF(UR_Data!$LB$70<>\"\",UR_Data!$LB$70,\"\")","v":"•  Anatomie des Schädels, Gewalteinwirkung auf den Kopf, Schädel-Hirn-\n   Trauma, Helmabnahme, Wirbelsäulenbruch, Beckenbruch, \n   Beckenbruchstabilisierungsgurt (T-POD), Polytrauma"},{"$f":"IF(UR_Data!$LB$73<>\"\",UR_Data!$LB$73,\"\")","v":"•  Hygiene, Hygiene im Einsatz, Desinfektionsplan, Anwendungshinweise für \n   die Desinfektion, Herstellung einer Desinfektionslösung, Abfallbeseitigung\n"},{"$f":"IF(UR_Data!$LB$76<>\"\",UR_Data!$LB$76,\"\")","v":"•  Sanitätseinsätze, Rettungsdienststrukturen, Der DLRG-Sanitäter bei \n   Großeinsätzen, Registrierung von Patienten\n"},{"$f":"IF(UR_Data!$LB$79<>\"\",UR_Data!$LB$79,\"\")","v":""},{"$f":"IF(UR_Data!$LB$82<>\"\",UR_Data!$LB$82,\"\")","v":""},{"$f":"IF(UR_Data!$LB$83<>\"\",UR_Data!$LB$83,\"\")","v":""},{"$f":"IF(UR_Data!$LB$84<>\"\",UR_Data!$LB$84,\"\")","v":""},null,null,null,null,null,null,null,null,null,null,null,null,null,null,null,null,null,null,{"$f":"IF(UR_Data!$LB$86<>\"\",UR_Data!$LB$86,\"\")","v":"Die hier aufgeführten Themen wurden ausschließlich von pädagogisch und fachlich geeigneten Lehrkräften erteilt."}," "]
[14,0,"","","",null,null,{"$f":"IF(UR_Data!$MB$49<>\"\",UR_Data!$MB$49,\"\")","v":""},{"$f":"IF(UR_Data!$MB$50<>\"\",UR_Data!$MB$50,\"\")","v":""},{"$f":"IF(UR_Data!$MB$51<>\"\",UR_Data!$MB$51,\"\")","v":""},{"$f":"IF(UR_Data!$MB$52<>\"\",UR_Data!$MB$52,\"\")","v":""},{"$f":"IF(UR_Data!$MB$53<>\"\",UR_Data!$MB$53,\"\")","v":""},{"$f":"IF(UR_Data!$MB$54<>\"\",UR_Data!$MB$54,\"\")","v":""},{"$f":"IF(UR_Data!$MB$55<>\"\",UR_Data!$MB$55,\"\")","v":""},{"$f":"IF(UR_Data!$MB$56<>\"\",UR_Data!$MB$56,\"\")","v":""},{"$f":"IF(UR_Data!$MB$57<>\"\",UR_Data!$MB$57,\"\")","v":""},{"$f":"IF(UR_Data!$MB$58<>\"\",UR_Data!$MB$58,\"\")","v":""},{"$f":"IF(UR_Data!$MB$59<>\"\",UR_Data!$MB$59,\"\")","v":""},{"$f":"IF(UR_Data!$MB$60<>\"\",UR_Data!$MB$60,\"\")","v":""},{"$f":"IF(UR_Data!$MB$62<>\"\",UR_Data!$MB$62,\"\")","v":""},{"$f":"IF(UR_Data!$MB$62<>\"\",UR_Data!$MB$62,\"\")","v":""},{"$f":"IF(UR_Data!$MB$66<>\"\",UR_Data!$MB$66,\"\")","v":""},{"$f":"IF(UR_Data!$MB$67<>\"\",UR_Data!$MB$67,\"\")","v":""},{"$f":"IF(UR_Data!$MB$68<>\"\",UR_Data!$MB$68,\"\")","v":""},{"$f":"IF(UR_Data!$MB$69<>\"\",UR_Data!$MB$69,\"\")","v":""},{"$f":"IF(UR_Data!$MB$70<>\"\",UR_Data!$MB$70,\"\")","v":""},{"$f":"IF(UR_Data!$MB$71<>\"\",UR_Data!$MB$71,\"\")","v":""},{"$f":"IF(UR_Data!$MB$72<>\"\",UR_Data!$MB$72,\"\")","v":""},{"$f":"IF(UR_Data!$MB$73<>\"\",UR_Data!$MB$73,\"\")","v":""},{"$f":"IF(UR_Data!$MB$74<>\"\",UR_Data!$MB$74,\"\")","v":""},{"$f":"IF(UR_Data!$MB$75<>\"\",UR_Data!$MB$75,\"\")","v":""},{"$f":"IF(UR_Data!$MB$76<>\"\",UR_Data!$MB$76,\"\")","v":""},{"$f":"IF(UR_Data!$MB$77<>\"\",UR_Data!$MB$77,\"\")","v":""},{"$f":"IF(UR_Data!$MB$78<>\"\",UR_Data!$MB$78,\"\")","v":""},{"$f":"IF(UR_Data!$MB$79<>\"\",UR_Data!$MB$79,\"\")","v":""},{"$f":"IF(UR_Data!$MB$80<>\"\",UR_Data!$MB$80,\"\")","v":""},{"$f":"IF(UR_Data!$MB$81<>\"\",UR_Data!$MB$81,\"\")","v":""},{"$f":"IF(UR_Data!$MB$82<>\"\",UR_Data!$MB$82,\"\")","v":""},{"$f":"IF(UR_Data!$MB$83<>\"\",UR_Data!$MB$83,\"\")","v":""},{"$f":"IF(UR_Data!$MB$84<>\"\",UR_Data!$MB$84,\"\")","v":""},null," ",null," "," "]
[15,0,"Ausbildungsnachweis","RUND-Grundkurs","(Realistische Unfall- und Notfall-Darstellung)",{"$f":"CONCATENATE(VLOOKUP(Urkunde_1!$AG$4,Data_PD!$A$4:$U$23,4,FALSE),\" – \",VLOOKUP(Urkunde_1!$AG$4,Data_PD!$A$4:$U$23,5,FALSE),\" | \",Doku!$Y$26)","v":{"$error":"#N/A"}},{"$f":"CONCATENATE(VLOOKUP(Urkunde_2!$AG$4,Data_PD!$A$4:$U$23,4,FALSE),\" – \",VLOOKUP(Urkunde_2!$AG$4,Data_PD!$A$4:$U$23,5,FALSE),\" | \",Doku!$Y$26)","v":{"$error":"#N/A"}},{"$f":"IF(UR_Data!$NB$47<>\"\",UR_Data!$NB$47,\"\")","v":"Folgende Inhalte wurden im RUND-Grundkurs vermittelt:"},{"$f":"IF(UR_Data!$NB$49<>\"\",UR_Data!$NB$49,\"\")","v":"•  Geschichte der Realistischen Unfall- und Notfall-Darstellung\n•  Einsatzmöglichkeiten der RUND\n•  Struktur der RUND"},{"$f":"IF(UR_Data!$NB$52<>\"\",UR_Data!$NB$52,\"\")","v":"•  Abbau der Hemmschwelle\n•  Schauspielerische Schulung\n•  Verletzungsorientierung"},{"$f":"IF(UR_Data!$NB$55<>\"\",UR_Data!$NB$55,\"\")","v":"•  Verletzungsorientierte Gebärden\n•  Probleme bei der Darstellung\n•  Dauer der RUND-Darstellung"},{"$f":"IF(UR_Data!$NB$58<>\"\",UR_Data!$NB$58,\"\")","v":"•  Sicherheit bei der RUND-Darstellung\n•  Sicherheitsrelevante Gebärden\n•  Grundausstattung der RUND"},{"$f":"IF(UR_Data!$NB$61<>\"\",UR_Data!$NB$61,\"\")","v":"•  Schmink- und Darstellungskunde\n•  Notruf\n•  Nachbesprechung"},{"$f":"IF(UR_Data!$NB$64<>\"\",UR_Data!$NB$64,\"\")","v":"•  Vertiefung des Erlernten\n•  Materialpflege\n"},{"$f":"IF(UR_Data!$NB$67<>\"\",UR_Data!$NB$67,\"\")","v":""},{"$f":"IF(UR_Data!$NB$70<>\"\",UR_Data!$NB$70,\"\")","v":""},{"$f":"IF(UR_Data!$NB$73<>\"\",UR_Data!$NB$73,\"\")","v":""},{"$f":"IF(UR_Data!$NB$76<>\"\",UR_Data!$NB$76,\"\")","v":""},{"$f":"IF(UR_Data!$NB$79<>\"\",UR_Data!$NB$79,\"\")","v":""},{"$f":"IF(UR_Data!$NB$82<>\"\",UR_Data!$NB$82,\"\")","v":""},{"$f":"IF(UR_Data!$NB$83<>\"\",UR_Data!$NB$83,\"\")","v":""},{"$f":"IF(UR_Data!$NB$84<>\"\",UR_Data!$NB$84,\"\")","v":""},{"$f":"IF(UR_Data!$NB$67<>\"\",UR_Data!$NB$67,\"\")","v":""},{"$f":"IF(UR_Data!$NB$68<>\"\",UR_Data!$NB$68,\"\")","v":""},{"$f":"IF(UR_Data!$NB$69<>\"\",UR_Data!$NB$69,\"\")","v":""},{"$f":"IF(UR_Data!$NB$70<>\"\",UR_Data!$NB$70,\"\")","v":""},{"$f":"IF(UR_Data!$NB$71<>\"\",UR_Data!$NB$71,\"\")","v":""},{"$f":"IF(UR_Data!$NB$72<>\"\",UR_Data!$NB$72,\"\")","v":""},{"$f":"IF(UR_Data!$NB$73<>\"\",UR_Data!$NB$73,\"\")","v":""},{"$f":"IF(UR_Data!$NB$74<>\"\",UR_Data!$NB$74,\"\")","v":""},{"$f":"IF(UR_Data!$NB$75<>\"\",UR_Data!$NB$75,\"\")","v":""},{"$f":"IF(UR_Data!$NB$76<>\"\",UR_Data!$NB$76,\"\")","v":""},{"$f":"IF(UR_Data!$NB$77<>\"\",UR_Data!$NB$77,\"\")","v":""},{"$f":"IF(UR_Data!$NB$78<>\"\",UR_Data!$NB$78,\"\")","v":""},{"$f":"IF(UR_Data!$NB$79<>\"\",UR_Data!$NB$79,\"\")","v":""},{"$f":"IF(UR_Data!$NB$80<>\"\",UR_Data!$NB$80,\"\")","v":""},{"$f":"IF(UR_Data!$NB$81<>\"\",UR_Data!$NB$81,\"\")","v":""},{"$f":"IF(UR_Data!$NB$82<>\"\",UR_Data!$NB$82,\"\")","v":""},{"$f":"IF(UR_Data!$NB$83<>\"\",UR_Data!$NB$83,\"\")","v":""},{"$f":"IF(UR_Data!$NB$84<>\"\",UR_Data!$NB$84,\"\")","v":""},{"$f":"IF(UR_Data!$NB$86<>\"\",UR_Data!$NB$86,\"\")","v":"Die hier aufgeführten Themen wurden ausschließlich von pädagogisch und fachlich geeigneten Lehrkräften erteilt."}," ",null," "," "]
[16,0,"Ausbildungsnachweis","RUND-Aufbaukurs","(Realistische Unfall- und Notfall-Darstellung)",{"$f":"CONCATENATE(VLOOKUP(Urkunde_1!$AG$4,Data_PD!$A$4:$U$23,4,FALSE),\" – \",VLOOKUP(Urkunde_1!$AG$4,Data_PD!$A$4:$U$23,5,FALSE),\" | \",Doku!$Y$26)","v":{"$error":"#N/A"}},{"$f":"CONCATENATE(VLOOKUP(Urkunde_2!$AG$4,Data_PD!$A$4:$U$23,4,FALSE),\" – \",VLOOKUP(Urkunde_2!$AG$4,Data_PD!$A$4:$U$23,5,FALSE),\" | \",Doku!$Y$26)","v":{"$error":"#N/A"}},{"$f":"IF(UR_Data!$OB$47<>\"\",UR_Data!$OB$47,\"\")","v":"Folgende Inhalte wurden im RUND-Aufbaukurs vermittelt:"},{"$f":"IF(UR_Data!$OB$49<>\"\",UR_Data!$OB$49,\"\")","v":"•  Struktur der RUND\n•  Schadensereignisse\n•  Begriffe im Katastrophenschutz"},{"$f":"IF(UR_Data!$OB$52<>\"\",UR_Data!$OB$52,\"\")","v":"•  Anhängekarte für Verletzte/Kranke\n•  Verlängerung der RUND-Darstellung\n•  Blutdruck"},{"$f":"IF(UR_Data!$OB$55<>\"\",UR_Data!$OB$55,\"\")","v":"•  Beatmungshilfen\n•  Sauerstoff\n•  Venöse Punktion"},{"$f":"IF(UR_Data!$OB$58<>\"\",UR_Data!$OB$58,\"\")","v":"•  Defibrillatoren\n•  Geräte zur Immobilisation\n•  Rettungsgeräte für den Transport"},{"$f":"IF(UR_Data!$OB$61<>\"\",UR_Data!$OB$61,\"\")","v":"•  Verfeinerung der Schminktechniken\n•  Schmink- und Darstellungskunde I\n•  Gebärdensprache innerhalb der RUND"},{"$f":"IF(UR_Data!$OB$64<>\"\",UR_Data!$OB$64,\"\")","v":"•  Schmink- und Darstellungskunde II\n•  Requisiten\n•  Szenarien"},{"$f":"IF(UR_Data!$OB$67<>\"\",UR_Data!$OB$67,\"\")","v":"•  Rechtliche Grundlagen\n•  Versicherungen\n•  Sicherheit bei der RUND-Darstellung"},{"$f":"IF(UR_Data!$OB$70<>\"\",UR_Data!$OB$70,\"\")","v":"•  Feedback\n\n"},{"$f":"IF(UR_Data!$OB$73<>\"\",UR_Data!$OB$73,\"\")","v":""},{"$f":"IF(UR_Data!$OB$76<>\"\",UR_Data!$OB$76,\"\")","v":""},{"$f":"IF(UR_Data!$OB$79<>\"\",UR_Data!$OB$79,\"\")","v":""},{"$f":"IF(UR_Data!$OB$82<>\"\",UR_Data!$OB$82,\"\")","v":""},{"$f":"IF(UR_Data!$OB$83<>\"\",UR_Data!$OB$83,\"\")","v":""},{"$f":"IF(UR_Data!$OB$84<>\"\",UR_Data!$OB$84,\"\")","v":""},null,null,null,null,null,null,null,null,null,null,null,null,null,null,null,null,null,null,{"$f":"IF(UR_Data!$OB$86<>\"\",UR_Data!$OB$86,\"\")","v":"Die hier aufgeführten Themen wurden ausschließlich von pädagogisch und fachlich geeigneten Lehrkräften erteilt."},"  ",null," "," "]
[17,0,"","","",null,null," ",null,null,null,null,null,null,null,null,null,null,null,null," ",null,null,null,null,null,null,null,null,null,null,null,null,null,null,null,null,null,null,null,null," ",null," "," "]
[18,0,"Fortbildungsnachweis","Sanitätsfortbildung","",{"$f":"CONCATENATE(VLOOKUP(Urkunde_1!$AG$4,Data_PD!$A$4:$U$23,4,FALSE),\" – \",VLOOKUP(Urkunde_1!$AG$4,Data_PD!$A$4:$U$23,5,FALSE),\" | \",Doku!$Y$26)","v":{"$error":"#N/A"}},{"$f":"CONCATENATE(VLOOKUP(Urkunde_2!$AG$4,Data_PD!$A$4:$U$23,4,FALSE),\" – \",VLOOKUP(Urkunde_2!$AG$4,Data_PD!$A$4:$U$23,5,FALSE),\" | \",Doku!$Y$26)","v":{"$error":"#N/A"}},"•  Erste Hilfe-Ausbilder Urkunde (381)","•  Evtl. Ausbildungsnachweis Erste Hilfe-Schulung","   in Bildungs-und Betreuungseinrichtungen für Kinder"," "," "," "," "," "," "," "," "," ",null," ",null,null,null,null,null,null,null,null,null,null,null,null,null,null,null,null,null,null,null,{"$f":"IF(UR_Data!$QB$86<>\"\",UR_Data!$QB$86,\"\")","v":"Die Inhalte dieser Fortbildung wurden ausschließliche von pädagogisch und fachlich geeigneten Lehrkräften erteilt."}," ",null," "," "]
[19,0,"","",""]
[20,0,"","",""]
[null,{"$f":"SUM(B30:B49)","v":0}]
[]
[]
["Bescheinigung Dozent"]
[1,2,3,4,5,6,7,8,9,10,11,12,13,14,15,16,17,18,19,20,21,22,23,24,15,26,27,28,29,30,31,32,33,34,35,36,37,38,39,40,41,42,43,44,45]
["Nr.","Nr. V","Bezeichnung","Name","Text 1","Lehrgang","Lehrgangsart","Im Auftrag des ","Umgang","Umgang Text","Lehrgangsform","PO.-Nr.: ","Datum"]
[1,{"$f":"IF(D_H_A!$AG$4=A56,D_H_A!$AG$4,0)","v":0},"Bescheinigung über die Tätigkeit als Dozent",{"$f":"IF(Doku!Y28<>\"\",Doku!Y28,\"\")","v":""},"hat referiert im Lehrgang",{"$f":"VLOOKUP(D_H_A!$AG$1,$A$4:$AO$23,4,FALSE)","v":{"$error":"#N/A"}},{"$f":"VLOOKUP(D_H_A!$AG$1,Data_LD!$A$4:$W$23,8,FALSE)","v":{"$error":"#N/A"}},{"$f":"W4","v":" •  •  "},{"$f":"CONCATENATE(\"Der gesamte Lehrgang umfasste \",VLOOKUP(D_H_A!$AG$1,Data_LD!$A$2:$T$23,10,FALSE),\" Lerneinheiten\")","v":{"$error":"#N/A"}},"(1 LE = 45 Minuten)",{"$f":"VLOOKUP(D_H_A!$AG$1,Data_LD!$A$4:$W$23,6,FALSE)","v":{"$error":"#N/A"}},{"$f":"VLOOKUP(D_H_A!$AG$1,Data_LD!$A$4:$W$23,3,FALSE)","v":{"$error":"#N/A"}},{"$f":"CONCATENATE(Start!$K$20,\", \",TEXT(Doku!$CC$34+2,\"TT.MM.JJJJ\"))","v":", 02.01.1900"}]
[2,{"$f":"IF(D_H_A!$AG$4=A57,D_H_A!$AG$4,0)","v":0},"Bescheinigung über die Tätigkeit als Dozent",{"$f":"IF(Doku!Y30<>\"\",Doku!Y30,\"\")","v":""},"hat referiert im Lehrgang",{"$f":"VLOOKUP(D_H_A!$AG$1,$A$4:$AO$23,4,FALSE)","v":{"$error":"#N/A"}},{"$f":"VLOOKUP(D_H_A!$AG$1,Data_LD!$A$4:$W$23,8,FALSE)","v":{"$error":"#N/A"}},{"$f":"W5","v":" •  •  "},{"$f":"CONCATENATE(\"Der gesamte Lehrgang umfasste \",VLOOKUP(D_H_A!$AG$1,Data_LD!$A$2:$T$23,10,FALSE),\" Lerneinheiten\")","v":{"$error":"#N/A"}},"(1 LE = 45 Minuten)",{"$f":"VLOOKUP(D_H_A!$AG$1,Data_LD!$A$4:$W$23,6,FALSE)","v":{"$error":"#N/A"}},{"$f":"VLOOKUP(D_H_A!$AG$1,Data_LD!$A$4:$W$23,3,FALSE)","v":{"$error":"#N/A"}},{"$f":"CONCATENATE(Start!$K$20,\", \",TEXT(Doku!$CC$34+2,\"TT.MM.JJJJ\"))","v":", 02.01.1900"}]
[3,{"$f":"IF(D_H_A!$AG$4=A58,D_H_A!$AG$4,0)","v":3},"Bescheinigung über eine Hospitation/Assistenz",{"$f":"IF(Doku!CC30<>\"\",Doku!CC30,\"\")","v":""},"hat hospitiert und/oder assistiert im Lehrgang",{"$f":"VLOOKUP(D_H_A!$AG$1,$A$4:$AO$23,4,FALSE)","v":{"$error":"#N/A"}},{"$f":"VLOOKUP(D_H_A!$AG$1,Data_LD!$A$4:$W$23,8,FALSE)","v":{"$error":"#N/A"}},{"$f":"W6","v":" •  •  "},{"$f":"CONCATENATE(\"Der gesamte Lehrgang umfasste \",VLOOKUP(D_H_A!$AG$1,Data_LD!$A$2:$T$23,10,FALSE),\" Lerneinheiten\")","v":{"$error":"#N/A"}},"(1 LE = 45 Minuten)",{"$f":"VLOOKUP(D_H_A!$AG$1,Data_LD!$A$4:$W$23,6,FALSE)","v":{"$error":"#N/A"}},{"$f":"VLOOKUP(D_H_A!$AG$1,Data_LD!$A$4:$W$23,3,FALSE)","v":{"$error":"#N/A"}},{"$f":"CONCATENATE(Start!$K$20,\", \",TEXT(Doku!$CC$34+2,\"TT.MM.JJJJ\"))","v":", 02.01.1900"}]
[4,{"$f":"IF(D_H_A!$AG$4=A59,D_H_A!$AG$4,0)","v":0},"Bescheinigung über eine Hospitation/Assistenz",{"$f":"IF(Doku!Y32<>\"\",Doku!Y32,\"\")","v":""},"hat hospitiert und/oder assistiert im Lehrgang",{"$f":"VLOOKUP(D_H_A!$AG$1,$A$4:$AO$23,4,FALSE)","v":{"$error":"#N/A"}},{"$f":"VLOOKUP(D_H_A!$AG$1,Data_LD!$A$4:$W$23,8,FALSE)","v":{"$error":"#N/A"}},{"$f":"W7","v":" •  •  "},{"$f":"CONCATENATE(\"Der gesamte Lehrgang umfasste \",VLOOKUP(D_H_A!$AG$1,Data_LD!$A$2:$T$23,10,FALSE),\" Lerneinheiten\")","v":{"$error":"#N/A"}},"(1 LE = 45 Minuten)",{"$f":"VLOOKUP(D_H_A!$AG$1,Data_LD!$A$4:$W$23,6,FALSE)","v":{"$error":"#N/A"}},{"$f":"VLOOKUP(D_H_A!$AG$1,Data_LD!$A$4:$W$23,3,FALSE)","v":{"$error":"#N/A"}},{"$f":"CONCATENATE(Start!$K$20,\", \",TEXT(Doku!$CC$34+2,\"TT.MM.JJJJ\"))","v":", 02.01.1900"}]
[null,{"$f":"SUM(B56:B59)","v":3}]
[]
[]
[null,"Nr.","Name"]
[null,1,{"$f":"IF(D56<>\"\",D56,\"\")","v":""}]
[null,2,{"$f":"IF(D57<>\"\",D57,\"\")","v":""}]
[null,3,""]
[null,4,""]
[]
[null,null,null,null,{"$f":"IF(B73<>0,IF(Start!#REF!=\"X\",\"DGUV\",IF(Start!#REF!=\"X\",\"FeV\",IF(Start!#REF!=\"X\",\"DLRG\",\"\"))),\"\")","v":""}]
["Urkunde 0"]
[1,2,3,4,5,6,7,8,9,10,11,12,13,14,15,16,17,18,19,20,21,22,23,24,25,26,27,28,29,30,31,32,33,34,35,36,37,38,19,40,41,42,43,44,45]
["Nr.","Nr. V","Form","Lehrgangsart","Orga","PO-Nr.","Titel","Subtitel","Text 1","Text 2","Adresse","Kennziffer QSEH","Kennziffer Text","FeV Behörde","FeV-Aktenzeichen","FeV Datum","FEV anerkannte Stelle","Gl.-Nr.","Gliederung","Stelle ?","Lehrgangs-Nr.","Lehrgangs-Nr. Text","Bildungsort"]
[1,{"$f":"IF(Start!$I$9=A73,A73,0)","v":0},{"$f":"IF(Data_TNB!D4<>\"\",Data_TNB!D4,\"\")","v":"Teilnahmebescheinigung"},{"$f":"IF(Data_TNB!E4<>\"\",Data_TNB!E4,\"\")","v":"Ausbildung"},{"$f":"IF(Data_TNB!C4<>\"\",Data_TNB!C4,\"\")","v":"DGUV"},{"$f":"IF(Data_TNB!F4<>\"\",Data_TNB!F4,\"\")","v":312},{"$f":"IF(Data_TNB!G4<>\"\",Data_TNB!G4,\"\")","v":"Erste-Hilfe-Ausbildung"},{"$f":"IF(Data_TNB!H4<>\"\",Data_TNB!H4,\"\")","v":"für betriebliche Ersthelfende | EH-Schulung gemäß § 19 FeV"},{"$f":"IF(Data_TNB!I4<>\"\",Data_TNB!I4,\"\")","v":"hat an dem 9 Lerneinheiten (à 45 Min.) umfassenden Lehrgang in der Zeit"},"Die Ausbildung entspricht den Gemeinsamen Grundsätzen der Bundesarbeitsgemeinschaft Erste Hilfe (BAGEH), sowie dem DGUV Grundsatz 304-001. Die Teilnahme an dieser Ausbildung gilt auch als Schulung in Erster Hilfe gemäß § 19 der Fahrerlaubnis-Verordnung (FeV).",{"$f":"IF(C73<>\"\",CONCATENATE(Start!$K$14,\" • \",Start!$K$16,\" • \",Start!$K$18,\" \",Start!$K$20,\" – \",TEXT(R73,\"00 00 000\")),\"\")","v":" •  •   – 00 00 000"},{"$f":"IF(C73<>\"\",Start!$N$25,\"\")","v":0},{"$f":"IF(C73<>\"\",CONCATENATE(\"Kennziffer der ermächtigten Stelle gemäß § 26 DGUV Vorschrift 1 – \",L73),\"\")","v":"Kennziffer der ermächtigten Stelle gemäß § 26 DGUV Vorschrift 1 – 0"},{"$f":"IF(C73<>\"\",Start!$J$28,\"\")","v":0},{"$f":"IF(C73<>\"\",Start!$L$28,\"\")","v":0},{"$f":"IF(C73<>\"\",TEXT(Start!$N$28,\"TT.MM.JJJJ\"),\"\")","v":"00.01.1900"},{"$f":"IF(C73<>\"\",CONCATENATE(\"Anerkannte Stelle gemäß § 68 FeV\",\" – \",Z4,\" | \",AA4,\" | \",AB4),\"\")","v":"Anerkannte Stelle gemäß § 68 FeV – 0 | 0 | 00.01.1900"},{"$f":"IF(C73<>\"\",TEXT(Start!$P$18,\"00 00 000\"),\"\")","v":"00 00 000"},{"$f":"IF(C73<>\"\",CONCATENATE(Start!$K$14,\" – Leitung Medizin – \",TEXT(R73,\"00 00 000\")),\"\")","v":" – Leitung Medizin – 00 00 000"},{"$f":"VLOOKUP(E73,A97:B99,2,FALSE)","v":"Kennziffer der ermächtigten Stelle gemäß § 26 DGUV Vorschrift 1 – 0"},{"$f":"IF(C73<>\"\",Doku!$Y$26,\"\")","v":0},{"$f":"IF(C73<>\"\",CONCATENATE(\"Die \",D73,\" wurde unter der Lehrgangsnummer \",U73,\" erfasst.\"),\"\")","v":"Die Ausbildung wurde unter der Lehrgangsnummer 0 erfasst."},{"$f":"IF(C73<>\"\",IF(D73=\"Ausbildung\",\"Ausbildungsort\",IF(D73=\"Fortbildung\",\"Fortbildungsort\",\"\")),\"\")","v":"Ausbildungsort"},{"$f":"IF(V73=\"Ausbildung\",W73,\"\")","v":""}]
[2,{"$f":"IF(Start!$I$9=A74,A74,0)","v":0},{"$f":"IF(Data_TNB!D5<>\"\",Data_TNB!D5,\"\")","v":"Teilnahmebescheinigung"},{"$f":"IF(Data_TNB!E5<>\"\",Data_TNB!E5,\"\")","v":"Schulung"},{"$f":"IF(Data_TNB!C5<>\"\",Data_TNB!C5,\"\")","v":"DGUV"},{"$f":"IF(Data_TNB!F5<>\"\",Data_TNB!F5,\"\")","v":315},{"$f":"IF(Data_TNB!G5<>\"\",Data_TNB!G5,\"\")","v":"Erste-Hilfe-Schulung"},{"$f":"IF(Data_TNB!H5<>\"\",Data_TNB!H5,\"\")","v":"in Bildungs- und Betreuungseinrichtungen für Kinder"},{"$f":"IF(Data_TNB!I5<>\"\",Data_TNB!I5,\"\")","v":"hat an dem 9 Lerneinheiten (à 45 Min.) umfassenden Lehrgang in der Zeit"},"Die Schulung entspricht dem DGUV Grundsatz 304-001. Sie ist eine spezielle Schulung für Lehr- und Betreuungspersonal, um auf Notfälle, die in Schulen und Betreuungseinrichtungen auftreten können, vorbereitet zu sein.",{"$f":"IF(C74<>\"\",CONCATENATE(Start!$K$14,\" • \",Start!$K$16,\" • \",Start!$K$18,\" \",Start!$K$20,\" – \",TEXT(R74,\"00 00 000\")),\"\")","v":" •  •   – 00 00 000"},{"$f":"IF(C74<>\"\",Start!$N$25,\"\")","v":0},{"$f":"IF(C74<>\"\",CONCATENATE(\"Kennziffer der ermächtigten Stelle gemäß § 26 DGUV Vorschrift 1 – \",L74),\"\")","v":"Kennziffer der ermächtigten Stelle gemäß § 26 DGUV Vorschrift 1 – 0"},{"$f":"IF(C74<>\"\",Start!$J$28,\"\")","v":0},{"$f":"IF(C74<>\"\",Start!$L$28,\"\")","v":0},{"$f":"IF(C74<>\"\",TEXT(Start!$N$28,\"TT.MM.JJJJ\"),\"\")","v":"00.01.1900"},{"$f":"IF(C74<>\"\",CONCATENATE(\"Anerkannte Stelle gemäß § 68 FeV\",\" – \",Z5,\" | \",AA5,\" | \",AB5),\"\")","v":"Anerkannte Stelle gemäß § 68 FeV – 0 | 0 | 00.01.1900"},{"$f":"IF(C74<>\"\",TEXT(Start!$P$18,\"00 00 000\"),\"\")","v":"00 00 000"},{"$f":"IF(C74<>\"\",CONCATENATE(Start!$K$14,\" – Leitung Medizin – \",TEXT(R74,\"00 00 000\")),\"\")","v":" – Leitung Medizin – 00 00 000"},{"$f":"IF(C74>=0,IF(Start!$N$25<>0,M74,IF(Start!$J$28<>\"\",Q74,IF(Start!$N$25&Start!$J$28<>0,S74,\"\"))))","v":" – Leitung Medizin – 00 00 000"},{"$f":"IF(C74<>\"\",Doku!$Y$26,\"\")","v":0},{"$f":"IF(C74<>\"\",CONCATENATE(\"Die \",D74,\" wurde unter der Lehrgangsnummer \",U74,\" erfasst.\"),\"\")","v":"Die Schulung wurde unter der Lehrgangsnummer 0 erfasst."},{"$f":"IF(C74<>\"\",IF(D74=\"Ausbildung\",\"Ausbildungsort\",IF(D74=\"Fortbildung\",\"Fortbildungsort\",\"\")),\"\")","v":""}]
[3,{"$f":"IF(Start!$I$9=A75,A75,0)","v":0},{"$f":"IF(Data_TNB!D6<>\"\",Data_TNB!D6,\"\")","v":"Teilnahmebescheinigung"},{"$f":"IF(Data_TNB!E6<>\"\",Data_TNB!E6,\"\")","v":"Fortbildung"},{"$f":"IF(Data_TNB!C6<>\"\",Data_TNB!C6,\"\")","v":"DGUV"},{"$f":"IF(Data_TNB!F6<>\"\",Data_TNB!F6,\"\")","v":321},{"$f":"IF(Data_TNB!G6<>\"\",Data_TNB!G6,\"\")","v":"Erste-Hilfe-Fortbildung"},{"$f":"IF(Data_TNB!H6<>\"\",Data_TNB!H6,\"\")","v":"für betriebliche Ersthelfende"},{"$f":"IF(Data_TNB!I6<>\"\",Data_TNB!I6,\"\")","v":"hat an dem 9 Lerneinheiten (à 45 Min.) umfassenden Lehrgang in der Zeit"},"Die Ausbildungsinhalte entsprechen dem aktuellen wissenschaftlichen Stand der Kinder- und Jugendmedizin in Deutschalnd sowie der German Resuscitation Council (GRC) und wurden von pädagogisch und fachlich geeigneten Lehrkräften erteilt.",{"$f":"IF(C75<>\"\",CONCATENATE(Start!$K$14,\" • \",Start!$K$16,\" • \",Start!$K$18,\" \",Start!$K$20,\" – \",TEXT(R75,\"00 00 000\")),\"\")","v":" •  •   – 00 00 000"},{"$f":"IF(C75<>\"\",Start!$N$25,\"\")","v":0},{"$f":"IF(C75<>\"\",CONCATENATE(\"Kennziffer der ermächtigten Stelle gemäß § 26 DGUV Vorschrift 1 – \",L75),\"\")","v":"Kennziffer der ermächtigten Stelle gemäß § 26 DGUV Vorschrift 1 – 0"},{"$f":"IF(C75<>\"\",Start!$J$28,\"\")","v":0},{"$f":"IF(C75<>\"\",Start!$L$28,\"\")","v":0},{"$f":"IF(C75<>\"\",TEXT(Start!$N$28,\"TT.MM.JJJJ\"),\"\")","v":"00.01.1900"},"Anerkannte Stelle gemäß § 68 FeV – 0 | 0 | 00.01.1900",{"$f":"IF(C75<>\"\",TEXT(Start!$P$18,\"00 00 000\"),\"\")","v":"00 00 000"},{"$f":"IF(C75<>\"\",CONCATENATE(Start!$K$14,\" – Leitung Medizin – \",TEXT(R75,\"00 00 000\")),\"\")","v":" – Leitung Medizin – 00 00 000"},{"$f":"VLOOKUP(E75,A97:B99,2,FALSE)","v":"Kennziffer der ermächtigten Stelle gemäß § 26 DGUV Vorschrift 1 – 0"},{"$f":"IF(C75<>\"\",Doku!$Y$26,\"\")","v":0},"Die Fortbildung wurde unter der Lehrgangsnummer 0 erfasst.","Fortbildungsort"]
[4,{"$f":"IF(Start!$I$9=A76,A76,0)","v":0},{"$f":"IF(Data_TNB!D7<>\"\",Data_TNB!D7,\"\")","v":""},{"$f":"IF(Data_TNB!E7<>\"\",Data_TNB!E7,\"\")","v":""},{"$f":"IF(Data_TNB!C7<>\"\",Data_TNB!C7,\"\")","v":""},{"$f":"IF(Data_TNB!F7<>\"\",Data_TNB!F7,\"\")","v":""},{"$f":"IF(Data_TNB!G7<>\"\",Data_TNB!G7,\"\")","v":""},{"$f":"IF(Data_TNB!H7<>\"\",Data_TNB!H7,\"\")","v":""},{"$f":"IF(Data_TNB!I7<>\"\",Data_TNB!I7,\"\")","v":""},null,{"$f":"IF(C76<>\"\",CONCATENATE(Start!$K$14,\" • \",Start!$K$16,\" • \",Start!$K$18,\" \",Start!$K$20,\" – \",TEXT(R76,\"00 00 000\")),\"\")","v":""},{"$f":"IF(C76<>\"\",Start!$N$25,\"\")","v":""},null,{"$f":"IF(C76<>\"\",Start!$J$28,\"\")","v":""},{"$f":"IF(C76<>\"\",Start!$L$28,\"\")","v":""},{"$f":"IF(C76<>\"\",TEXT(Start!$N$28,\"TT.MM.JJJJ\"),\"\")","v":""},"",{"$f":"IF(C76<>\"\",TEXT(Start!$P$18,\"00 00 000\"),\"\")","v":""},{"$f":"IF(C76<>\"\",CONCATENATE(Start!$K$14,\" – Leitung Medizin – \",TEXT(R76,\"00 00 000\")),\"\")","v":""},{"$f":"IF(C76>=0,IF(Start!$N$25<>0,M76,IF(Start!$J$28<>\"\",Q76,IF(Start!$N$25&Start!$J$28<>0,S76,\"\"))))","v":""},{"$f":"IF(C76<>\"\",Doku!$Y$26,\"\")","v":""},"",""]
[5,{"$f":"IF(Start!$I$9=A77,A77,0)","v":0},{"$f":"IF(Data_TNB!D8<>\"\",Data_TNB!D8,\"\")","v":"Teilnahmebescheinigung"},{"$f":"IF(Data_TNB!E8<>\"\",Data_TNB!E8,\"\")","v":"Schulung"},{"$f":"IF(Data_TNB!C8<>\"\",Data_TNB!C8,\"\")","v":"FeV"},{"$f":"IF(Data_TNB!F8<>\"\",Data_TNB!F8,\"\")","v":312},{"$f":"IF(Data_TNB!G8<>\"\",Data_TNB!G8,\"\")","v":"Erste-Hilfe-Schulung"},{"$f":"IF(Data_TNB!H8<>\"\",Data_TNB!H8,\"\")","v":"gemäß § 19 Fahrerlaubnis-Verordnung (FeV)"},{"$f":"IF(Data_TNB!I8<>\"\",Data_TNB!I8,\"\")","v":"hat an dem 9 Lerneinheiten (à 45 Min.) umfassenden Lehrgang in der Zeit"},"Die Fortbildung entspricht den Gemeinsamen Grundsätzen der Bundesarbeitsgemeinschaft Erste Hilfe (BAGEH), sowie dem DGUV Grundsatz 304-001. Die Teilnahme an diesem Lehrgang gilt auch als Fortbildung in Erster Hilfe gemäß § 19 der Fahrerlaubnis-Verordnung (FeV).",{"$f":"IF(C77<>\"\",CONCATENATE(Start!$K$14,\" • \",Start!$K$16,\" • \",Start!$K$18,\" \",Start!$K$20,\" – \",TEXT(R77,\"00 00 000\")),\"\")","v":" •  •   – 00 00 000"},{"$f":"IF(C77<>\"\",Start!$N$25,\"\")","v":0},{"$f":"IF(C77<>\"\",CONCATENATE(\"Kennziffer der ermächtigten Stelle gemäß § 26 DGUV Vorschrift 1 – \",L77),\"\")","v":"Kennziffer der ermächtigten Stelle gemäß § 26 DGUV Vorschrift 1 – 0"},{"$f":"IF(C77<>\"\",Start!$J$28,\"\")","v":0},{"$f":"IF(C77<>\"\",Start!$L$28,\"\")","v":0},{"$f":"IF(C77<>\"\",TEXT(Start!$N$28,\"TT.MM.JJJJ\"),\"\")","v":"00.01.1900"},"Anerkannte Stelle gemäß § 68 FeV – 0 | 0 | 00.01.1900",{"$f":"IF(C77<>\"\",TEXT(Start!$P$18,\"00 00 000\"),\"\")","v":"00 00 000"},{"$f":"IF(C77<>\"\",CONCATENATE(Start!$K$14,\" – Leitung Medizin – \",TEXT(R77,\"00 00 000\")),\"\")","v":" – Leitung Medizin – 00 00 000"},{"$f":"VLOOKUP(E77,A97:B99,2,FALSE)","v":"Anerkannte Stelle gemäß § 68 FeV – 0 | 0 | 00.01.1900"},{"$f":"IF(C77<>\"\",Doku!$Y$26,\"\")","v":0},"Die Schulung wurde unter der Lehrgangsnummer 0 erfasst.",""]
[6,{"$f":"IF(Start!$I$9=A78,A78,0)","v":0},{"$f":"IF(Data_TNB!D9<>\"\",Data_TNB!D9,\"\")","v":""},{"$f":"IF(Data_TNB!E9<>\"\",Data_TNB!E9,\"\")","v":""},{"$f":"IF(Data_TNB!C9<>\"\",Data_TNB!C9,\"\")","v":""},{"$f":"IF(Data_TNB!F9<>\"\",Data_TNB!F9,\"\")","v":""},{"$f":"IF(Data_TNB!G9<>\"\",Data_TNB!G9,\"\")","v":""},{"$f":"IF(Data_TNB!H9<>\"\",Data_TNB!H9,\"\")","v":""},{"$f":"IF(Data_TNB!I9<>\"\",Data_TNB!I9,\"\")","v":""},"Diese dient der Reaktivierung und Vertiefung bereits erworbener Kenntnisse und Fertigkeiten aus einer vorherigen Ausbildung, sowie der Vermittlung aktueller Inhalte in der Ersten Hilfe bei Kindernotfällen.",{"$f":"IF(C78<>\"\",CONCATENATE(Start!$K$14,\" • \",Start!$K$16,\" • \",Start!$K$18,\" \",Start!$K$20,\" – \",TEXT(R78,\"00 00 000\")),\"\")","v":""},{"$f":"IF(C78<>\"\",Start!$N$25,\"\")","v":""},{"$f":"IF(C78<>\"\",CONCATENATE(\"Kennziffer der ermächtigten Stelle gemäß § 26 DGUV Vorschrift 1 – \",L78),\"\")","v":""},{"$f":"IF(C78<>\"\",Start!$J$28,\"\")","v":""},{"$f":"IF(C78<>\"\",Start!$L$28,\"\")","v":""},{"$f":"IF(C78<>\"\",TEXT(Start!$N$28,\"TT.MM.JJJJ\"),\"\")","v":""},"",{"$f":"IF(C78<>\"\",TEXT(Start!$P$18,\"00 00 000\"),\"\")","v":""},{"$f":"IF(C78<>\"\",CONCATENATE(Start!$K$14,\" – Leitung Medizin – \",TEXT(R78,\"00 00 000\")),\"\")","v":""},{"$f":"VLOOKUP(E78,A97:B99,2,FALSE)","v":{"$error":"#N/A"}},{"$f":"IF(C78<>\"\",Doku!$Y$26,\"\")","v":""},"",""]
[7,{"$f":"IF(Start!$I$9=A79,A79,0)","v":0},{"$f":"IF(Data_TNB!D10<>\"\",Data_TNB!D10,\"\")","v":"Teilnahmebescheinigung"},{"$f":"IF(Data_TNB!E10<>\"\",Data_TNB!E10,\"\")","v":"Ausbildung"},{"$f":"IF(Data_TNB!C10<>\"\",Data_TNB!C10,\"\")","v":"DLRG"},{"$f":"IF(Data_TNB!F10<>\"\",Data_TNB!F10,\"\")","v":312},{"$f":"IF(Data_TNB!G10<>\"\",Data_TNB!G10,\"\")","v":"Erste-Hilfe-Ausbildung"},{"$f":"IF(Data_TNB!H10<>\"\",Data_TNB!H10,\"\")","v":"gemäß den Gemeinsamen Grundsätzen der BAGEH"},{"$f":"IF(Data_TNB!I10<>\"\",Data_TNB!I10,\"\")","v":"hat an dem 9 Lerneinheiten (à 45 Min.) umfassenden Lehrgang in der Zeit"},null,{"$f":"IF(C79<>\"\",CONCATENATE(Start!$K$14,\" • \",Start!$K$16,\" • \",Start!$K$18,\" \",Start!$K$20,\" – \",TEXT(R79,\"00 00 000\")),\"\")","v":" •  •   – 00 00 000"},{"$f":"IF(C79<>\"\",Start!$N$25,\"\")","v":0},{"$f":"IF(C79<>\"\",CONCATENATE(\"Kennziffer der ermächtigten Stelle gemäß § 26 DGUV Vorschrift = \",L79),\"\")","v":"Kennziffer der ermächtigten Stelle gemäß § 26 DGUV Vorschrift = 0"},{"$f":"IF(C79<>\"\",Start!$J$28,\"\")","v":0},{"$f":"IF(C79<>\"\",Start!$L$28,\"\")","v":0},{"$f":"IF(C79<>\"\",TEXT(Start!$N$28,\"TT.MM.JJJJ\"),\"\")","v":"00.01.1900"},"Anerkannte Stelle gemäß § 68 FeV – 0 | 0 | 00.01.1900",{"$f":"IF(C79<>\"\",TEXT(Start!$P$18,\"00 00 000\"),\"\")","v":"00 00 000"},{"$f":"IF(C79<>\"\",CONCATENATE(Start!$K$14,\" – Leitung Medizin – \",TEXT(R79,\"00 00 000\")),\"\")","v":" – Leitung Medizin – 00 00 000"},{"$f":"IF(C79>=0,IF(Start!$N$25<>0,M79,IF(Start!$J$28<>\"\",Q79,IF(Start!$N$25&Start!$J$28<>0,S79,\"\"))))","v":" – Leitung Medizin – 00 00 000"},{"$f":"IF(C79<>\"\",Doku!$Y$26,\"\")","v":0},{"$f":"IF(C79<>\"\",CONCATENATE(\"Die \",D79,\" wurde unter der Lehrgangsnummer \",U79,\" registriert.\"),\"\")","v":"Die Ausbildung wurde unter der Lehrgangsnummer 0 registriert."},"Ausbildungsort"]
[8,{"$f":"IF(Start!$I$9=A80,A80,0)","v":0},{"$f":"IF(Data_TNB!D11<>\"\",Data_TNB!D11,\"\")","v":"Teilnahmebescheinigung"},{"$f":"IF(Data_TNB!E11<>\"\",Data_TNB!E11,\"\")","v":"Fortbildung"},{"$f":"IF(Data_TNB!C11<>\"\",Data_TNB!C11,\"\")","v":"DLRG"},{"$f":"IF(Data_TNB!F11<>\"\",Data_TNB!F11,\"\")","v":321},{"$f":"IF(Data_TNB!G11<>\"\",Data_TNB!G11,\"\")","v":"Erste-Hilfe-Fortbildung"},{"$f":"IF(Data_TNB!H11<>\"\",Data_TNB!H11,\"\")","v":"gemäß den Gemeinsamen Grundsätzen der BAGEH"},{"$f":"IF(Data_TNB!I11<>\"\",Data_TNB!I11,\"\")","v":"hat an dem 9 Lerneinheiten (à 45 Min.) umfassenden Lehrgang in der Zeit"},null,{"$f":"IF(C80<>\"\",CONCATENATE(Start!$K$14,\" • \",Start!$K$16,\" • \",Start!$K$18,\" \",Start!$K$20,\" – \",TEXT(R80,\"00 00 000\")),\"\")","v":" •  •   – 00 00 000"},{"$f":"IF(C80<>\"\",Start!$N$25,\"\")","v":0},"Kennziffer der ermächtigten Stelle gemäß § 26 DGUV Vorschrift = 0",{"$f":"IF(C80<>\"\",Start!$J$28,\"\")","v":0},{"$f":"IF(C80<>\"\",Start!$L$28,\"\")","v":0},{"$f":"IF(C80<>\"\",TEXT(Start!$N$28,\"TT.MM.JJJJ\"),\"\")","v":"00.01.1900"},"Anerkannte Stelle gemäß § 68 FeV – 0 | 0 | 00.01.1900",{"$f":"IF(C80<>\"\",TEXT(Start!$P$18,\"00 00 000\"),\"\")","v":"00 00 000"},{"$f":"IF(C80<>\"\",CONCATENATE(Start!$K$14,\" – Leitung Medizin – \",TEXT(R80,\"00 00 000\")),\"\")","v":" – Leitung Medizin – 00 00 000"},{"$f":"IF(C80>=0,IF(Start!$N$25<>0,M80,IF(Start!$J$28<>\"\",Q80,IF(Start!$N$25&Start!$J$28<>0,S80,\"\"))))","v":" – Leitung Medizin – 00 00 000"},{"$f":"IF(C80<>\"\",Doku!$Y$26,\"\")","v":0},"Die Fortbildung wurde unter der Lehrgangsnummer 0 registriert.","Fortbildungsort"]
[9,{"$f":"IF(Start!$I$9=A81,A81,0)","v":0},{"$f":"IF(Data_TNB!D12<>\"\",Data_TNB!D12,\"\")","v":"Teilnahmebescheinigung"},{"$f":"IF(Data_TNB!E12<>\"\",Data_TNB!E12,\"\")","v":"Ausbildung"},{"$f":"IF(Data_TNB!C12<>\"\",Data_TNB!C12,\"\")","v":"DLRG"},{"$f":"IF(Data_TNB!F12<>\"\",Data_TNB!F12,\"\")","v":313},{"$f":"IF(Data_TNB!G12<>\"\",Data_TNB!G12,\"\")","v":"Erste Hilfe bei Kindernotfällen"},{"$f":"IF(Data_TNB!H12<>\"\",Data_TNB!H12,\"\")","v":"Erste Hilfe leisten bei akuten Gefahren, Krankheiten und Notfällen"},{"$f":"IF(Data_TNB!I12<>\"\",Data_TNB!I12,\"\")","v":"hat an dem 9 Lerneinheiten (à 45 Min.) umfassenden Lehrgang in der Zeit"},null,{"$f":"IF(C81<>\"\",CONCATENATE(Start!$K$14,\" • \",Start!$K$16,\" • \",Start!$K$18,\" \",Start!$K$20,\" – \",TEXT(R81,\"00 00 000\")),\"\")","v":" •  •   – 00 00 000"},{"$f":"IF(C81<>\"\",Start!$N$25,\"\")","v":0},"Kennziffer der ermächtigten Stelle gemäß § 26 DGUV Vorschrift = 0",{"$f":"IF(C81<>\"\",Start!$J$28,\"\")","v":0},{"$f":"IF(C81<>\"\",Start!$L$28,\"\")","v":0},{"$f":"IF(C81<>\"\",TEXT(Start!$N$28,\"TT.MM.JJJJ\"),\"\")","v":"00.01.1900"},"Anerkannte Stelle gemäß § 68 FeV – 0 | 0 | 00.01.1900",{"$f":"IF(C81<>\"\",TEXT(Start!$P$18,\"00 00 000\"),\"\")","v":"00 00 000"},{"$f":"IF(C81<>\"\",CONCATENATE(Start!$K$14,\" – Leitung Medizin – \",TEXT(R81,\"00 00 000\")),\"\")","v":" – Leitung Medizin – 00 00 000"},{"$f":"IF(C81>=0,IF(Start!$N$25<>0,M81,IF(Start!$J$28<>\"\",Q81,IF(Start!$N$25&Start!$J$28<>0,S81,\"\"))))","v":" – Leitung Medizin – 00 00 000"},{"$f":"IF(C81<>\"\",Doku!$Y$26,\"\")","v":0},"Die Ausbildung wurde unter der Lehrgangsnummer 0 registriert.","Ausbildungsort"]
[10,{"$f":"IF(Start!$I$9=A82,A82,0)","v":0},{"$f":"IF(Data_TNB!D13<>\"\",Data_TNB!D13,\"\")","v":"Teilnahmebescheinigung"},{"$f":"IF(Data_TNB!E13<>\"\",Data_TNB!E13,\"\")","v":"Fortbildung"},{"$f":"IF(Data_TNB!C13<>\"\",Data_TNB!C13,\"\")","v":"DLRG"},{"$f":"IF(Data_TNB!F13<>\"\",Data_TNB!F13,\"\")","v":322},{"$f":"IF(Data_TNB!G13<>\"\",Data_TNB!G13,\"\")","v":"Erste-Hilfe-Fortbildung"},{"$f":"IF(Data_TNB!H13<>\"\",Data_TNB!H13,\"\")","v":"Auffrischung der Kenntnisse Erste Hilfe bei Kindernotfällen"},{"$f":"IF(Data_TNB!I13<>\"\",Data_TNB!I13,\"\")","v":"hat an dem 9 Lerneinheiten (à 45 Min.) umfassenden Lehrgang in der Zeit"},null,{"$f":"IF(C82<>\"\",CONCATENATE(Start!$K$14,\" • \",Start!$K$16,\" • \",Start!$K$18,\" \",Start!$K$20,\" – \",TEXT(R82,\"00 00 000\")),\"\")","v":" •  •   – 00 00 000"},{"$f":"IF(C82<>\"\",Start!$N$25,\"\")","v":0},"Kennziffer der ermächtigten Stelle gemäß § 26 DGUV Vorschrift = 0",{"$f":"IF(C82<>\"\",Start!$J$28,\"\")","v":0},{"$f":"IF(C82<>\"\",Start!$L$28,\"\")","v":0},{"$f":"IF(C82<>\"\",TEXT(Start!$N$28,\"TT.MM.JJJJ\"),\"\")","v":"00.01.1900"},"Anerkannte Stelle gemäß § 68 FeV – 0 | 0 | 00.01.1900",{"$f":"IF(C82<>\"\",TEXT(Start!$P$18,\"00 00 000\"),\"\")","v":"00 00 000"},{"$f":"IF(C82<>\"\",CONCATENATE(Start!$K$14,\" – Leitung Medizin – \",TEXT(R82,\"00 00 000\")),\"\")","v":" – Leitung Medizin – 00 00 000"},{"$f":"IF(C82>=0,IF(Start!$N$25<>0,M82,IF(Start!$J$28<>\"\",Q82,IF(Start!$N$25&Start!$J$28<>0,S82,\"\"))))","v":" – Leitung Medizin – 00 00 000"},{"$f":"IF(C82<>\"\",Doku!$Y$26,\"\")","v":0},"Die Fortbildung wurde unter der Lehrgangsnummer 0 registriert.","Fortbildungsort"]
[11,{"$f":"IF(Start!$I$9=A83,A83,0)","v":0},null,null,null,null,null,null,null,null,{"$f":"IF(C83<>\"\",CONCATENATE(Start!$K$14,\" • \",Start!$K$16,\" • \",Start!$K$18,\" \",Start!$K$20,\" – \",TEXT(R83,\"00 00 000\")),\"\")","v":""},{"$f":"IF(C83<>\"\",Start!$N$25,\"\")","v":""},"",{"$f":"IF(C83<>\"\",Start!$J$28,\"\")","v":""},{"$f":"IF(C83<>\"\",Start!$L$28,\"\")","v":""},{"$f":"IF(C83<>\"\",TEXT(Start!$N$28,\"TT.MM.JJJJ\"),\"\")","v":""},"",{"$f":"IF(C83<>\"\",TEXT(Start!$P$18,\"00 00 000\"),\"\")","v":""},{"$f":"IF(C83<>\"\",CONCATENATE(Start!$K$14,\" – Leitung Medizin – \",TEXT(R83,\"00 00 000\")),\"\")","v":""},{"$f":"IF(C83>=0,IF(Start!$N$25<>0,M83,IF(Start!$J$28<>\"\",Q83,IF(Start!$N$25&Start!$J$28<>0,S83,\"\"))))","v":""},{"$f":"IF(C83<>\"\",Doku!$Y$26,\"\")","v":""},"",""]
[12,{"$f":"IF(Start!$I$9=A84,A84,0)","v":0},null,null,null,null,null,null,null,null,{"$f":"IF(C84<>\"\",CONCATENATE(Start!$K$14,\" • \",Start!$K$16,\" • \",Start!$K$18,\" \",Start!$K$20,\" – \",TEXT(R84,\"00 00 000\")),\"\")","v":""},{"$f":"IF(C84<>\"\",Start!$N$25,\"\")","v":""},"",{"$f":"IF(C84<>\"\",Start!$J$28,\"\")","v":""},{"$f":"IF(C84<>\"\",Start!$L$28,\"\")","v":""},{"$f":"IF(C84<>\"\",TEXT(Start!$N$28,\"TT.MM.JJJJ\"),\"\")","v":""},"",{"$f":"IF(C84<>\"\",TEXT(Start!$P$18,\"00 00 000\"),\"\")","v":""},{"$f":"IF(C84<>\"\",CONCATENATE(Start!$K$14,\" – Leitung Medizin – \",TEXT(R84,\"00 00 000\")),\"\")","v":""},{"$f":"IF(C84>=0,IF(Start!$N$25<>0,M84,IF(Start!$J$28<>\"\",Q84,IF(Start!$N$25&Start!$J$28<>0,S84,\"\"))))","v":""},{"$f":"IF(C84<>\"\",Doku!$Y$26,\"\")","v":""},"",""]
[13,{"$f":"IF(Start!$I$9=A85,A85,0)","v":0},null,null,null,null,null,null,null,null,{"$f":"IF(C85<>\"\",CONCATENATE(Start!$K$14,\" • \",Start!$K$16,\" • \",Start!$K$18,\" \",Start!$K$20,\" – \",TEXT(R85,\"00 00 000\")),\"\")","v":""},{"$f":"IF(C85<>\"\",Start!$N$25,\"\")","v":""},"",{"$f":"IF(C85<>\"\",Start!$J$28,\"\")","v":""},{"$f":"IF(C85<>\"\",Start!$L$28,\"\")","v":""},{"$f":"IF(C85<>\"\",TEXT(Start!$N$28,\"TT.MM.JJJJ\"),\"\")","v":""},"",{"$f":"IF(C85<>\"\",TEXT(Start!$P$18,\"00 00 000\"),\"\")","v":""},{"$f":"IF(C85<>\"\",CONCATENATE(Start!$K$14,\" – Leitung Medizin – \",TEXT(R85,\"00 00 000\")),\"\")","v":""},{"$f":"IF(C85>=0,IF(Start!$N$25<>0,M85,IF(Start!$J$28<>\"\",Q85,IF(Start!$N$25&Start!$J$28<>0,S85,\"\"))))","v":""},{"$f":"IF(C85<>\"\",Doku!$Y$26,\"\")","v":""},"",""]
[14,{"$f":"IF(Start!$I$9=A86,A86,0)","v":0},null,null,null,null,null,null,null,null,{"$f":"IF(C86<>\"\",CONCATENATE(Start!$K$14,\" • \",Start!$K$16,\" • \",Start!$K$18,\" \",Start!$K$20,\" – \",TEXT(R86,\"00 00 000\")),\"\")","v":""},{"$f":"IF(C86<>\"\",Start!$N$25,\"\")","v":""},"",{"$f":"IF(C86<>\"\",Start!$J$28,\"\")","v":""},{"$f":"IF(C86<>\"\",Start!$L$28,\"\")","v":""},{"$f":"IF(C86<>\"\",TEXT(Start!$N$28,\"TT.MM.JJJJ\"),\"\")","v":""},"",{"$f":"IF(C86<>\"\",TEXT(Start!$P$18,\"00 00 000\"),\"\")","v":""},{"$f":"IF(C86<>\"\",CONCATENATE(Start!$K$14,\" – Leitung Medizin – \",TEXT(R86,\"00 00 000\")),\"\")","v":""},{"$f":"IF(C86>=0,IF(Start!$N$25<>0,M86,IF(Start!$J$28<>\"\",Q86,IF(Start!$N$25&Start!$J$28<>0,S86,\"\"))))","v":""},{"$f":"IF(C86<>\"\",Doku!$Y$26,\"\")","v":""},"",""]
[15,{"$f":"IF(Start!$I$9=A87,A87,0)","v":0},null,null,null,null,null,null,null,null,{"$f":"IF(C87<>\"\",CONCATENATE(Start!$K$14,\" • \",Start!$K$16,\" • \",Start!$K$18,\" \",Start!$K$20,\" – \",TEXT(R87,\"00 00 000\")),\"\")","v":""},{"$f":"IF(C87<>\"\",Start!$N$25,\"\")","v":""},"",{"$f":"IF(C87<>\"\",Start!$J$28,\"\")","v":""},{"$f":"IF(C87<>\"\",Start!$L$28,\"\")","v":""},{"$f":"IF(C87<>\"\",TEXT(Start!$N$28,\"TT.MM.JJJJ\"),\"\")","v":""},"",{"$f":"IF(C87<>\"\",TEXT(Start!$P$18,\"00 00 000\"),\"\")","v":""},{"$f":"IF(C87<>\"\",CONCATENATE(Start!$K$14,\" – Leitung Medizin – \",TEXT(R87,\"00 00 000\")),\"\")","v":""},{"$f":"IF(C87>=0,IF(Start!$N$25<>0,M87,IF(Start!$J$28<>\"\",Q87,IF(Start!$N$25&Start!$J$28<>0,S87,\"\"))))","v":""},{"$f":"IF(C87<>\"\",Doku!$Y$26,\"\")","v":""},"",""]
[16,{"$f":"IF(Start!$I$9=A88,A88,0)","v":0},null,null,null,null,null,null,null,null,{"$f":"IF(C88<>\"\",CONCATENATE(Start!$K$14,\" • \",Start!$K$16,\" • \",Start!$K$18,\" \",Start!$K$20,\" – \",TEXT(R88,\"00 00 000\")),\"\")","v":""},{"$f":"IF(C88<>\"\",Start!$N$25,\"\")","v":""},"",{"$f":"IF(C88<>\"\",Start!$J$28,\"\")","v":""},{"$f":"IF(C88<>\"\",Start!$L$28,\"\")","v":""},{"$f":"IF(C88<>\"\",TEXT(Start!$N$28,\"TT.MM.JJJJ\"),\"\")","v":""},"",{"$f":"IF(C88<>\"\",TEXT(Start!$P$18,\"00 00 000\"),\"\")","v":""},{"$f":"IF(C88<>\"\",CONCATENATE(Start!$K$14,\" – Leitung Medizin – \",TEXT(R88,\"00 00 000\")),\"\")","v":""},{"$f":"IF(C88>=0,IF(Start!$N$25<>0,M88,IF(Start!$J$28<>\"\",Q88,IF(Start!$N$25&Start!$J$28<>0,S88,\"\"))))","v":""},{"$f":"IF(C88<>\"\",Doku!$Y$26,\"\")","v":""},"",""]
[17,{"$f":"IF(Start!$I$9=A89,A89,0)","v":0},null,null,null,null,null,null,null,null,{"$f":"IF(C89<>\"\",CONCATENATE(Start!$K$14,\" • \",Start!$K$16,\" • \",Start!$K$18,\" \",Start!$K$20,\" – \",TEXT(R89,\"00 00 000\")),\"\")","v":""},{"$f":"IF(C89<>\"\",Start!$N$25,\"\")","v":""},"",{"$f":"IF(C89<>\"\",Start!$J$28,\"\")","v":""},{"$f":"IF(C89<>\"\",Start!$L$28,\"\")","v":""},{"$f":"IF(C89<>\"\",TEXT(Start!$N$28,\"TT.MM.JJJJ\"),\"\")","v":""},"",{"$f":"IF(C89<>\"\",TEXT(Start!$P$18,\"00 00 000\"),\"\")","v":""},{"$f":"IF(C89<>\"\",CONCATENATE(Start!$K$14,\" – Leitung Medizin – \",TEXT(R89,\"00 00 000\")),\"\")","v":""},{"$f":"IF(C89>=0,IF(Start!$N$25<>0,M89,IF(Start!$J$28<>\"\",Q89,IF(Start!$N$25&Start!$J$28<>0,S89,\"\"))))","v":""},{"$f":"IF(C89<>\"\",Doku!$Y$26,\"\")","v":""},"",""]
[18,{"$f":"IF(Start!$I$9=A90,A90,0)","v":0},null,null,null,null,null,null,null,null,{"$f":"IF(C90<>\"\",CONCATENATE(Start!$K$14,\" • \",Start!$K$16,\" • \",Start!$K$18,\" \",Start!$K$20,\" – \",TEXT(R90,\"00 00 000\")),\"\")","v":""},{"$f":"IF(C90<>\"\",Start!$N$25,\"\")","v":""},"",{"$f":"IF(C90<>\"\",Start!$J$28,\"\")","v":""},{"$f":"IF(C90<>\"\",Start!$L$28,\"\")","v":""},{"$f":"IF(C90<>\"\",TEXT(Start!$N$28,\"TT.MM.JJJJ\"),\"\")","v":""},"",{"$f":"IF(C90<>\"\",TEXT(Start!$P$18,\"00 00 000\"),\"\")","v":""},{"$f":"IF(C90<>\"\",CONCATENATE(Start!$K$14,\" – Leitung Medizin – \",TEXT(R90,\"00 00 000\")),\"\")","v":""},{"$f":"IF(C90>=0,IF(Start!$N$25<>0,M90,IF(Start!$J$28<>\"\",Q90,IF(Start!$N$25&Start!$J$28<>0,S90,\"\"))))","v":""},{"$f":"IF(C90<>\"\",Doku!$Y$26,\"\")","v":""},"",""]
[19,{"$f":"IF(Start!$I$9=A91,A91,0)","v":0},null,null,null,null,null,null,null,null,{"$f":"IF(C91<>\"\",CONCATENATE(Start!$K$14,\" • \",Start!$K$16,\" • \",Start!$K$18,\" \",Start!$K$20,\" – \",TEXT(R91,\"00 00 000\")),\"\")","v":""},{"$f":"IF(C91<>\"\",Start!$N$25,\"\")","v":""},"",{"$f":"IF(C91<>\"\",Start!$J$28,\"\")","v":""},{"$f":"IF(C91<>\"\",Start!$L$28,\"\")","v":""},{"$f":"IF(C91<>\"\",TEXT(Start!$N$28,\"TT.MM.JJJJ\"),\"\")","v":""},"",{"$f":"IF(C91<>\"\",TEXT(Start!$P$18,\"00 00 000\"),\"\")","v":""},{"$f":"IF(C91<>\"\",CONCATENATE(Start!$K$14,\" – Leitung Medizin – \",TEXT(R91,\"00 00 000\")),\"\")","v":""},{"$f":"IF(C91>=0,IF(Start!$N$25<>0,M91,IF(Start!$J$28<>\"\",Q91,IF(Start!$N$25&Start!$J$28<>0,S91,\"\"))))","v":""},{"$f":"IF(C91<>\"\",Doku!$Y$26,\"\")","v":""},"",""]
[20,{"$f":"IF(Start!$I$9=A92,A92,0)","v":0},null,null,null,null,null,null,null,null,{"$f":"IF(C92<>\"\",CONCATENATE(Start!$K$14,\" • \",Start!$K$16,\" • \",Start!$K$18,\" \",Start!$K$20,\" – \",TEXT(R92,\"00 00 000\")),\"\")","v":""},{"$f":"IF(C92<>\"\",Start!$N$25,\"\")","v":""},"",{"$f":"IF(C92<>\"\",Start!$J$28,\"\")","v":""},{"$f":"IF(C92<>\"\",Start!$L$28,\"\")","v":""},{"$f":"IF(C92<>\"\",TEXT(Start!$N$28,\"TT.MM.JJJJ\"),\"\")","v":""},"",{"$f":"IF(C92<>\"\",TEXT(Start!$P$18,\"00 00 000\"),\"\")","v":""},{"$f":"IF(C92<>\"\",CONCATENATE(Start!$K$14,\" – Leitung Medizin – \",TEXT(R92,\"00 00 000\")),\"\")","v":""},{"$f":"IF(C92>=0,IF(Start!$N$25<>0,M92,IF(Start!$J$28<>\"\",Q92,IF(Start!$N$25&Start!$J$28<>0,S92,\"\"))))","v":""},{"$f":"IF(C92<>\"\",Doku!$Y$26,\"\")","v":""},"",""]
[null,{"$f":"SUM(B73:B92)","v":0}]
[]
[]
[20]
["DGUV",{"$f":"CONCATENATE(\"Kennziffer der ermächtigten Stelle gemäß § 26 DGUV Vorschrift 1 – \",L73)","v":"Kennziffer der ermächtigten Stelle gemäß § 26 DGUV Vorschrift 1 – 0"}]
["FeV",{"$f":"CONCATENATE(\"Anerkannte Stelle gemäß § 68 FeV\",\" – \",Z4,\" | \",AA4,\" | \",AB4)","v":"Anerkannte Stelle gemäß § 68 FeV – 0 | 0 | 00.01.1900"}]
["DLRG","Aus- und Fortbildungen gemäß der aktuellen Ausbildungs- und Prüfungsordnung Medizin"]
[]
[8]
[1,"DGUV","für betriebliche Ersthelfende | EH-Schulung gemäß § 19 FeV"]
[2,"FeV","EH-Schulung gemäß § 19 FeV | für betriebliche Ersthelfende DGUV"]
[3,"DLRG","gemäß den Gemeinsamen Grundsätzen der BAGEH"]
[]
[5]
[6]
[]
[10]
[1,"DGUV","Die Ausbildung entspricht den Gemeinsamen Grundsätzen der Bundesarbeitsgemeinschaft Erste Hilfe (BAGEH), sowie dem DGUV Grundsatz 304-001. Die Teilnahme an dieser Ausbildung gilt auch als Schulung in Erster Hilfe gemäß § 19 der Fahrerlaubnis-Verordnung (FeV)."]
[2,"FeV","Die Ausbildung entspricht den Gemeinsamen Grundsätzen der Bundesarbeitsgemeinschaft Erste Hilfe (BAGEH), sowie der Schulung in Erster Hilfe gemäß § 19 der Fahrerlaubnis-Verordnung (FeV) und dem DGUV Grundsatz 304-001."]
[3,"DLRG","Die Ausbildung entspricht den Gemeinsamen Grundsätzen der Bundesarbeitsgemeinschaft Erste Hilfe (BAGEH), sowie den Vorgaben (Inhalt und Durchführung) gemäß § 19 der Fahrerlaubnis-Verordnung (FeV) und dem DGUV Grundsatz 304-001."]
[]
[5,"DGUV","Die Fortbildung entspricht den Gemeinsamen Grundsätzen der Bundesarbeitsgemeinschaft Erste Hilfe (BAGEH), sowie dem DGUV Grundsatz 304-001."]
[6,"DLRG","Diese dient der Reaktivierung und Vertiefung bereits erworbener Kenntnisse und Fertigkeiten aus einer vorherigen Ausbildung, sowie der Vermittlung aktueller Inhalte in der Ersten Hilfe bei Kindernotfällen."]

{"sheet":"UR_Data","index":18,"n_rows":86,"n_cols":519,"rows_kept":86,"cut":false,"hidden":true,"merged":[[17,417,17,441],[18,417,18,441],[19,417,19,441],[20,417,20,441],[21,417,21,441],[22,417,22,441],[66,418,66,439],[66,440,66,441],[67,418,67,439],[67,440,67,441],[68,418,68,439],[68,440,68,441],[69,418,69,439],[69,440,69,441],[70,418,70,439],[70,440,70,441],[52,418,52,439],[52,440,52,441],[53,418,53,439],[62,418,62,439],[62,440,62,441],[65,417,65,439],[53,440,53,441],[54,418,54,439],[54,440,54,441],[55,418,55,439],[55,440,55,441],[56,418,56,439],[56,440,56,441],[57,418,57,439],[57,440,57,441],[58,418,58,439],[79,417,79,441],[80,417,80,441],[73,444,73,465],[73,466,73,467],[78,365,80,389],[46,313,47,337],[48,313,50,337],[51,313,53,337],[54,313,56,337],[57,313,59,337],[60,313,62,337],[63,313,65,337],[66,313,68,337],[69,313,71,337],[72,313,74,337],[75,313,77,337],[78,313,80,337],[46,391,47,415],[46,365,47,389],[48,391,50,415],[51,391,53,415],[54,391,56,415],[57,391,59,415],[60,391,62,415],[63,391,65,415],[66,391,68,415],[69,391,71,415],[72,391,74,415],[75,391,77,415],[78,391,80,415],[48,365,50,389],[51,365,53,389],[54,365,56,389],[57,365,59,389],[60,365,62,389],[63,365,65,389],[66,365,68,389],[69,365,71,389],[72,365,74,389],[75,365,77,389],[58,235,58,259],[59,235,59,259],[69,287,71,311],[72,287,74,311],[54,261,56,285],[57,261,59,285],[60,261,62,285],[63,261,65,285],[66,261,68,285],[69,261,71,285],[72,261,74,285],[60,339,60,363],[59,339,59,363],[66,183,68,207],[69,183,71,207],[72,183,74,207],[69,209,71,233],[72,209,74,233],[73,131,73,155],[76,466,76,467],[77,444,77,465],[77,466,77,467],[72,418,72,439],[72,440,72,441],[73,418,73,439],[73,440,73,441],[74,418,74,439],[74,440,74,441],[75,418,75,439],[75,440,75,441],[76,418,76,439],[76,440,76,441],[77,418,77,439],[77,440,77,441],[66,287,68,311],[66,235,66,259],[67,235,67,259],[68,235,68,259],[66,209,68,233],[69,157,69,181],[69,131,69,155],[71,131,71,155],[72,131,72,155],[74,131,74,155],[70,131,70,155],[83,469,83,493],[66,470,66,491],[66,492,66,493],[67,470,67,491],[84,495,84,519],[65,518,65,519],[66,496,66,517],[66,518,66,519],[67,496,67,517],[67,518,67,519],[68,496,68,517],[68,518,68,519],[69,496,69,517],[69,518,69,519],[70,496,70,517],[70,518,70,519],[71,496,71,517],[71,518,71,519],[72,496,72,517],[72,518,72,519],[80,469,80,493],[84,469,84,493],[74,492,74,493],[78,418,78,439],[78,440,78,441],[82,443,82,465],[82,466,82,467],[78,466,78,467],[62,492,62,493],[65,469,65,491],[67,492,67,493],[85,495,87,519],[74,496,74,517],[74,518,74,519],[75,496,75,517],[75,518,75,519],[76,496,76,517],[76,518,76,519],[77,496,77,517],[77,518,77,519],[78,496,78,517],[78,518,78,519],[81,495,81,519],[82,495,82,519],[75,470,75,491],[75,492,75,493],[76,470,76,491],[76,492,76,493],[77,470,77,491],[77,492,77,493],[78,470,78,491],[78,492,78,493],[81,469,81,493],[82,469,82,493],[79,469,79,493],[85,469,87,493],[83,495,83,519],[53,496,53,517],[53,518,53,519],[54,496,54,517],[54,518,54,519],[40,495,40,519],[41,495,41,519],[42,495,42,519],[73,496,73,517],[73,518,73,519],[65,495,65,517],[79,495,79,519],[80,495,80,519],[81,443,81,467],[74,444,74,465],[74,466,74,467],[75,444,75,465],[75,466,75,467],[76,444,76,465],[62,444,62,465],[62,466,62,467],[65,443,65,465],[79,443,79,467],[80,443,80,467],[71,470,71,491],[71,492,71,493],[72,470,72,491],[72,492,72,493],[73,470,73,491],[73,492,73,493],[74,470,74,491],[78,444,78,465],[58,518,58,519],[59,496,59,517],[59,518,59,519],[60,496,60,517],[60,518,60,519],[61,496,61,517],[61,518,61,519],[63,495,63,519],[64,495,64,517],[64,518,64,519],[62,496,62,517],[62,518,62,519],[58,496,58,517],[55,496,55,517],[55,518,55,519],[56,496,56,517],[56,518,56,519],[57,496,57,517],[57,518,57,519],[58,492,58,493],[59,470,59,491],[59,492,59,493],[60,470,60,491],[60,492,60,493],[61,470,61,491],[61,492,61,493],[63,469,63,493],[64,469,64,491],[64,492,64,493],[65,492,65,493],[62,470,62,491],[25,515,25,519],[26,495,26,519],[27,495,27,506],[27,508,27,519],[28,495,28,506],[28,508,28,519],[29,495,29,506],[29,508,29,519],[30,495,30,519],[31,495,31,509],[31,510,31,519],[32,495,32,504],[32,505,32,509],[32,510,32,519],[33,495,33,504],[33,505,33,509],[33,510,33,519],[43,495,44,519],[45,495,45,519],[46,495,48,519],[49,495,49,517],[49,518,49,519],[50,496,50,517],[50,518,50,519],[51,496,51,517],[51,518,51,519],[52,496,52,517],[52,518,52,519],[31,469,31,483],[31,484,31,493],[32,469,32,478],[32,479,32,483],[32,484,32,493],[33,469,33,478],[33,479,33,483],[33,484,33,493],[34,495,34,519],[35,495,35,519],[36,495,36,519],[37,495,37,519],[38,495,38,519],[39,495,39,519],[34,469,34,493],[35,469,35,493],[36,469,36,493],[37,469,37,493],[38,469,38,493],[39,469,39,493],[40,469,40,493],[0,495,0,519],[1,495,1,519],[2,495,2,519],[3,495,3,519],[4,495,4,519],[5,495,5,519],[6,495,6,519],[7,495,7,519],[8,495,8,519],[9,495,9,519],[10,495,10,519],[11,495,11,519],[12,495,12,519],[13,495,13,519],[14,495,14,519],[15,495,15,519],[16,495,16,519],[17,495,17,519],[18,495,18,519],[19,495,19,519],[20,495,20,519],[21,495,21,519],[22,495,22,519],[23,495,23,519],[24,495,24,509],[24,510,24,514],[24,515,24,519],[25,495,25,509],[25,510,25,514],[68,470,68,491],[68,492,68,493],[69,470,69,491],[69,492,69,493],[70,470,70,491],[70,492,70,493],[50,470,50,491],[50,492,50,493],[51,470,51,491],[51,492,51,493],[52,470,52,491],[52,492,52,493],[53,470,53,491],[53,492,53,493],[54,470,54,491],[54,492,54,493],[55,470,55,491],[55,492,55,493],[57,492,57,493],[58,470,58,491],[41,469,41,493],[42,469,42,493],[43,469,44,493],[45,469,45,493],[46,469,48,493],[49,469,49,491],[49,492,49,493],[56,470,56,491],[56,492,56,493],[57,470,57,491],[21,469,21,493],[22,469,22,493],[23,469,23,493],[24,469,24,483],[24,484,24,488],[24,489,24,493],[25,469,25,483],[25,484,25,488],[25,489,25,493],[26,469,26,493],[27,469,27,480],[27,482,27,493],[28,469,28,480],[28,482,28,493],[29,469,29,480],[29,482,29,493],[30,469,30,493],[83,443,83,467],[84,443,84,467],[85,443,87,467],[0,469,0,493],[1,469,1,493],[2,469,2,493],[3,469,3,493],[4,469,4,493],[5,469,5,493],[6,469,6,493],[7,469,7,493],[8,469,8,493],[9,469,9,493],[10,469,10,493],[11,469,11,493],[12,469,12,493],[13,469,13,493],[14,469,14,493],[15,469,15,493],[16,469,16,493],[17,469,17,493],[18,469,18,493],[19,469,19,493],[20,469,20,493],[69,444,69,465],[69,466,69,467],[70,444,70,465],[70,466,70,467],[71,444,71,465],[71,466,71,467],[72,444,72,465],[72,466,72,467],[59,444,59,465],[59,466,59,467],[60,444,60,465],[60,466,60,467],[61,444,61,465],[61,466,61,467],[63,443,63,467],[64,443,64,465],[64,466,64,467],[65,466,65,467],[66,444,66,465],[66,466,66,467],[67,444,67,465],[67,466,67,467],[68,444,68,465],[68,466,68,467],[50,444,50,465],[50,466,50,467],[51,444,51,465],[51,466,51,467],[52,444,52,465],[52,466,52,467],[53,444,53,465],[53,466,53,467],[54,444,54,465],[54,466,54,467],[55,444,55,465],[55,466,55,467],[56,444,56,465],[56,466,56,467],[57,444,57,465],[57,466,57,467],[58,444,58,465],[58,466,58,467],[33,443,33,452],[33,453,33,457],[33,458,33,467],[34,443,34,467],[35,443,35,467],[36,443,36,467],[37,443,37,467],[38,443,38,467],[39,443,39,467],[40,443,40,467],[41,443,41,467],[42,443,42,467],[43,443,44,467],[45,443,45,467],[46,443,48,467],[49,443,49,465],[49,466,49,467],[24,463,24,467],[25,443,25,457],[25,458,25,462],[25,463,25,467],[26,443,26,467],[27,443,27,454],[27,456,27,467],[28,443,28,454],[28,456,28,467],[29,443,29,454],[29,456,29,467],[30,443,30,467],[31,443,31,457],[31,458,31,467],[32,443,32,452],[32,453,32,457],[32,458,32,467],[81,417,81,441],[83,417,83,441],[84,417,84,441],[85,417,87,441],[0,443,0,467],[1,443,1,467],[2,443,2,467],[3,443,3,467],[4,443,4,467],[5,443,5,467],[6,443,6,467],[7,443,7,467],[8,443,8,467],[9,443,9,467],[10,443,10,467],[11,443,11,467],[12,443,12,467],[13,443,13,467],[14,443,14,467],[15,443,15,467],[16,443,16,467],[23,443,23,467],[24,443,24,457],[71,418,71,439],[71,440,71,441],[24,458,24,462],[61,418,61,439],[61,440,61,441],[63,417,63,441],[64,417,64,439],[64,440,64,441],[65,440,65,441],[58,440,58,441],[59,418,59,439],[59,440,59,441],[60,418,60,439],[60,440,60,441],[34,417,34,441],[35,417,35,441],[36,417,36,441],[37,417,37,441],[38,417,38,441],[39,417,39,441],[40,417,40,441],[41,417,41,441],[42,417,42,441],[43,417,44,441],[45,417,45,441],[46,417,48,441],[49,417,49,439],[49,440,49,441],[50,418,50,439],[50,440,50,441],[51,418,51,439],[51,440,51,441],[25,417,25,431],[25,432,25,436],[25,437,25,441],[26,417,26,441],[27,417,27,428],[27,430,27,441],[28,417,28,428],[28,430,28,441],[29,417,29,428],[29,430,29,441],[30,417,30,441],[31,417,31,431],[31,432,31,441],[32,417,32,426],[32,427,32,431],[32,432,32,441],[33,417,33,426],[33,427,33,431],[33,432,33,441],[81,391,81,415],[82,391,82,415],[83,391,83,415],[84,391,84,415],[85,391,87,415],[0,417,0,441],[1,417,1,441],[2,417,2,441],[3,417,3,441],[4,417,4,441],[5,417,5,441],[6,417,6,441],[7,417,7,441],[8,417,8,441],[9,417,9,441],[10,417,10,441],[11,417,11,441],[12,417,12,441],[13,417,13,441],[14,417,14,441],[15,417,15,441],[16,417,16,441],[35,391,35,415],[36,391,36,415],[37,391,37,415],[38,391,38,415],[39,391,39,415],[40,391,40,415],[41,391,41,415],[42,391,42,415],[43,391,44,415],[45,391,45,415],[17,443,17,467],[18,443,18,467],[19,443,19,467],[20,443,20,467],[21,443,21,467],[22,443,22,467],[23,417,23,441],[24,417,24,431],[24,432,24,436],[24,437,24,441],[32,391,32,400],[32,401,32,405],[32,406,32,415],[33,391,33,400],[33,401,33,405],[33,406,33,415],[34,391,34,415],[22,391,22,415],[23,391,23,415],[24,391,24,405],[24,406,24,410],[24,411,24,415],[25,391,25,405],[25,406,25,410],[25,411,25,415],[26,391,26,415],[27,391,27,402],[27,404,27,415],[28,391,28,402],[28,404,28,415],[29,391,29,402],[29,404,29,415],[30,391,30,415],[31,391,31,405],[31,406,31,415],[81,365,81,389],[82,365,82,389],[83,365,83,389],[84,365,84,389],[85,365,87,389],[0,391,0,415],[1,391,1,415],[2,391,2,415],[3,391,3,415],[4,391,4,415],[5,391,5,415],[6,391,6,415],[7,391,7,415],[8,391,8,415],[9,391,9,415],[10,391,10,415],[11,391,11,415],[12,391,12,415],[13,391,13,415],[14,391,14,415],[15,391,15,415],[16,391,16,415],[17,391,17,415],[18,391,18,415],[19,391,19,415],[20,391,20,415],[21,391,21,415],[40,365,40,389],[41,365,41,389],[25,380,25,384],[25,385,25,389],[26,365,26,389],[27,365,27,376],[27,378,27,389],[28,365,28,376],[28,378,28,389],[42,365,42,389],[43,365,44,389],[45,365,45,389],[29,365,29,376],[29,378,29,389],[30,365,30,389],[31,365,31,379],[31,380,31,389],[32,365,32,374],[32,375,32,379],[32,380,32,389],[33,365,33,374],[33,375,33,379],[33,380,33,389],[34,365,34,389],[35,365,35,389],[36,365,36,389],[37,365,37,389],[38,365,38,389],[39,365,39,389],[85,1,87,25],[85,131,87,155],[81,131,81,155],[83,131,83,155],[0,365,0,389],[1,365,1,389],[2,365,2,389],[3,365,3,389],[4,365,4,389],[5,365,5,389],[6,365,6,389],[7,365,7,389],[8,365,8,389],[9,365,9,389],[10,365,10,389],[11,365,11,389],[12,365,12,389],[13,365,13,389],[14,365,14,389],[15,365,15,389],[16,365,16,389],[17,365,17,389],[18,365,18,389],[19,365,19,389],[20,365,20,389],[21,365,21,389],[22,365,22,389],[23,365,23,389],[24,365,24,379],[24,380,24,384],[24,385,24,389],[25,365,25,379],[85,157,87,181],[81,157,81,181],[82,157,82,181],[83,157,83,181],[83,235,83,259],[85,313,87,337],[81,313,81,337],[82,313,82,337],[81,235,81,259],[82,235,82,259],[83,183,83,207],[85,183,87,207],[81,209,81,233],[82,209,82,233],[83,209,83,233],[85,209,87,233],[85,79,87,103],[81,287,81,311],[82,287,82,311],[83,287,83,311],[85,287,87,311],[84,287,84,311],[84,313,84,337],[78,183,80,207],[78,209,80,233],[75,209,77,233],[77,131,77,155],[78,131,78,155],[79,131,79,155],[79,157,79,181],[84,1,84,25],[84,27,84,51],[84,53,84,77],[84,79,84,103],[84,105,84,129],[84,131,84,155],[84,157,84,181],[84,183,84,207],[84,209,84,233],[84,235,84,259],[76,131,76,155],[80,157,80,181],[80,131,80,155],[81,183,81,207],[82,183,82,207],[75,183,77,207],[84,339,84,363],[81,261,81,285],[82,261,82,285],[83,261,83,285],[85,261,87,285],[63,339,63,363],[81,339,81,363],[85,235,87,259],[78,235,78,259],[79,235,79,259],[75,235,75,259],[76,235,76,259],[77,235,77,259],[73,339,73,363],[83,313,83,337],[82,339,82,363],[83,339,83,363],[85,339,87,363],[75,339,75,363],[76,339,76,363],[77,339,77,363],[75,287,77,311],[78,287,80,311],[75,261,77,285],[78,261,80,285],[84,261,84,285],[74,339,74,363],[63,287,65,311],[48,261,50,285],[51,261,53,285],[55,131,55,155],[56,131,56,155],[57,131,57,155],[58,131,58,155],[59,131,59,155],[60,131,60,155],[64,131,64,155],[46,183,47,207],[46,209,47,233],[48,183,50,207],[43,131,44,155],[64,235,64,259],[65,235,65,259],[63,235,63,259],[60,287,62,311],[65,131,65,155],[63,183,65,207],[63,209,65,233],[64,157,64,181],[51,157,51,181],[52,157,52,181],[53,157,53,181],[54,157,54,181],[55,157,55,181],[56,157,56,181],[57,157,57,181],[58,157,58,181],[60,235,60,259],[61,235,62,259],[60,183,62,207],[43,1,44,25],[45,1,45,25],[42,27,42,51],[43,27,44,51],[45,27,45,51],[42,53,42,77],[43,53,44,77],[45,53,45,77],[42,79,42,103],[43,79,44,103],[45,79,45,103],[47,27,47,51],[64,105,64,129],[64,79,64,103],[64,53,64,77],[63,157,63,181],[60,79,60,103],[61,53,62,77],[63,131,63,155],[43,105,44,129],[45,105,45,129],[61,105,62,129],[61,79,62,103],[61,131,62,155],[53,131,53,155],[54,131,54,155],[48,157,48,181],[49,157,49,181],[50,157,50,181],[59,27,59,51],[43,313,44,337],[45,313,45,337],[42,339,42,363],[43,339,44,363],[45,339,45,363],[43,209,44,233],[45,209,45,233],[45,235,45,259],[42,261,42,285],[43,261,44,285],[45,261,45,285],[42,287,42,311],[43,287,44,311],[45,287,45,311],[46,131,46,155],[47,131,47,155],[46,157,46,181],[47,157,47,181],[46,261,47,285],[46,287,47,311],[42,131,42,155],[46,235,46,259],[42,235,42,259],[43,235,44,259],[38,339,38,363],[39,339,39,363],[40,339,40,363],[42,1,42,25],[42,105,42,129],[42,209,42,233],[42,313,42,337],[38,313,38,337],[39,313,39,337],[40,313,40,337],[52,339,52,363],[53,339,53,363],[54,339,54,363],[55,339,55,363],[56,339,56,363],[57,339,57,363],[58,339,58,363],[40,105,40,129],[40,131,40,155],[45,131,45,155],[42,157,42,181],[43,157,44,181],[45,157,45,181],[42,183,42,207],[51,339,51,363],[49,339,49,363],[47,53,47,77],[54,235,54,259],[55,235,55,259],[52,105,52,129],[53,105,53,129],[47,339,47,363],[25,339,25,353],[25,354,25,358],[25,359,25,363],[26,339,26,363],[27,339,27,350],[27,352,27,363],[28,339,28,350],[28,352,28,363],[29,339,29,350],[29,352,29,363],[30,339,30,363],[31,339,31,353],[31,354,31,363],[32,339,32,348],[32,349,32,353],[32,354,32,363],[63,53,63,77],[47,79,47,103],[63,79,63,103],[47,105,47,129],[63,105,63,129],[43,183,44,207],[45,183,45,207],[48,339,48,363],[59,157,59,181],[60,157,60,181],[61,157,62,181],[48,131,48,155],[49,131,49,155],[50,131,50,155],[51,131,51,155],[52,131,52,155],[33,339,33,348],[33,349,33,353],[24,333,24,337],[34,287,34,311],[35,287,35,311],[36,287,36,311],[37,287,37,311],[33,354,33,363],[34,339,34,363],[35,339,35,363],[36,339,36,363],[37,339,37,363],[33,323,33,327],[33,328,33,337],[34,313,34,337],[35,313,35,337],[36,313,36,337],[37,313,37,337],[29,287,29,298],[29,300,29,311],[30,287,30,311],[31,287,31,301],[31,302,31,311],[32,287,32,296],[32,297,32,301],[32,302,32,311],[33,287,33,296],[33,297,33,301],[33,302,33,311],[24,339,24,353],[24,354,24,358],[24,359,24,363],[24,261,24,275],[24,276,24,280],[24,281,24,285],[25,261,25,275],[25,276,25,280],[25,281,25,285],[26,261,26,285],[27,261,27,272],[27,274,27,285],[28,261,28,272],[28,274,28,285],[29,261,29,272],[29,274,29,285],[30,261,30,285],[31,261,31,275],[31,276,31,285],[32,261,32,270],[32,271,32,275],[32,276,32,285],[36,157,36,181],[37,157,37,181],[38,157,38,181],[39,157,39,181],[40,157,40,181],[33,261,33,270],[32,235,32,244],[32,245,32,249],[32,250,32,259],[33,235,33,244],[33,245,33,249],[33,250,33,259],[34,235,34,259],[35,235,35,259],[36,235,36,259],[39,183,39,207],[40,183,40,207],[35,261,35,285],[36,261,36,285],[37,261,37,285],[38,261,38,285],[39,261,39,285],[40,261,40,285],[37,235,37,259],[38,235,38,259],[39,235,39,259],[40,235,40,259],[33,271,33,275],[33,276,33,285],[34,261,34,285],[35,209,35,233],[36,209,36,233],[27,196,27,207],[28,183,28,194],[28,196,28,207]],"merged_total":1880,"flags":["merged_cut"]}
[null,1,null,null,null,null,null,null,null,null,null,null,null,null,null,null,null,null,null,null,null,null,null,null,null,null,null,2,null,null,null,null,null,null,null,null,null,null,null,null,null,null,null,null,null,null,null,null,null,null,null,null,null,3,null,null,null,null,null,null,null,null,null,null,null,null,null,null,null,null,null,null,null,null,null,null,null,null,null,4,null,null,null,null,null,null,null,null,null,null,null,null,null,null,null,null,null,null,null,null,null,null,null,null,null,5,null,null,null,null,null,null,null,null,null,null,null,null,null,null,null,null,null,null,null,null,null,null,null,null,null,6,null,null,null,null,null,null,null,null,null,null,null,null,null,null,null,null,null,null,null,null,null,null,null,null,null,7,null,null,null,null,null,null,null,null,null,null,null,null,null,null,null,null,null,null,null,null,null,null,null,null,null,8,null,null,null,null,null,null,null,null,null,null,null,null,null,null,null,null,null,null,null,null,null,null,null,null,null,9,null,null,null,null,null,null,null,null,null,null,null,null,null,null,null,null,null,null,null,null,null,null,null,null,null,10,null,null,null,null,null,null,null,null,null,null,null,null,null,null,null,null,null,null,null,null,null,null,null,null,null,11,null,null,null,null,null,null,null,null,null,null,null,null,null,null,null,null,null,null,null,null,null,null,null,null,null,12,null,null,null,null,null,null,null,null,null,null,null,null,null,null,null,null,null,null,null,null,null,null,null,null,null,13,null,null,null,null,null,null,null,null,null,null,null,null,null,null,null,null,null,null,null,null,null,null,null,null,null,14,null,null,null,null,null,null,null,null,null,null,null,null,null,null,null,null,null,null,null,null,null,null,null,null,null,15,null,null,null,null,null,null,null,null,null,null,null,null,null,null,null,null,null,null,null,null,null,null,null,null,null,16,null,null,null,null,null,null,null,null,null,null,null,null,null,null,null,null,null,null,null,null,null,null,null,null,null,17,null,null,null,null,null,null,null,null,null,null,null,null,null,null,null,null,null,null,null,null,null,null,null,null,null,18,null,null,null,null,null,null,null,null,null,null,null,null,null,null,null,null,null,null,null,null,null,null,null,null,null,19,null,null,null,null,null,null,null,null,null,null,null,null,null,null,null,null,null,null,null,null,null,null,null,null,null,20]
[1,"Teilnahmebescheinigung",null,null,null,null,null,null,null,null,null,null,null,null,null,null,null,null,null,null,null,null,null,null,null,null,1,"Teilnahmebescheinigung",null,null,null,null,null,null,null,null,null,null,null,null,null,null,null,null,null,null,null,null,null,null,null,null,1,"Teilnahmebescheinigung",null,null,null,null,null,null,null,null,null,null,null,null,null,null,null,null,null,null,null,null,null,null,null,null,1,null,null,null,null,null,null,null,null,null,null,null,null,null,null,null,null,null,null,null,null,null,null,null,null,null,1,"Teilnahmebescheinigung",null,null,null,null,null,null,null,null,null,null,null,null,null,null,null,null,null,null,null,null,null,null,null,null,1,null,null,null,null,null,null,null,null,null,null,null,null,null,null,null,null,null,null,null,null,null,null,null,null,null,1,"Teilnahmebescheinigung",null,null,null,null,null,null,null,null,null,null,null,null,null,null,null,null,null,null,null,null,null,null,null,null,1,"Teilnahmebescheinigung",null,null,null,null,null,null,null,null,null,null,null,null,null,null,null,null,null,null,null,null,null,null,null,null,1,"Teilnahmebescheinigung",null,null,null,null,null,null,null,null,null,null,null,null,null,null,null,null,null,null,null,null,null,null,null,null,1,"Teilnahmebescheinigung",null,null,null,null,null,null,null,null,null,null,null,null,null,null,null,null,null,null,null,null,null,null,null,null,1,null,null,null,null,null,null,null,null,null,null,null,null,null,null,null,null,null,null,null,null,null,null,null,null,null,null,"Ausbildungsnachweis",null,null,null,null,null,null,null,null,null,null,null,null,null,null,null,null,null,null,null,null,null,null,null,null,1,"Ausbildungsnachweis",null,null,null,null,null,null,null,null,null,null,null,null,null,null,null,null,null,null,null,null,null,null,null,null,1,null,null,null,null,null,null,null,null,null,null,null,null,null,null,null,null,null,null,null,null,null,null,null,null,null,1,"Ausbildungsnachweis",null,null,null,null,null,null,null,null,null,null,null,null,null,null,null,null,null,null,null,null,null,null,null,null,1,"Ausbildungsnachweis",null,null,null,null,null,null,null,null,null,null,null,null,null,null,null,null,null,null,null,null,null,null,null,null,1,null,null,null,null,null,null,null,null,null,null,null,null,null,null,null,null,null,null,null,null,null,null,null,null,null,1,"Fortbildungsnachweis",null,null,null,null,null,null,null,null,null,null,null,null,null,null,null,null,null,null,null,null,null,null,null,null,1,null,null,null,null,null,null,null,null,null,null,null,null,null,null,null,null,null,null,null,null,null,null,null,null,null,1]
[2,null,null,null,null,null,null,null,null,null,null,null,null,null,null,null,null,null,null,null,null,null,null,null,null,null,2,null,null,null,null,null,null,null,null,null,null,null,null,null,null,null,null,null,null,null,null,null,null,null,null,null,2,null,null,null,null,null,null,null,null,null,null,null,null,null,null,null,null,null,null,null,null,null,null,null,null,null,2,null,null,null,null,null,null,null,null,null,null,null,null,null,null,null,null,null,null,null,null,null,null,null,null,null,2,null,null,null,null,null,null,null,null,null,null,null,null,null,null,null,null,null,null,null,null,null,null,null,null,null,2,null,null,null,null,null,null,null,null,null,null,null,null,null,null,null,null,null,null,null,null,null,null,null,null,null,2,null,null,null,null,null,null,null,null,null,null,null,null,null,null,null,null,null,null,null,null,null,null,null,null,null,2,null,null,null,null,null,null,null,null,null,null,null,null,null,null,null,null,null,null,null,null,null,null,null,null,null,2,null,null,null,null,null,null,null,null,null,null,null,null,null,null,null,null,null,null,null,null,null,null,null,null,null,2,null,null,null,null,null,null,null,null,null,null,null,null,null,null,null,null,null,null,null,null,null,null,null,null,null,2,null,null,null,null,null,null,null,null,null,null,null,null,null,null,null,null,null,null,null,null,null,null,null,null,null,null,null,null,null,null,null,null,null,null,null,null,null,null,null,null,null,null,null,null,null,null,null,null,null,null,null,2,null,null,null,null,null,null,null,null,null,null,null,null,null,null,null,null,null,null,null,null,null,null,null,null,null,2,null,null,null,null,null,null,null,null,null,null,null,null,null,null,null,null,null,null,null,null,null,null,null,null,null,2,null,null,null,null,null,null,null,null,null,null,null,null,null,null,null,null,null,null,null,null,null,null,null,null,null,2,null,null,null,null,null,null,null,null,null,null,null,null,null,null,null,null,null,null,null,null,null,null,null,null,null,2,null,null,null,null,null,null,null,null,null,null,null,null,null,null,null,null,null,null,null,null,null,null,null,null,null,2,null,null,null,null,null,null,null,null,null,null,null,null,null,null,null,null,null,null,null,null,null,null,null,null,null,2,null,null,null,null,null,null,null,null,null,null,null,null,null,null,null,null,null,null,null,null,null,null,null,null,null,2]
[3,"Erste Hilfe-Ausbildung",null,null,null,null,null,null,null,null,null,null,null,null,null,null,null,null,null,null,null,null,null,null,null,null,3,"Erste Hilfe-Schulung",null,null,null,null,null,null,null,null,null,null,null,null,null,null,null,null,null,null,null,null,null,null,null,null,3,"Erste Hilfe-Fortbildung",null,null,null,null,null,null,null,null,null,null,null,null,null,null,null,null,null,null,null,null,null,null,null,null,3,null,null,null,null,null,null,null,null,null,null,null,null,null,null,null,null,null,null,null,null,null,null,null,null,null,3,"Erste Hilfe-Schulung",null,null,null,null,null,null,null,null,null,null,null,null,null,null,null,null,null,null,null,null,null,null,null,null,3,null,null,null,null,null,null,null,null,null,null,null,null,null,null,null,null,null,null,null,null,null,null,null,null,null,3,"Erste Hilfe-Ausbildung",null,null,null,null,null,null,null,null,null,null,null,null,null,null,null,null,null,null,null,null,null,null,null,null,3,"Erste Hilfe-Fortbildung",null,null,null,null,null,null,null,null,null,null,null,null,null,null,null,null,null,null,null,null,null,null,null,null,3,"Erste Hilfe bei Kindernotfällen",null,null,null,null,null,null,null,null,null,null,null,null,null,null,null,null,null,null,null,null,null,null,null,null,3,"Erste Hilfe-Fortbildung",null,null,null,null,null,null,null,null,null,null,null,null,null,null,null,null,null,null,null,null,null,null,null,null,3,null,null,null,null,null,null,null,null,null,null,null,null,null,null,null,null,null,null,null,null,null,null,null,null,null,null,"Sanitätsausbildung A",null,null,null,null,null,null,null,null,null,null,null,null,null,null,null,null,null,null,null,null,null,null,null,null,3,"Sanitätsausbildung B",null,null,null,null,null,null,null,null,null,null,null,null,null,null,null,null,null,null,null,null,null,null,null,null,3,null,null,null,null,null,null,null,null,null,null,null,null,null,null,null,null,null,null,null,null,null,null,null,null,null,3,"RUND-Grundkurs",null,null,null,null,null,null,null,null,null,null,null,null,null,null,null,null,null,null,null,null,null,null,null,null,3,"RUND-Aufbaukurs",null,null,null,null,null,null,null,null,null,null,null,null,null,null,null,null,null,null,null,null,null,null,null,null,3,null,null,null,null,null,null,null,null,null,null,null,null,null,null,null,null,null,null,null,null,null,null,null,null,null,3,"Sanitätsfortbildung",null,null,null,null,null,null,null,null,null,null,null,null,null,null,null,null,null,null,null,null,null,null,null,null,3,null,null,null,null,null,null,null,null,null,null,null,null,null,null,null,null,null,null,null,null,null,null,null,null,null,3]
[4,"für betriebliche Ersthelfende | EH-Schulung gemäß § 19 FeV",null,null,null,null,null,null,null,null,null,null,null,null,null,null,null,null,null,null,null,null,null,null,null,null,4,"in Bildungs- und Betreuungseinrichtungen für Kinder",null,null,null,null,null,null,null,null,null,null,null,null,null,null,null,null,null,null,null,null,null,null,null,null,4,"für betriebliche Ersthelfende",null,null,null,null,null,null,null,null,null,null,null,null,null,null,null,null,null,null,null,null,null,null,null,null,4,null,null,null,null,null,null,null,null,null,null,null,null,null,null,null,null,null,null,null,null,null,null,null,null,null,4,"gemäß § 19 Fahrerlaubnis-Verordnung (FeV)",null,null,null,null,null,null,null,null,null,null,null,null,null,null,null,null,null,null,null,null,null,null,null,null,4,null,null,null,null,null,null,null,null,null,null,null,null,null,null,null,null,null,null,null,null,null,null,null,null,null,4,"gemäß den Gemeinsamen Grundsätzen der BAGEH",null,null,null,null,null,null,null,null,null,null,null,null,null,null,null,null,null,null,null,null,null,null,null,null,4,"gemäß den Gemeinsamen Grundsätzen der BAGEH",null,null,null,null,null,null,null,null,null,null,null,null,null,null,null,null,null,null,null,null,null,null,null,null,4,"Erste Hilfe leisten bei akuten Gefahren, Krankheiten und Notfällen",null,null,null,null,null,null,null,null,null,null,null,null,null,null,null,null,null,null,null,null,null,null,null,null,4,"Auffrischung der Kenntnisse Erste Hilfe bei Kindernotfällen",null,null,null,null,null,null,null,null,null,null,null,null,null,null,null,null,null,null,null,null,null,null,null,null,4,null,null,null,null,null,null,null,null,null,null,null,null,null,null,null,null,null,null,null,null,null,null,null,null,null,null,null,null,null,null,null,null,null,null,null,null,null,null,null,null,null,null,null,null,null,null,null,null,null,null,null,4,null,null,null,null,null,null,null,null,null,null,null,null,null,null,null,null,null,null,null,null,null,null,null,null,null,4,null,null,null,null,null,null,null,null,null,null,null,null,null,null,null,null,null,null,null,null,null,null,null,null,null,4,"(Realistische Unfall- und Notfall-Darstellung)",null,null,null,null,null,null,null,null,null,null,null,null,null,null,null,null,null,null,null,null,null,null,null,null,4,"(Realistische Unfall- und Notfall-Darstellung)",null,null,null,null,null,null,null,null,null,null,null,null,null,null,null,null,null,null,null,null,null,null,null,null,4,null,null,null,null,null,null,null,null,null,null,null,null,null,null,null,null,null,null,null,null,null,null,null,null,null,4,null,null,null,null,null,null,null,null,null,null,null,null,null,null,null,null,null,null,null,null,null,null,null,null,null,4,null,null,null,null,null,null,null,null,null,null,null,null,null,null,null,null,null,null,null,null,null,null,null,null,null,4]
[5,null,null,null,null,null,null,null,null,null,null,null,null,null,null,null,null,null,null,null,null,null,null,null,null,null,5,null,null,null,null,null,null,null,null,null,null,null,null,null,null,null,null,null,null,null,null,null,null,null,null,null,5,null,null,null,null,null,null,null,null,null,null,null,null,null,null,null,null,null,null,null,null,null,null,null,null,null,5,null,null,null,null,null,null,null,null,null,null,null,null,null,null,null,null,null,null,null,null,null,null,null,null,null,5,null,null,null,null,null,null,null,null,null,null,null,null,null,null,null,null,null,null,null,null,null,null,null,null,null,5,null,null,null,null,null,null,null,null,null,null,null,null,null,null,null,null,null,null,null,null,null,null,null,null,null,5,null,null,null,null,null,null,null,null,null,null,null,null,null,null,null,null,null,null,null,null,null,null,null,null,null,5,null,null,null,null,null,null,null,null,null,null,null,null,null,null,null,null,null,null,null,null,null,null,null,null,null,5,null,null,null,null,null,null,null,null,null,null,null,null,null,null,null,null,null,null,null,null,null,null,null,null,null,5,null,null,null,null,null,null,null,null,null,null,null,null,null,null,null,null,null,null,null,null,null,null,null,null,null,5,null,null,null,null,null,null,null,null,null,null,null,null,null,null,null,null,null,null,null,null,null,null,null,null,null,5,null,null,null,null,null,null,null,null,null,null,null,null,null,null,null,null,null,null,null,null,null,null,null,null,null,5,null,null,null,null,null,null,null,null,null,null,null,null,null,null,null,null,null,null,null,null,null,null,null,null,null,5,null,null,null,null,null,null,null,null,null,null,null,null,null,null,null,null,null,null,null,null,null,null,null,null,null,5,null,null,null,null,null,null,null,null,null,null,null,null,null,null,null,null,null,null,null,null,null,null,null,null,null,5,null,null,null,null,null,null,null,null,null,null,null,null,null,null,null,null,null,null,null,null,null,null,null,null,null,5,null,null,null,null,null,null,null,null,null,null,null,null,null,null,null,null,null,null,null,null,null,null,null,null,null,5,null,null,null,null,null,null,null,null,null,null,null,null,null,null,null,null,null,null,null,null,null,null,null,null,null,5,null,null,null,null,null,null,null,null,null,null,null,null,null,null,null,null,null,null,null,null,null,null,null,null,null,5]
[6,{"$f":"VLOOKUP(Urkunde_1!AG4,Data_PD!A4:U23,16,FALSE)","v":{"$error":"#N/A"}},null,null,null,null,null,null,null,null,null,null,null,null,null,null,null,null,null,null,null,null,null,null,null,null,6,{"$f":"VLOOKUP(Urkunde_1!AG4,Data_PD!A4:U23,16,FALSE)","v":{"$error":"#N/A"}},null,null,null,null,null,null,null,null,null,null,null,null,null,null,null,null,null,null,null,null,null,null,null,null,6,{"$f":"VLOOKUP(Urkunde_1!AG4,Data_PD!A4:U23,16,FALSE)","v":{"$error":"#N/A"}},null,null,null,null,null,null,null,null,null,null,null,null,null,null,null,null,null,null,null,null,null,null,null,null,6,{"$f":"VLOOKUP(Urkunde_1!AG4,Data_PD!A4:U23,16,FALSE)","v":{"$error":"#N/A"}},null,null,null,null,null,null,null,null,null,null,null,null,null,null,null,null,null,null,null,null,null,null,null,null,6,null,null,null,null,null,null,null,null,null,null,null,null,null,null,null,null,null,null,null,null,null,null,null,null,null,6,{"$f":"VLOOKUP(Urkunde_1!AG4,Data_PD!A4:U23,16,FALSE)","v":{"$error":"#N/A"}},null,null,null,null,null,null,null,null,null,null,null,null,null,null,null,null,null,null,null,null,null,null,null,null,6,{"$f":"VLOOKUP(Urkunde_1!AG4,Data_PD!A4:U23,16,FALSE)","v":{"$error":"#N/A"}},null,null,null,null,null,null,null,null,null,null,null,null,null,null,null,null,null,null,null,null,null,null,null,null,6,{"$f":"VLOOKUP(Urkunde_1!AG4,Data_PD!A4:U23,16,FALSE)","v":{"$error":"#N/A"}},null,null,null,null,null,null,null,null,null,null,null,null,null,null,null,null,null,null,null,null,null,null,null,null,6,{"$f":"VLOOKUP(Urkunde_1!AG4,Data_PD!A4:U23,16,FALSE)","v":{"$error":"#N/A"}},null,null,null,null,null,null,null,null,null,null,null,null,null,null,null,null,null,null,null,null,null,null,null,null,6,{"$f":"VLOOKUP(Urkunde_1!AG4,Data_PD!A4:U23,16,FALSE)","v":{"$error":"#N/A"}},null,null,null,null,null,null,null,null,null,null,null,null,null,null,null,null,null,null,null,null,null,null,null,null,6,{"$f":"VLOOKUP(Urkunde_1!AG4,Data_PD!A4:U23,16,FALSE)","v":{"$error":"#N/A"}},null,null,null,null,null,null,null,null,null,null,null,null,null,null,null,null,null,null,null,null,null,null,null,null,6,{"$f":"VLOOKUP(Urkunde_1!AG4,Data_PD!A4:U23,16,FALSE)","v":{"$error":"#N/A"}},null,null,null,null,null,null,null,null,null,null,null,null,null,null,null,null,null,null,null,null,null,null,null,null,6,{"$f":"VLOOKUP(Urkunde_1!AG4,Data_PD!A4:U23,16,FALSE)","v":{"$error":"#N/A"}},null,null,null,null,null,null,null,null,null,null,null,null,null,null,null,null,null,null,null,null,null,null,null,null,6,{"$f":"VLOOKUP(Urkunde_1!AG4,Data_PD!A4:U23,16,FALSE)","v":{"$error":"#N/A"}},null,null,null,null,null,null,null,null,null,null,null,null,null,null,null,null,null,null,null,null,null,null,null,null,6,{"$f":"VLOOKUP(Urkunde_1!AG4,Data_PD!A4:U23,16,FALSE)","v":{"$error":"#N/A"}},null,null,null,null,null,null,null,null,null,null,null,null,null,null,null,null,null,null,null,null,null,null,null,null,6,{"$f":"VLOOKUP(Urkunde_1!AG4,Data_PD!A4:U23,16,FALSE)","v":{"$error":"#N/A"}},null,null,null,null,null,null,null,null,null,null,null,null,null,null,null,null,null,null,null,null,null,null,null,null,6,{"$f":"CONCATENATE(\"Der Nachweis ist gültig bis \",TEXT(Doku!CC34+1095,\"TT.MM.JJJJ\"))","v":"Der Nachweis ist gültig bis 30.12.1902"},null,null,null,null,null,null,null,null,null,null,null,null,null,null,null,null,null,null,null,null,null,null,null,null,6,{"$f":"CONCATENATE(\"Der Nachweis ist gültig bis \",TEXT(Doku!OC34+1095,\"TT.MM.JJJJ\"))","v":"Der Nachweis ist gültig bis 30.12.1902"},null,null,null,null,null,null,null,null,null,null,null,null,null,null,null,null,null,null,null,null,null,null,null,null,6,{"$f":"CONCATENATE(\"Der Nachweis ist gültig bis \",TEXT(Doku!PC34+1095,\"TT.MM.JJJJ\"))","v":"Der Nachweis ist gültig bis 30.12.1902"},null,null,null,null,null,null,null,null,null,null,null,null,null,null,null,null,null,null,null,null,null,null,null,null,6,{"$f":"CONCATENATE(\"Der Nachweis ist gültig bis \",TEXT(Doku!QC34+1095,\"TT.MM.JJJJ\"))","v":"Der Nachweis ist gültig bis 30.12.1902"}]
[7,null,null,null,null,null,null,null,null,null,null,null,null,null,null,null,null,null,null,null,null,null,null,null,null,null,7,null,null,null,null,null,null,null,null,null,null,null,null,null,null,null,null,null,null,null,null,null,null,null,null,null,7,null,null,null,null,null,null,null,null,null,null,null,null,null,null,null,null,null,null,null,null,null,null,null,null,null,7,null,null,null,null,null,null,null,null,null,null,null,null,null,null,null,null,null,null,null,null,null,null,null,null,null,7,null,null,null,null,null,null,null,null,null,null,null,null,null,null,null,null,null,null,null,null,null,null,null,null,null,7,null,null,null,null,null,null,null,null,null,null,null,null,null,null,null,null,null,null,null,null,null,null,null,null,null,7,null,null,null,null,null,null,null,null,null,null,null,null,null,null,null,null,null,null,null,null,null,null,null,null,null,7,null,null,null,null,null,null,null,null,null,null,null,null,null,null,null,null,null,null,null,null,null,null,null,null,null,7,null,null,null,null,null,null,null,null,null,null,null,null,null,null,null,null,null,null,null,null,null,null,null,null,null,7,null,null,null,null,null,null,null,null,null,null,null,null,null,null,null,null,null,null,null,null,null,null,null,null,null,7,null,null,null,null,null,null,null,null,null,null,null,null,null,null,null,null,null,null,null,null,null,null,null,null,null,7,null,null,null,null,null,null,null,null,null,null,null,null,null,null,null,null,null,null,null,null,null,null,null,null,null,7,null,null,null,null,null,null,null,null,null,null,null,null,null,null,null,null,null,null,null,null,null,null,null,null,null,7,null,null,null,null,null,null,null,null,null,null,null,null,null,null,null,null,null,null,null,null,null,null,null,null,null,7,null,null,null,null,null,null,null,null,null,null,null,null,null,null,null,null,null,null,null,null,null,null,null,null,null,7,null,null,null,null,null,null,null,null,null,null,null,null,null,null,null,null,null,null,null,null,null,null,null,null,null,7,null,null,null,null,null,null,null,null,null,null,null,null,null,null,null,null,null,null,null,null,null,null,null,null,null,7,null,null,null,null,null,null,null,null,null,null,null,null,null,null,null,null,null,null,null,null,null,null,null,null,null,7,null,null,null,null,null,null,null,null,null,null,null,null,null,null,null,null,null,null,null,null,null,null,null,null,null,7]
[8,"Name",null,null,null,null,null,null,null,null,null,null,null,null,null,null,null,null,null,null,null,null,null,null,null,null,8,"Name",null,null,null,null,null,null,null,null,null,null,null,null,null,null,null,null,null,null,null,null,null,null,null,null,8,"Name",null,null,null,null,null,null,null,null,null,null,null,null,null,null,null,null,null,null,null,null,null,null,null,null,8,"Name",null,null,null,null,null,null,null,null,null,null,null,null,null,null,null,null,null,null,null,null,null,null,null,null,8,"Name",null,null,null,null,null,null,null,null,null,null,null,null,null,null,null,null,null,null,null,null,null,null,null,null,8,"Name",null,null,null,null,null,null,null,null,null,null,null,null,null,null,null,null,null,null,null,null,null,null,null,null,8,"Name",null,null,null,null,null,null,null,null,null,null,null,null,null,null,null,null,null,null,null,null,null,null,null,null,8,"Name",null,null,null,null,null,null,null,null,null,null,null,null,null,null,null,null,null,null,null,null,null,null,null,null,8,"Name",null,null,null,null,null,null,null,null,null,null,null,null,null,null,null,null,null,null,null,null,null,null,null,null,8,"Name",null,null,null,null,null,null,null,null,null,null,null,null,null,null,null,null,null,null,null,null,null,null,null,null,8,"Name",null,null,null,null,null,null,null,null,null,null,null,null,null,null,null,null,null,null,null,null,null,null,null,null,8,"Name",null,null,null,null,null,null,null,null,null,null,null,null,null,null,null,null,null,null,null,null,null,null,null,null,8,"Name",null,null,null,null,null,null,null,null,null,null,null,null,null,null,null,null,null,null,null,null,null,null,null,null,8,"Name",null,null,null,null,null,null,null,null,null,null,null,null,null,null,null,null,null,null,null,null,null,null,null,null,8,"Name",null,null,null,null,null,null,null,null,null,null,null,null,null,null,null,null,null,null,null,null,null,null,null,null,8,"Name",null,null,null,null,null,null,null,null,null,null,null,null,null,null,null,null,null,null,null,null,null,null,null,null,8,"Name",null,null,null,null,null,null,null,null,null,null,null,null,null,null,null,null,null,null,null,null,null,null,null,null,8,"Name",null,null,null,null,null,null,null,null,null,null,null,null,null,null,null,null,null,null,null,null,null,null,null,null,8,"Name",null,null,null,null,null,null,null,null,null,null,null,null,null,null,null,null,null,null,null,null,null,null,null,null,8,"Name"]
[9,"Name",null,null,null,null,null,null,null,null,null,null,null,null,null,null,null,null,null,null,null,null,null,null,null,null,9,"Name",null,null,null,null,null,null,null,null,null,null,null,null,null,null,null,null,null,null,null,null,null,null,null,null,9,"Name",null,null,null,null,null,null,null,null,null,null,null,null,null,null,null,null,null,null,null,null,null,null,null,null,9,"Name",null,null,null,null,null,null,null,null,null,null,null,null,null,null,null,null,null,null,null,null,null,null,null,null,9,"Name",null,null,null,null,null,null,null,null,null,null,null,null,null,null,null,null,null,null,null,null,null,null,null,null,9,"Name",null,null,null,null,null,null,null,null,null,null,null,null,null,null,null,null,null,null,null,null,null,null,null,null,9,"Name",null,null,null,null,null,null,null,null,null,null,null,null,null,null,null,null,null,null,null,null,null,null,null,null,9,"Name",null,null,null,null,null,null,null,null,null,null,null,null,null,null,null,null,null,null,null,null,null,null,null,null,9,"Name",null,null,null,null,null,null,null,null,null,null,null,null,null,null,null,null,null,null,null,null,null,null,null,null,9,"Name",null,null,null,null,null,null,null,null,null,null,null,null,null,null,null,null,null,null,null,null,null,null,null,null,9,"Name",null,null,null,null,null,null,null,null,null,null,null,null,null,null,null,null,null,null,null,null,null,null,null,null,9,"Name",null,null,null,null,null,null,null,null,null,null,null,null,null,null,null,null,null,null,null,null,null,null,null,null,9,"Name",null,null,null,null,null,null,null,null,null,null,null,null,null,null,null,null,null,null,null,null,null,null,null,null,9,"Name",null,null,null,null,null,null,null,null,null,null,null,null,null,null,null,null,null,null,null,null,null,null,null,null,9,"Name",null,null,null,null,null,null,null,null,null,null,null,null,null,null,null,null,null,null,null,null,null,null,null,null,9,"Name",null,null,null,null,null,null,null,null,null,null,null,null,null,null,null,null,null,null,null,null,null,null,null,null,9,"Name",null,null,null,null,null,null,null,null,null,null,null,null,null,null,null,null,null,null,null,null,null,null,null,null,9,"Name",null,null,null,null,null,null,null,null,null,null,null,null,null,null,null,null,null,null,null,null,null,null,null,null,9,"Name",null,null,null,null,null,null,null,null,null,null,null,null,null,null,null,null,null,null,null,null,null,null,null,null,9,"Name"]
[10,null,null,null,null,null,null,null,null,null,null,null,null,null,null,null,null,null,null,null,null,null,null,null,null,null,10,null,null,null,null,null,null,null,null,null,null,null,null,null,null,null,null,null,null,null,null,null,null,null,null,null,10,null,null,null,null,null,null,null,null,null,null,null,null,null,null,null,null,null,null,null,null,null,null,null,null,null,10,null,null,null,null,null,null,null,null,null,null,null,null,null,null,null,null,null,null,null,null,null,null,null,null,null,10,null,null,null,null,null,null,null,null,null,null,null,null,null,null,null,null,null,null,null,null,null,null,null,null,null,10,null,null,null,null,null,null,null,null,null,null,null,null,null,null,null,null,null,null,null,null,null,null,null,null,null,10,null,null,null,null,null,null,null,null,null,null,null,null,null,null,null,null,null,null,null,null,null,null,null,null,null,10,null,null,null,null,null,null,null,null,null,null,null,null,null,null,null,null,null,null,null,null,null,null,null,null,null,10,null,null,null,null,null,null,null,null,null,null,null,null,null,null,null,null,null,null,null,null,null,null,null,null,null,10,null,null,null,null,null,null,null,null,null,null,null,null,null,null,null,null,null,null,null,null,null,null,null,null,null,10,null,null,null,null,null,null,null,null,null,null,null,null,null,null,null,null,null,null,null,null,null,null,null,null,null,10,null,null,null,null,null,null,null,null,null,null,null,null,null,null,null,null,null,null,null,null,null,null,null,null,null,10,null,null,null,null,null,null,null,null,null,null,null,null,null,null,null,null,null,null,null,null,null,null,null,null,null,10,null,null,null,null,null,null,null,null,null,null,null,null,null,null,null,null,null,null,null,null,null,null,null,null,null,10,null,null,null,null,null,null,null,null,null,null,null,null,null,null,null,null,null,null,null,null,null,null,null,null,null,10,null,null,null,null,null,null,null,null,null,null,null,null,null,null,null,null,null,null,null,null,null,null,null,null,null,10,null,null,null,null,null,null,null,null,null,null,null,null,null,null,null,null,null,null,null,null,null,null,null,null,null,10,null,null,null,null,null,null,null,null,null,null,null,null,null,null,null,null,null,null,null,null,null,null,null,null,null,10,null,null,null,null,null,null,null,null,null,null,null,null,null,null,null,null,null,null,null,null,null,null,null,null,null,10]
[11,"Vorname",null,null,null,null,null,null,null,null,null,null,null,null,null,null,null,null,null,null,null,null,null,null,null,null,11,"Vorname",null,null,null,null,null,null,null,null,null,null,null,null,null,null,null,null,null,null,null,null,null,null,null,null,11,"Vorname",null,null,null,null,null,null,null,null,null,null,null,null,null,null,null,null,null,null,null,null,null,null,null,null,11,"Vorname",null,null,null,null,null,null,null,null,null,null,null,null,null,null,null,null,null,null,null,null,null,null,null,null,11,"Vorname",null,null,null,null,null,null,null,null,null,null,null,null,null,null,null,null,null,null,null,null,null,null,null,null,11,"Vorname",null,null,null,null,null,null,null,null,null,null,null,null,null,null,null,null,null,null,null,null,null,null,null,null,11,"Vorname",null,null,null,null,null,null,null,null,null,null,null,null,null,null,null,null,null,null,null,null,null,null,null,null,11,"Vorname",null,null,null,null,null,null,null,null,null,null,null,null,null,null,null,null,null,null,null,null,null,null,null,null,11,"Vorname",null,null,null,null,null,null,null,null,null,null,null,null,null,null,null,null,null,null,null,null,null,null,null,null,11,"Vorname",null,null,null,null,null,null,null,null,null,null,null,null,null,null,null,null,null,null,null,null,null,null,null,null,11,"Vorname",null,null,null,null,null,null,null,null,null,null,null,null,null,null,null,null,null,null,null,null,null,null,null,null,11,"Vorname",null,null,null,null,null,null,null,null,null,null,null,null,null,null,null,null,null,null,null,null,null,null,null,null,11,"Vorname",null,null,null,null,null,null,null,null,null,null,null,null,null,null,null,null,null,null,null,null,null,null,null,null,11,"Vorname",null,null,null,null,null,null,null,null,null,null,null,null,null,null,null,null,null,null,null,null,null,null,null,null,11,"Vorname",null,null,null,null,null,null,null,null,null,null,null,null,null,null,null,null,null,null,null,null,null,null,null,null,11,"Vorname",null,null,null,null,null,null,null,null,null,null,null,null,null,null,null,null,null,null,null,null,null,null,null,null,11,"Vorname",null,null,null,null,null,null,null,null,null,null,null,null,null,null,null,null,null,null,null,null,null,null,null,null,11,"Vorname",null,null,null,null,null,null,null,null,null,null,null,null,null,null,null,null,null,null,null,null,null,null,null,null,11,"Vorname",null,null,null,null,null,null,null,null,null,null,null,null,null,null,null,null,null,null,null,null,null,null,null,null,11,"Vorname"]
[12,"Vorname",null,null,null,null,null,null,null,null,null,null,null,null,null,null,null,null,null,null,null,null,null,null,null,null,12,"Vorname",null,null,null,null,null,null,null,null,null,null,null,null,null,null,null,null,null,null,null,null,null,null,null,null,12,"Vorname",null,null,null,null,null,null,null,null,null,null,null,null,null,null,null,null,null,null,null,null,null,null,null,null,12,"Vorname",null,null,null,null,null,null,null,null,null,null,null,null,null,null,null,null,null,null,null,null,null,null,null,null,12,"Vorname",null,null,null,null,null,null,null,null,null,null,null,null,null,null,null,null,null,null,null,null,null,null,null,null,12,"Vorname",null,null,null,null,null,null,null,null,null,null,null,null,null,null,null,null,null,null,null,null,null,null,null,null,12,"Vorname",null,null,null,null,null,null,null,null,null,null,null,null,null,null,null,null,null,null,null,null,null,null,null,null,12,"Vorname",null,null,null,null,null,null,null,null,null,null,null,null,null,null,null,null,null,null,null,null,null,null,null,null,12,"Vorname",null,null,null,null,null,null,null,null,null,null,null,null,null,null,null,null,null,null,null,null,null,null,null,null,12,"Vorname",null,null,null,null,null,null,null,null,null,null,null,null,null,null,null,null,null,null,null,null,null,null,null,null,12,"Vorname",null,null,null,null,null,null,null,null,null,null,null,null,null,null,null,null,null,null,null,null,null,null,null,null,12,"Vorname",null,null,null,null,null,null,null,null,null,null,null,null,null,null,null,null,null,null,null,null,null,null,null,null,12,"Vorname",null,null,null,null,null,null,null,null,null,null,null,null,null,null,null,null,null,null,null,null,null,null,null,null,12,"Vorname",null,null,null,null,null,null,null,null,null,null,null,null,null,null,null,null,null,null,null,null,null,null,null,null,12,"Vorname",null,null,null,null,null,null,null,null,null,null,null,null,null,null,null,null,null,null,null,null,null,null,null,null,12,"Vorname",null,null,null,null,null,null,null,null,null,null,null,null,null,null,null,null,null,null,null,null,null,null,null,null,12,"Vorname",null,null,null,null,null,null,null,null,null,null,null,null,null,null,null,null,null,null,null,null,null,null,null,null,12,"Vorname",null,null,null,null,null,null,null,null,null,null,null,null,null,null,null,null,null,null,null,null,null,null,null,null,12,"Vorname",null,null,null,null,null,null,null,null,null,null,null,null,null,null,null,null,null,null,null,null,null,null,null,null,12,"Vorname"]
[13,null,null,null,null,null,null,null,null,null,null,null,null,null,null,null,null,null,null,null,null,null,null,null,null,null,13,null,null,null,null,null,null,null,null,null,null,null,null,null,null,null,null,null,null,null,null,null,null,null,null,null,13,null,null,null,null,null,null,null,null,null,null,null,null,null,null,null,null,null,null,null,null,null,null,null,null,null,13,null,null,null,null,null,null,null,null,null,null,null,null,null,null,null,null,null,null,null,null,null,null,null,null,null,13,null,null,null,null,null,null,null,null,null,null,null,null,null,null,null,null,null,null,null,null,null,null,null,null,null,13,null,null,null,null,null,null,null,null,null,null,null,null,null,null,null,null,null,null,null,null,null,null,null,null,null,13,null,null,null,null,null,null,null,null,null,null,null,null,null,null,null,null,null,null,null,null,null,null,null,null,null,13,null,null,null,null,null,null,null,null,null,null,null,null,null,null,null,null,null,null,null,null,null,null,null,null,null,13,null,null,null,null,null,null,null,null,null,null,null,null,null,null,null,null,null,null,null,null,null,null,null,null,null,13,null,null,null,null,null,null,null,null,null,null,null,null,null,null,null,null,null,null,null,null,null,null,null,null,null,13,null,null,null,null,null,null,null,null,null,null,null,null,null,null,null,null,null,null,null,null,null,null,null,null,null,13,null,null,null,null,null,null,null,null,null,null,null,null,null,null,null,null,null,null,null,null,null,null,null,null,null,13,null,null,null,null,null,null,null,null,null,null,null,null,null,null,null,null,null,null,null,null,null,null,null,null,null,13,null,null,null,null,null,null,null,null,null,null,null,null,null,null,null,null,null,null,null,null,null,null,null,null,null,13,null,null,null,null,null,null,null,null,null,null,null,null,null,null,null,null,null,null,null,null,null,null,null,null,null,13,null,null,null,null,null,null,null,null,null,null,null,null,null,null,null,null,null,null,null,null,null,null,null,null,null,13,null,null,null,null,null,null,null,null,null,null,null,null,null,null,null,null,null,null,null,null,null,null,null,null,null,13,null,null,null,null,null,null,null,null,null,null,null,null,null,null,null,null,null,null,null,null,null,null,null,null,null,13,null,null,null,null,null,null,null,null,null,null,null,null,null,null,null,null,null,null,null,null,null,null,null,null,null,13]
[14,"Geburtsdatum",null,null,null,null,null,null,null,null,null,null,null,null,null,null,null,null,null,null,null,null,null,null,null,null,14,"Geburtsdatum",null,null,null,null,null,null,null,null,null,null,null,null,null,null,null,null,null,null,null,null,null,null,null,null,14,"Geburtsdatum",null,null,null,null,null,null,null,null,null,null,null,null,null,null,null,null,null,null,null,null,null,null,null,null,14,"Geburtsdatum",null,null,null,null,null,null,null,null,null,null,null,null,null,null,null,null,null,null,null,null,null,null,null,null,14,"Geburtsdatum",null,null,null,null,null,null,null,null,null,null,null,null,null,null,null,null,null,null,null,null,null,null,null,null,14,"Geburtsdatum",null,null,null,null,null,null,null,null,null,null,null,null,null,null,null,null,null,null,null,null,null,null,null,null,14,"Geburtsdatum",null,null,null,null,null,null,null,null,null,null,null,null,null,null,null,null,null,null,null,null,null,null,null,null,14,"Geburtsdatum",null,null,null,null,null,null,null,null,null,null,null,null,null,null,null,null,null,null,null,null,null,null,null,null,14,"Geburtsdatum",null,null,null,null,null,null,null,null,null,null,null,null,null,null,null,null,null,null,null,null,null,null,null,null,14,"Geburtsdatum",null,null,null,null,null,null,null,null,null,null,null,null,null,null,null,null,null,null,null,null,null,null,null,null,14,"Geburtsdatum",null,null,null,null,null,null,null,null,null,null,null,null,null,null,null,null,null,null,null,null,null,null,null,null,14,"Geburtsdatum",null,null,null,null,null,null,null,null,null,null,null,null,null,null,null,null,null,null,null,null,null,null,null,null,14,"Geburtsdatum",null,null,null,null,null,null,null,null,null,null,null,null,null,null,null,null,null,null,null,null,null,null,null,null,14,"Geburtsdatum",null,null,null,null,null,null,null,null,null,null,null,null,null,null,null,null,null,null,null,null,null,null,null,null,14,"Geburtsdatum",null,null,null,null,null,null,null,null,null,null,null,null,null,null,null,null,null,null,null,null,null,null,null,null,14,"Geburtsdatum",null,null,null,null,null,null,null,null,null,null,null,null,null,null,null,null,null,null,null,null,null,null,null,null,14,"Geburtsdatum",null,null,null,null,null,null,null,null,null,null,null,null,null,null,null,null,null,null,null,null,null,null,null,null,14,"Geburtsdatum",null,null,null,null,null,null,null,null,null,null,null,null,null,null,null,null,null,null,null,null,null,null,null,null,14,"Geburtsdatum",null,null,null,null,null,null,null,null,null,null,null,null,null,null,null,null,null,null,null,null,null,null,null,null,14,"Geburtsdatum"]
[15,"Geburtsdatum",null,null,null,null,null,null,null,null,null,null,null,null,null,null,null,null,null,null,null,null,null,null,null,null,15,"Geburtsdatum",null,null,null,null,null,null,null,null,null,null,null,null,null,null,null,null,null,null,null,null,null,null,null,null,15,"Geburtsdatum",null,null,null,null,null,null,null,null,null,null,null,null,null,null,null,null,null,null,null,null,null,null,null,null,15,"Geburtsdatum",null,null,null,null,null,null,null,null,null,null,null,null,null,null,null,null,null,null,null,null,null,null,null,null,15,"Geburtsdatum",null,null,null,null,null,null,null,null,null,null,null,null,null,null,null,null,null,null,null,null,null,null,null,null,15,"Geburtsdatum",null,null,null,null,null,null,null,null,null,null,null,null,null,null,null,null,null,null,null,null,null,null,null,null,15,"Geburtsdatum",null,null,null,null,null,null,null,null,null,null,null,null,null,null,null,null,null,null,null,null,null,null,null,null,15,"Geburtsdatum",null,null,null,null,null,null,null,null,null,null,null,null,null,null,null,null,null,null,null,null,null,null,null,null,15,"Geburtsdatum",null,null,null,null,null,null,null,null,null,null,null,null,null,null,null,null,null,null,null,null,null,null,null,null,15,"Geburtsdatum",null,null,null,null,null,null,null,null,null,null,null,null,null,null,null,null,null,null,null,null,null,null,null,null,15,"Geburtsdatum",null,null,null,null,null,null,null,null,null,null,null,null,null,null,null,null,null,null,null,null,null,null,null,null,15,"Geburtsdatum",null,null,null,null,null,null,null,null,null,null,null,null,null,null,null,null,null,null,null,null,null,null,null,null,15,"Geburtsdatum",null,null,null,null,null,null,null,null,null,null,null,null,null,null,null,null,null,null,null,null,null,null,null,null,15,"Geburtsdatum",null,null,null,null,null,null,null,null,null,null,null,null,null,null,null,null,null,null,null,null,null,null,null,null,15,"Geburtsdatum",null,null,null,null,null,null,null,null,null,null,null,null,null,null,null,null,null,null,null,null,null,null,null,null,15,"Geburtsdatum",null,null,null,null,null,null,null,null,null,null,null,null,null,null,null,null,null,null,null,null,null,null,null,null,15,"Geburtsdatum",null,null,null,null,null,null,null,null,null,null,null,null,null,null,null,null,null,null,null,null,null,null,null,null,15,"Geburtsdatum",null,null,null,null,null,null,null,null,null,null,null,null,null,null,null,null,null,null,null,null,null,null,null,null,15,"Geburtsdatum",null,null,null,null,null,null,null,null,null,null,null,null,null,null,null,null,null,null,null,null,null,null,null,null,15,"Geburtsdatum"]
[16,null,null,null,null,null,null,null,null,null,null,null,null,null,null,null,null,null,null,null,null,null,null,null,null,null,16,null,null,null,null,null,null,null,null,null,null,null,null,null,null,null,null,null,null,null,null,null,null,null,null,null,16,null,null,null,null,null,null,null,null,null,null,null,null,null,null,null,null,null,null,null,null,null,null,null,null,null,16,null,null,null,null,null,null,null,null,null,null,null,null,null,null,null,null,null,null,null,null,null,null,null,null,null,16,null,null,null,null,null,null,null,null,null,null,null,null,null,null,null,null,null,null,null,null,null,null,null,null,null,16,null,null,null,null,null,null,null,null,null,null,null,null,null,null,null,null,null,null,null,null,null,null,null,null,null,16,null,null,null,null,null,null,null,null,null,null,null,null,null,null,null,null,null,null,null,null,null,null,null,null,null,16,null,null,null,null,null,null,null,null,null,null,null,null,null,null,null,null,null,null,null,null,null,null,null,null,null,16,null,null,null,null,null,null,null,null,null,null,null,null,null,null,null,null,null,null,null,null,null,null,null,null,null,16,null,null,null,null,null,null,null,null,null,null,null,null,null,null,null,null,null,null,null,null,null,null,null,null,null,16,null,null,null,null,null,null,null,null,null,null,null,null,null,null,null,null,null,null,null,null,null,null,null,null,null,16,null,null,null,null,null,null,null,null,null,null,null,null,null,null,null,null,null,null,null,null,null,null,null,null,null,16,null,null,null,null,null,null,null,null,null,null,null,null,null,null,null,null,null,null,null,null,null,null,null,null,null,16,null,null,null,null,null,null,null,null,null,null,null,null,null,null,null,null,null,null,null,null,null,null,null,null,null,16,null,null,null,null,null,null,null,null,null,null,null,null,null,null,null,null,null,null,null,null,null,null,null,null,null,16,null,null,null,null,null,null,null,null,null,null,null,null,null,null,null,null,null,null,null,null,null,null,null,null,null,16,null,null,null,null,null,null,null,null,null,null,null,null,null,null,null,null,null,null,null,null,null,null,null,null,null,16,null,null,null,null,null,null,null,null,null,null,null,null,null,null,null,null,null,null,null,null,null,null,null,null,null,16,null,null,null,null,null,null,null,null,null,null,null,null,null,null,null,null,null,null,null,null,null,null,null,null,null,16]
[17,null,null,null,null,null,null,null,null,null,null,null,null,null,null,null,null,null,null,null,null,null,null,null,null,null,17,null,null,null,null,null,null,null,null,null,null,null,null,null,null,null,null,null,null,null,null,null,null,null,null,null,17,null,null,null,null,null,null,null,null,null,null,null,null,null,null,null,null,null,null,null,null,null,null,null,null,null,17,null,null,null,null,null,null,null,null,null,null,null,null,null,null,null,null,null,null,null,null,null,null,null,null,null,17,null,null,null,null,null,null,null,null,null,null,null,null,null,null,null,null,null,null,null,null,null,null,null,null,null,17,null,null,null,null,null,null,null,null,null,null,null,null,null,null,null,null,null,null,null,null,null,null,null,null,null,17,null,null,null,null,null,null,null,null,null,null,null,null,null,null,null,null,null,null,null,null,null,null,null,null,null,17,null,null,null,null,null,null,null,null,null,null,null,null,null,null,null,null,null,null,null,null,null,null,null,null,null,17,null,null,null,null,null,null,null,null,null,null,null,null,null,null,null,null,null,null,null,null,null,null,null,null,null,17,null,null,null,null,null,null,null,null,null,null,null,null,null,null,null,null,null,null,null,null,null,null,null,null,null,17,null,null,null,null,null,null,null,null,null,null,null,null,null,null,null,null,null,null,null,null,null,null,null,null,null,17,"hat die Sanitätsausbildung A (Sanitätshelfer)",null,null,null,null,null,null,null,null,null,null,null,null,null,null,null,null,null,null,null,null,null,null,null,null,17,"hat die Sanitätsausbildung B (Sanitäter)",null,null,null,null,null,null,null,null,null,null,null,null,null,null,null,null,null,null,null,null,null,null,null,null,17,null,null,null,null,null,null,null,null,null,null,null,null,null,null,null,null,null,null,null,null,null,null,null,null,null,17,"hat den RUND-Grundkurs mit",null,null,null,null,null,null,null,null,null,null,null,null,null,null,null,null,null,null,null,null,null,null,null,null,17,"hat den RUND-Aufbaukurs mit",null,null,null,null,null,null,null,null,null,null,null,null,null,null,null,null,null,null,null,null,null,null,null,null,17,null,null,null,null,null,null,null,null,null,null,null,null,null,null,null,null,null,null,null,null,null,null,null,null,null,17,"hat an einer Sanitätsfortbildung für",null,null,null,null,null,null,null,null,null,null,null,null,null,null,null,null,null,null,null,null,null,null,null,null,17,null,null,null,null,null,null,null,null,null,null,null,null,null,null,null,null,null,null,null,null,null,null,null,null,null,17]
[18,null,null,null,null,null,null,null,null,null,null,null,null,null,null,null,null,null,null,null,null,null,null,null,null,null,18,null,null,null,null,null,null,null,null,null,null,null,null,null,null,null,null,null,null,null,null,null,null,null,null,null,18,null,null,null,null,null,null,null,null,null,null,null,null,null,null,null,null,null,null,null,null,null,null,null,null,null,18,null,null,null,null,null,null,null,null,null,null,null,null,null,null,null,null,null,null,null,null,null,null,null,null,null,18,null,null,null,null,null,null,null,null,null,null,null,null,null,null,null,null,null,null,null,null,null,null,null,null,null,18,null,null,null,null,null,null,null,null,null,null,null,null,null,null,null,null,null,null,null,null,null,null,null,null,null,18,null,null,null,null,null,null,null,null,null,null,null,null,null,null,null,null,null,null,null,null,null,null,null,null,null,18,null,null,null,null,null,null,null,null,null,null,null,null,null,null,null,null,null,null,null,null,null,null,null,null,null,18,null,null,null,null,null,null,null,null,null,null,null,null,null,null,null,null,null,null,null,null,null,null,null,null,null,18,null,null,null,null,null,null,null,null,null,null,null,null,null,null,null,null,null,null,null,null,null,null,null,null,null,18,null,null,null,null,null,null,null,null,null,null,null,null,null,null,null,null,null,null,null,null,null,null,null,null,null,18,"mit mindestens 24 Lerneinheiten",null,null,null,null,null,null,null,null,null,null,null,null,null,null,null,null,null,null,null,null,null,null,null,null,18,"mit mindestens 24 Lerneinheiten",null,null,null,null,null,null,null,null,null,null,null,null,null,null,null,null,null,null,null,null,null,null,null,null,18,null,null,null,null,null,null,null,null,null,null,null,null,null,null,null,null,null,null,null,null,null,null,null,null,null,18,"mindestens 16 Lerneinheiten",null,null,null,null,null,null,null,null,null,null,null,null,null,null,null,null,null,null,null,null,null,null,null,null,18,"mindestens 16 Lerneinheiten",null,null,null,null,null,null,null,null,null,null,null,null,null,null,null,null,null,null,null,null,null,null,null,null,18,null,null,null,null,null,null,null,null,null,null,null,null,null,null,null,null,null,null,null,null,null,null,null,null,null,18,"sämtliche Sanitätsausbildungen",null,null,null,null,null,null,null,null,null,null,null,null,null,null,null,null,null,null,null,null,null,null,null,null,18,null,null,null,null,null,null,null,null,null,null,null,null,null,null,null,null,null,null,null,null,null,null,null,null,null,18]
[19,null,null,null,null,null,null,null,null,null,null,null,null,null,null,null,null,null,null,null,null,null,null,null,null,null,19,null,null,null,null,null,null,null,null,null,null,null,null,null,null,null,null,null,null,null,null,null,null,null,null,null,19,null,null,null,null,null,null,null,null,null,null,null,null,null,null,null,null,null,null,null,null,null,null,null,null,null,19,null,null,null,null,null,null,null,null,null,null,null,null,null,null,null,null,null,null,null,null,null,null,null,null,null,19,null,null,null,null,null,null,null,null,null,null,null,null,null,null,null,null,null,null,null,null,null,null,null,null,null,19,null,null,null,null,null,null,null,null,null,null,null,null,null,null,null,null,null,null,null,null,null,null,null,null,null,19,null,null,null,null,null,null,null,null,null,null,null,null,null,null,null,null,null,null,null,null,null,null,null,null,null,19,null,null,null,null,null,null,null,null,null,null,null,null,null,null,null,null,null,null,null,null,null,null,null,null,null,19,null,null,null,null,null,null,null,null,null,null,null,null,null,null,null,null,null,null,null,null,null,null,null,null,null,19,null,null,null,null,null,null,null,null,null,null,null,null,null,null,null,null,null,null,null,null,null,null,null,null,null,19,null,null,null,null,null,null,null,null,null,null,null,null,null,null,null,null,null,null,null,null,null,null,null,null,null,19,"erfolgreich abgeschlossen.",null,null,null,null,null,null,null,null,null,null,null,null,null,null,null,null,null,null,null,null,null,null,null,null,19,"erfolgreich abgeschlossen.",null,null,null,null,null,null,null,null,null,null,null,null,null,null,null,null,null,null,null,null,null,null,null,null,19,null,null,null,null,null,null,null,null,null,null,null,null,null,null,null,null,null,null,null,null,null,null,null,null,null,19,"erfolgreich abgeschlossen.",null,null,null,null,null,null,null,null,null,null,null,null,null,null,null,null,null,null,null,null,null,null,null,null,19,"erfolgreich abgeschlossen.",null,null,null,null,null,null,null,null,null,null,null,null,null,null,null,null,null,null,null,null,null,null,null,null,19,null,null,null,null,null,null,null,null,null,null,null,null,null,null,null,null,null,null,null,null,null,null,null,null,null,19,"erfolgreich teilgenommen.",null,null,null,null,null,null,null,null,null,null,null,null,null,null,null,null,null,null,null,null,null,null,null,null,19,null,null,null,null,null,null,null,null,null,null,null,null,null,null,null,null,null,null,null,null,null,null,null,null,null,19]
[20,null,null,null,null,null,null,null,null,null,null,null,null,null,null,null,null,null,null,null,null,null,null,null,null,null,20,null,null,null,null,null,null,null,null,null,null,null,null,null,null,null,null,null,null,null,null,null,null,null,null,null,20,null,null,null,null,null,null,null,null,null,null,null,null,null,null,null,null,null,null,null,null,null,null,null,null,null,20,null,null,null,null,null,null,null,null,null,null,null,null,null,null,null,null,null,null,null,null,null,null,null,null,null,20,null,null,null,null,null,null,null,null,null,null,null,null,null,null,null,null,null,null,null,null,null,null,null,null,null,20,null,null,null,null,null,null,null,null,null,null,null,null,null,null,null,null,null,null,null,null,null,null,null,null,null,20,null,null,null,null,null,null,null,null,null,null,null,null,null,null,null,null,null,null,null,null,null,null,null,null,null,20,null,null,null,null,null,null,null,null,null,null,null,null,null,null,null,null,null,null,null,null,null,null,null,null,null,20,null,null,null,null,null,null,null,null,null,null,null,null,null,null,null,null,null,null,null,null,null,null,null,null,null,20,null,null,null,null,null,null,null,null,null,null,null,null,null,null,null,null,null,null,null,null,null,null,null,null,null,20,null,null,null,null,null,null,null,null,null,null,null,null,null,null,null,null,null,null,null,null,null,null,null,null,null,20,"1 Lerneinheit (LE) = 45 Minuten.",null,null,null,null,null,null,null,null,null,null,null,null,null,null,null,null,null,null,null,null,null,null,null,null,20,"1 Lerneinheit (LE) = 45 Minuten.",null,null,null,null,null,null,null,null,null,null,null,null,null,null,null,null,null,null,null,null,null,null,null,null,20,null,null,null,null,null,null,null,null,null,null,null,null,null,null,null,null,null,null,null,null,null,null,null,null,null,20,"1 Lerneinheit (LE) = 45 Minuten.",null,null,null,null,null,null,null,null,null,null,null,null,null,null,null,null,null,null,null,null,null,null,null,null,20,"1 Lerneinheit (LE) = 45 Minuten.",null,null,null,null,null,null,null,null,null,null,null,null,null,null,null,null,null,null,null,null,null,null,null,null,20,null,null,null,null,null,null,null,null,null,null,null,null,null,null,null,null,null,null,null,null,null,null,null,null,null,20,{"$f":"CONCATENATE(\"Diese Fortbildung umfasste \",QY83,\" Lerneinheiten (LE).\")","v":"Diese Fortbildung umfasste 12 Lerneinheiten (LE)."},null,null,null,null,null,null,null,null,null,null,null,null,null,null,null,null,null,null,null,null,null,null,null,null,20,null,null,null,null,null,null,null,null,null,null,null,null,null,null,null,null,null,null,null,null,null,null,null,null,null,20]
[21,null,null,null,null,null,null,null,null,null,null,null,null,null,null,null,null,null,null,null,null,null,null,null,null,null,21,null,null,null,null,null,null,null,null,null,null,null,null,null,null,null,null,null,null,null,null,null,null,null,null,null,21,null,null,null,null,null,null,null,null,null,null,null,null,null,null,null,null,null,null,null,null,null,null,null,null,null,21,null,null,null,null,null,null,null,null,null,null,null,null,null,null,null,null,null,null,null,null,null,null,null,null,null,21,null,null,null,null,null,null,null,null,null,null,null,null,null,null,null,null,null,null,null,null,null,null,null,null,null,21,null,null,null,null,null,null,null,null,null,null,null,null,null,null,null,null,null,null,null,null,null,null,null,null,null,21,null,null,null,null,null,null,null,null,null,null,null,null,null,null,null,null,null,null,null,null,null,null,null,null,null,21,null,null,null,null,null,null,null,null,null,null,null,null,null,null,null,null,null,null,null,null,null,null,null,null,null,21,null,null,null,null,null,null,null,null,null,null,null,null,null,null,null,null,null,null,null,null,null,null,null,null,null,21,null,null,null,null,null,null,null,null,null,null,null,null,null,null,null,null,null,null,null,null,null,null,null,null,null,21,null,null,null,null,null,null,null,null,null,null,null,null,null,null,null,null,null,null,null,null,null,null,null,null,null,21,null,null,null,null,null,null,null,null,null,null,null,null,null,null,null,null,null,null,null,null,null,null,null,null,null,21,null,null,null,null,null,null,null,null,null,null,null,null,null,null,null,null,null,null,null,null,null,null,null,null,null,21,null,null,null,null,null,null,null,null,null,null,null,null,null,null,null,null,null,null,null,null,null,null,null,null,null,21,null,null,null,null,null,null,null,null,null,null,null,null,null,null,null,null,null,null,null,null,null,null,null,null,null,21,null,null,null,null,null,null,null,null,null,null,null,null,null,null,null,null,null,null,null,null,null,null,null,null,null,21,null,null,null,null,null,null,null,null,null,null,null,null,null,null,null,null,null,null,null,null,null,null,null,null,null,21,"Sie  erfolgte gemäß der Ausbildungs- und",null,null,null,null,null,null,null,null,null,null,null,null,null,null,null,null,null,null,null,null,null,null,null,null,21,null,null,null,null,null,null,null,null,null,null,null,null,null,null,null,null,null,null,null,null,null,null,null,null,null,21]
[33,null,null,null,null,null,null,null,null,null,null,null,null,null,null,null,null,null,null,null,null,null,null,null,null,null,33,null,null,null,null,null,null,null,null,null,null,null,null,null,null,null,null,null,null,null,null,null,null,null,null,null,33,null,null,null,null,null,null,null,null,null,null,null,null,null,null,null,null,null,null,null,null,null,null,null,null,null,33,null,null,null,null,null,null,null,null,null,null,null,null,null,null,null,null,null,null,null,null,null,null,null,null,null,33,null,null,null,null,null,null,null,null,null,null,null,null,null,null,null,null,null,null,null,null,null,null,null,null,null,33,null,null,null,null,null,null,null,null,null,null,null,null,null,null,null,null,null,null,null,null,null,null,null,null,null,33,null,null,null,null,null,null,null,null,null,null,null,null,null,null,null,null,null,null,null,null,null,null,null,null,null,33,null,null,null,null,null,null,null,null,null,null,null,null,null,null,null,null,null,null,null,null,null,null,null,null,null,33,null,null,null,null,null,null,null,null,null,null,null,null,null,null,null,null,null,null,null,null,null,null,null,null,null,33,null,null,null,null,null,null,null,null,null,null,null,null,null,null,null,null,null,null,null,null,null,null,null,null,null,33,null,null,null,null,null,null,null,null,null,null,null,null,null,null,null,null,null,null,null,null,null,null,null,null,null,33,null,null,null,null,null,null,null,null,null,null,null,null,null,null,null,null,null,null,null,null,null,null,null,null,null,33,null,null,null,null,null,null,null,null,null,null,null,null,null,null,null,null,null,null,null,null,null,null,null,null,null,33,null,null,null,null,null,null,null,null,null,null,null,null,null,null,null,null,null,null,null,null,null,null,null,null,null,33,null,null,null,null,null,null,null,null,null,null,null,null,null,null,null,null,null,null,null,null,null,null,null,null,null,33,null,null,null,null,null,null,null,null,null,null,null,null,null,null,null,null,null,null,null,null,null,null,null,null,null,33,null,null,null,null,null,null,null,null,null,null,null,null,null,null,null,null,null,null,null,null,null,null,null,null,null,33,"Prüfungsordnung Medizin der DLRG.",null,null,null,null,null,null,null,null,null,null,null,null,null,null,null,null,null,null,null,null,null,null,null,null,33,null,null,null,null,null,null,null,null,null,null,null,null,null,null,null,null,null,null,null,null,null,null,null,null,null,33]
[]
[null,{"$f":"IF(Doku!$BZ$18<>\"\",CONCATENATE(Doku!$BR$18,\" \",Doku!$BZ$18,\"\"))","v":false},null,null,null,null,null,null,null,null,null,null,null,null,null,null,{"$f":"IF(Doku!$Y$34<>\"\",Doku!$Y$34,\"\")","v":""},null,null,null,null,{"$f":"IF(Doku!$CC$34<>\"\",Doku!$CC$34,\"\")","v":""},null,null,null,null,null,{"$f":"IF(Doku!$BZ$18<>\"\",CONCATENATE(Doku!$BR$18,\" \",Doku!$BZ$18,\"\"))","v":false},null,null,null,null,null,null,null,null,null,null,null,null,null,null,{"$f":"IF(Doku!$Y$34<>\"\",Doku!$Y$34,\"\")","v":""},null,null,null,null,{"$f":"IF(Doku!$CC$34<>\"\",Doku!$CC$34,\"\")","v":""},null,null,null,null,null,{"$f":"IF(Doku!$BZ$18<>\"\",CONCATENATE(Doku!$BR$18,\" \",Doku!$BZ$18,\"\"))","v":false},null,null,null,null,null,null,null,null,null,null,null,null,null,null,{"$f":"IF(Doku!$Y$34<>\"\",Doku!$Y$34,\"\")","v":""},null,null,null,null,{"$f":"IF(Doku!$CC$34<>\"\",Doku!$CC$34,\"\")","v":""},null,null,null,null,null,{"$f":"IF(Doku!$BZ$18<>\"\",CONCATENATE(Doku!$BR$18,\" \",Doku!$BZ$18,\"\"))","v":false},null,null,null,null,null,null,null,null,null,null,null,null,null,null,{"$f":"IF(Doku!$Y$34<>\"\",Doku!$Y$34,\"\")","v":""},null,null,null,null,{"$f":"IF(Doku!$CC$34<>\"\",Doku!$CC$34,\"\")","v":""},null,null,null,null,null,{"$f":"IF(Doku!$BZ$18<>\"\",CONCATENATE(Doku!$BR$18,\" \",Doku!$BZ$18,\"\"))","v":false},null,null,null,null,null,null,null,null,null,null,null,null,null,null,{"$f":"IF(Doku!$Y$34<>\"\",Doku!$Y$34,\"\")","v":""},null,null,null,null,{"$f":"IF(Doku!$CC$34<>\"\",Doku!$CC$34,\"\")","v":""},null,null,null,null,null,{"$f":"IF(Doku!$BZ$18<>\"\",CONCATENATE(Doku!$BR$18,\" \",Doku!$BZ$18,\"\"))","v":false},null,null,null,null,null,null,null,null,null,null,null,null,null,null,{"$f":"IF(Doku!$Y$34<>\"\",Doku!$Y$34,\"\")","v":""},null,null,null,null,{"$f":"IF(Doku!$CC$34<>\"\",Doku!$CC$34,\"\")","v":""},null,null,null,null,null,{"$f":"IF(Doku!$BZ$18<>\"\",CONCATENATE(Doku!$BR$18,\" \",Doku!$BZ$18,\"\"))","v":false},null,null,null,null,null,null,null,null,null,null,null,null,null,null,{"$f":"IF(Doku!$Y$34<>\"\",Doku!$Y$34,\"\")","v":""},null,null,null,null,{"$f":"IF(Doku!$CC$34<>\"\",Doku!$CC$34,\"\")","v":""},null,null,null,null,null,{"$f":"IF(Doku!$BZ$18<>\"\",CONCATENATE(Doku!$BR$18,\" \",Doku!$BZ$18,\"\"))","v":false},null,null,null,null,null,null,null,null,null,null,null,null,null,null,{"$f":"IF(Doku!$Y$34<>\"\",Doku!$Y$34,\"\")","v":""},null,null,null,null,{"$f":"IF(Doku!$CC$34<>\"\",Doku!$CC$34,\"\")","v":""},null,null,null,null,null,{"$f":"IF(Doku!$BZ$18<>\"\",CONCATENATE(Doku!$BR$18,\" \",Doku!$BZ$18,\"\"))","v":false},null,null,null,null,null,null,null,null,null,null,null,null,null,null,{"$f":"IF(Doku!$Y$34<>\"\",Doku!$Y$34,\"\")","v":""},null,null,null,null,{"$f":"IF(Doku!$CC$34<>\"\",Doku!$CC$34,\"\")","v":""},null,null,null,null,null,{"$f":"IF(Doku!$BZ$18<>\"\",CONCATENATE(Doku!$BR$18,\" \",Doku!$BZ$18,\"\"))","v":false},null,null,null,null,null,null,null,null,null,null,null,null,null,null,{"$f":"IF(Doku!$Y$34<>\"\",Doku!$Y$34,\"\")","v":""},null,null,null,null,{"$f":"IF(Doku!$CC$34<>\"\",Doku!$CC$34,\"\")","v":""},null,null,null,null,null,{"$f":"IF(Doku!$BZ$18<>\"\",CONCATENATE(Doku!$BR$18,\" \",Doku!$BZ$18,\"\"))","v":false},null,null,null,null,null,null,null,null,null,null,null,null,null,null,{"$f":"IF(Doku!$Y$34<>\"\",Doku!$Y$34,\"\")","v":""},null,null,null,null,{"$f":"IF(Doku!$CC$34<>\"\",Doku!$CC$34,\"\")","v":""},null,null,null,null,null,{"$f":"IF(Doku!$BZ$18<>\"\",CONCATENATE(Doku!$BR$18,\" \",Doku!$BZ$18,\"\"))","v":false},null,null,null,null,null,null,null,null,null,null,null,null,null,null,{"$f":"IF(Doku!$Y$34<>\"\",Doku!$Y$34,\"\")","v":""},null,null,null,null,{"$f":"IF(Doku!$CC$34<>\"\",Doku!$CC$34,\"\")","v":""},null,null,null,null,null,{"$f":"IF(Doku!$BZ$18<>\"\",CONCATENATE(Doku!$BR$18,\" \",Doku!$BZ$18,\"\"))","v":false},null,null,null,null,null,null,null,null,null,null,null,null,null,null,{"$f":"IF(Doku!$Y$34<>\"\",Doku!$Y$34,\"\")","v":""},null,null,null,null,{"$f":"IF(Doku!$CC$34<>\"\",Doku!$CC$34,\"\")","v":""},null,null,null,null,null,{"$f":"IF(Doku!$BZ$18<>\"\",CONCATENATE(Doku!$BR$18,\" \",Doku!$BZ$18,\"\"))","v":false},null,null,null,null,null,null,null,null,null,null,null,null,null,null,{"$f":"IF(Doku!$Y$34<>\"\",Doku!$Y$34,\"\")","v":""},null,null,null,null,{"$f":"IF(Doku!$CC$34<>\"\",Doku!$CC$34,\"\")","v":""},null,null,null,null,null,{"$f":"IF(Doku!$BZ$18<>\"\",CONCATENATE(Doku!$BR$18,\" \",Doku!$BZ$18,\"\"))","v":false},null,null,null,null,null,null,null,null,null,null,null,null,null,null,{"$f":"IF(Doku!$Y$34<>\"\",Doku!$Y$34,\"\")","v":""},null,null,null,null,{"$f":"IF(Doku!$CC$34<>\"\",Doku!$CC$34,\"\")","v":""},null,null,null,null,null,{"$f":"IF(Doku!$BZ$18<>\"\",CONCATENATE(Doku!$BR$18,\" \",Doku!$BZ$18,\"\"))","v":false},null,null,null,null,null,null,null,null,null,null,null,null,null,null,{"$f":"IF(Doku!$Y$34<>\"\",Doku!$Y$34,\"\")","v":""},null,null,null,null,{"$f":"IF(Doku!$CC$34<>\"\",Doku!$CC$34,\"\")","v":""},null,null,null,null,null,{"$f":"IF(Doku!$BZ$18<>\"\",CONCATENATE(Doku!$BR$18,\" \",Doku!$BZ$18,\"\"))","v":false},null,null,null,null,null,null,null,null,null,null,null,null,null,null,{"$f":"IF(Doku!$Y$34<>\"\",Doku!$Y$34,\"\")","v":""},null,null,null,null,{"$f":"IF(Doku!$CC$34<>\"\",Doku!$CC$34,\"\")","v":""},null,null,null,null,null,{"$f":"IF(Doku!$BZ$18<>\"\",CONCATENATE(Doku!$BR$18,\" \",Doku!$BZ$18,\"\"))","v":false},null,null,null,null,null,null,null,null,null,null,null,null,null,null,{"$f":"IF(Doku!$Y$34<>\"\",Doku!$Y$34,\"\")","v":""},null,null,null,null,{"$f":"IF(Doku!$CC$34<>\"\",Doku!$CC$34,\"\")","v":""},null,null,null,null,null,{"$f":"IF(Doku!$BZ$18<>\"\",CONCATENATE(Doku!$BR$18,\" \",Doku!$BZ$18,\"\"))","v":false},null,null,null,null,null,null,null,null,null,null,null,null,null,null,{"$f":"IF(Doku!$Y$34<>\"\",Doku!$Y$34,\"\")","v":""},null,null,null,null,{"$f":"IF(Doku!$CC$34<>\"\",Doku!$CC$34,\"\")","v":""},null,null,null,null,null,{"$f":"IF(Doku!$BZ$18<>\"\",CONCATENATE(Doku!$BR$18,\" \",Doku!$BZ$18,\"\"))","v":false},null,null,null,null,null,null,null,null,null,null,null,null,null,null,{"$f":"IF(Doku!$Y$34<>\"\",Doku!$Y$34,\"\")","v":""},null,null,null,null,{"$f":"IF(Doku!$CC$34<>\"\",Doku!$CC$34,\"\")","v":""}]
[null,"Ausbildungsort",null,null,null,null,null,null,null,null,null,null,null,null,null,null,"vom",null,null,null,null,"bis",null,null,null,null,null,"Ausbildungsort",null,null,null,null,null,null,null,null,null,null,null,null,null,null,"vom",null,null,null,null,"bis",null,null,null,null,null,"Ausbildungsort",null,null,null,null,null,null,null,null,null,null,null,null,null,null,"vom",null,null,null,null,"bis",null,null,null,null,null,"Ausbildungsort",null,null,null,null,null,null,null,null,null,null,null,null,null,null,"vom",null,null,null,null,"bis",null,null,null,null,null,"Ausbildungsort",null,null,null,null,null,null,null,null,null,null,null,null,null,null,"vom",null,null,null,null,"bis",null,null,null,null,null,"Ausbildungsort",null,null,null,null,null,null,null,null,null,null,null,null,null,null,"vom",null,null,null,null,"bis",null,null,null,null,null,"Ausbildungsort",null,null,null,null,null,null,null,null,null,null,null,null,null,null,"vom",null,null,null,null,"bis",null,null,null,null,null,"Ausbildungsort",null,null,null,null,null,null,null,null,null,null,null,null,null,null,"vom",null,null,null,null,"bis",null,null,null,null,null,"Ausbildungsort",null,null,null,null,null,null,null,null,null,null,null,null,null,null,"vom",null,null,null,null,"bis",null,null,null,null,null,"Ausbildungsort",null,null,null,null,null,null,null,null,null,null,null,null,null,null,"vom",null,null,null,null,"bis",null,null,null,null,null,"Ausbildungsort",null,null,null,null,null,null,null,null,null,null,null,null,null,null,"vom",null,null,null,null,"bis",null,null,null,null,null,"Ausbildungsort",null,null,null,null,null,null,null,null,null,null,null,null,null,null,"vom",null,null,null,null,"bis",null,null,null,null,null,null,null,null,null,null,null,null,null,null,null,null,null,null,null,null,null,null,null,null,null,null,null,null,null,null,null,"Ausbildungsort",null,null,null,null,null,null,null,null,null,null,null,null,null,null,"vom",null,null,null,null,"bis",null,null,null,null,null,"Ausbildungsort",null,null,null,null,null,null,null,null,null,null,null,null,null,null,"vom",null,null,null,null,"bis",null,null,null,null,null,null,null,null,null,null,null,null,null,null,null,null,null,null,null,null,null,null,null,null,null,null,null,null,null,null,null,"Fortbildungsort",null,null,null,null,null,null,null,null,null,null,null,null,null,null,"vom",null,null,null,null,"bis",null,null,null,null,null,"Fortbildungsort",null,null,null,null,null,null,null,null,null,null,null,null,null,null,"vom",null,null,null,null,"bis",null,null,null,null,null,"Fortbildungsort",null,null,null,null,null,null,null,null,null,null,null,null,null,null,"vom",null,null,null,null,"bis",null,null,null,null,null,"Fortbildungsort",null,null,null,null,null,null,null,null,null,null,null,null,null,null,"vom",null,null,null,null,"bis"]
[]
[null,{"$f":"IF(Doku!$Y$28<>\"\",Doku!$Y$28,\"\")","v":""},null,null,null,null,null,null,null,null,null,null,null,null,null,null,null,null,null,null,null,null,null,null,null,null,null,{"$f":"IF(Doku!$Y$28<>\"\",Doku!$Y$28,\"\")","v":""},null,null,null,null,null,null,null,null,null,null,null,null,null,null,null,null,null,null,null,null,null,null,null,null,null,{"$f":"IF(Doku!$Y$28<>\"\",Doku!$Y$28,\"\")","v":""},null,null,null,null,null,null,null,null,null,null,null,null,null,null,null,null,null,null,null,null,null,null,null,null,null,{"$f":"IF(Doku!$Y$28<>\"\",Doku!$Y$28,\"\")","v":""},null,null,null,null,null,null,null,null,null,null,null,null,null,null,null,null,null,null,null,null,null,null,null,null,null,{"$f":"IF(Doku!$Y$28<>\"\",Doku!$Y$28,\"\")","v":""},null,null,null,null,null,null,null,null,null,null,null,null,null,null,null,null,null,null,null,null,null,null,null,null,null,{"$f":"IF(Doku!$Y$28<>\"\",Doku!$Y$28,\"\")","v":""},null,null,null,null,null,null,null,null,null,null,null,null,null,null,null,null,null,null,null,null,null,null,null,null,null,{"$f":"IF(Doku!$Y$28<>\"\",Doku!$Y$28,\"\")","v":""},null,null,null,null,null,null,null,null,null,null,null,null,null,null,null,null,null,null,null,null,null,null,null,null,null,{"$f":"IF(Doku!$Y$28<>\"\",Doku!$Y$28,\"\")","v":""},null,null,null,null,null,null,null,null,null,null,null,null,null,null,null,null,null,null,null,null,null,null,null,null,null,{"$f":"IF(Doku!$Y$28<>\"\",Doku!$Y$28,\"\")","v":""},null,null,null,null,null,null,null,null,null,null,null,null,null,null,null,null,null,null,null,null,null,null,null,null,null,{"$f":"IF(Doku!$Y$28<>\"\",Doku!$Y$28,\"\")","v":""},null,null,null,null,null,null,null,null,null,null,null,null,null,null,null,null,null,null,null,null,null,null,null,null,null,{"$f":"IF(Doku!$Y$28<>\"\",Doku!$Y$28,\"\")","v":""},null,null,null,null,null,null,null,null,null,null,null,null,null,null,null,null,null,null,null,null,null,null,null,null,null,{"$f":"IF(Doku!$Y$28<>\"\",Doku!$Y$28,\"\")","v":""},null,null,null,null,null,null,null,null,null,null,null,null,null,null,null,null,null,null,null,null,null,null,null,null,null,{"$f":"IF(Doku!$Y$28<>\"\",Doku!$Y$28,\"\")","v":""},null,null,null,null,null,null,null,null,null,null,null,null,null,null,null,null,null,null,null,null,null,null,null,null,null,{"$f":"IF(Doku!$Y$28<>\"\",Doku!$Y$28,\"\")","v":""},null,null,null,null,null,null,null,null,null,null,null,null,null,null,null,null,null,null,null,null,null,null,null,null,null,{"$f":"IF(Doku!$Y$28<>\"\",Doku!$Y$28,\"\")","v":""},null,null,null,null,null,null,null,null,null,null,null,null,null,null,null,null,null,null,null,null,null,null,null,null,null,{"$f":"IF(Doku!$Y$28<>\"\",Doku!$Y$28,\"\")","v":""},null,null,null,null,null,null,null,null,null,null,null,null,null,null,null,null,null,null,null,null,null,null,null,null,null,{"$f":"IF(Doku!$Y$28<>\"\",Doku!$Y$28,\"\")","v":""},null,null,null,null,null,null,null,null,null,null,null,null,null,null,null,null,null,null,null,null,null,null,null,null,null,{"$f":"IF(Doku!$Y$28<>\"\",Doku!$Y$28,\"\")","v":""},null,null,null,null,null,null,null,null,null,null,null,null,null,null,null,null,null,null,null,null,null,null,null,null,null,{"$f":"IF(Doku!$Y$28<>\"\",Doku!$Y$28,\"\")","v":""},null,null,null,null,null,null,null,null,null,null,null,null,null,null,null,null,null,null,null,null,null,null,null,null,null,{"$f":"IF(Doku!$Y$28<>\"\",Doku!$Y$28,\"\")","v":""}]
[null,{"$f":"IF(Doku!$CC$28<>\"\",Doku!$CC$28,\"\")","v":""},null,null,null,null,null,null,null,null,null,null,null,null,null,null,null,null,null,null,null,null,null,null,null,null,null,{"$f":"IF(Doku!$CC$28<>\"\",Doku!$CC$28,\"\")","v":""},null,null,null,null,null,null,null,null,null,null,null,null,null,null,null,null,null,null,null,null,null,null,null,null,null,{"$f":"IF(Doku!$CC$28<>\"\",Doku!$CC$28,\"\")","v":""},null,null,null,null,null,null,null,null,null,null,null,null,null,null,null,null,null,null,null,null,null,null,null,null,null,{"$f":"IF(Doku!$CC$28<>\"\",Doku!$CC$28,\"\")","v":""},null,null,null,null,null,null,null,null,null,null,null,null,null,null,null,null,null,null,null,null,null,null,null,null,null,{"$f":"IF(Doku!$CC$28<>\"\",Doku!$CC$28,\"\")","v":""},null,null,null,null,null,null,null,null,null,null,null,null,null,null,null,null,null,null,null,null,null,null,null,null,null,{"$f":"IF(Doku!$CC$28<>\"\",Doku!$CC$28,\"\")","v":""},null,null,null,null,null,null,null,null,null,null,null,null,null,null,null,null,null,null,null,null,null,null,null,null,null,{"$f":"IF(Doku!$CC$28<>\"\",Doku!$CC$28,\"\")","v":""},null,null,null,null,null,null,null,null,null,null,null,null,null,null,null,null,null,null,null,null,null,null,null,null,null,{"$f":"IF(Doku!$CC$28<>\"\",Doku!$CC$28,\"\")","v":""},null,null,null,null,null,null,null,null,null,null,null,null,null,null,null,null,null,null,null,null,null,null,null,null,null,{"$f":"IF(Doku!$CC$28<>\"\",Doku!$CC$28,\"\")","v":""},null,null,null,null,null,null,null,null,null,null,null,null,null,null,null,null,null,null,null,null,null,null,null,null,null,{"$f":"IF(Doku!$CC$28<>\"\",Doku!$CC$28,\"\")","v":""},null,null,null,null,null,null,null,null,null,null,null,null,null,null,null,null,null,null,null,null,null,null,null,null,null,{"$f":"IF(Doku!$CC$28<>\"\",Doku!$CC$28,\"\")","v":""},null,null,null,null,null,null,null,null,null,null,null,null,null,null,null,null,null,null,null,null,null,null,null,null,null,{"$f":"IF(Doku!$CC$28<>\"\",Doku!$CC$28,\"\")","v":""},null,null,null,null,null,null,null,null,null,null,null,null,null,null,null,null,null,null,null,null,null,null,null,null,null,{"$f":"IF(Doku!$CC$28<>\"\",Doku!$CC$28,\"\")","v":""},null,null,null,null,null,null,null,null,null,null,null,null,null,null,null,null,null,null,null,null,null,null,null,null,null,{"$f":"IF(Doku!$CC$28<>\"\",Doku!$CC$28,\"\")","v":""},null,null,null,null,null,null,null,null,null,null,null,null,null,null,null,null,null,null,null,null,null,null,null,null,null,{"$f":"IF(Doku!$CC$28<>\"\",Doku!$CC$28,\"\")","v":""},null,null,null,null,null,null,null,null,null,null,null,null,null,null,null,null,null,null,null,null,null,null,null,null,null,{"$f":"IF(Doku!$CC$28<>\"\",Doku!$CC$28,\"\")","v":""},null,null,null,null,null,null,null,null,null,null,null,null,null,null,null,null,null,null,null,null,null,null,null,null,null,{"$f":"IF(Doku!$CC$28<>\"\",Doku!$CC$28,\"\")","v":""},null,null,null,null,null,null,null,null,null,null,null,null,null,null,null,null,null,null,null,null,null,null,null,null,null,{"$f":"IF(Doku!$CC$28<>\"\",Doku!$CC$28,\"\")","v":""},null,null,null,null,null,null,null,null,null,null,null,null,null,null,null,null,null,null,null,null,null,null,null,null,null,{"$f":"IF(Doku!$CC$28<>\"\",Doku!$CC$28,\"\")","v":""},null,null,null,null,null,null,null,null,null,null,null,null,null,null,null,null,null,null,null,null,null,null,null,null,null,{"$f":"IF(Doku!$CC$28<>\"\",Doku!$CC$28,\"\")","v":""}]
[null,"Name und Nr. des Lehrbeauftragten",null,null,null,null,null,null,null,null,null,null,null,null,"Unterschrift des Lehrbeauftragten",null,null,null,null,null,null,null,null,null,null,null,null,"Name und Nr. des Lehrbeauftragten",null,null,null,null,null,null,null,null,null,null,null,null,"Unterschrift des Lehrbeauftragten",null,null,null,null,null,null,null,null,null,null,null,null,"Name und Nr. des Lehrbeauftragten",null,null,null,null,null,null,null,null,null,null,null,null,"Unterschrift des Lehrbeauftragten",null,null,null,null,null,null,null,null,null,null,null,null,"Name und Nr. des Lehrbeauftragten",null,null,null,null,null,null,null,null,null,null,null,null,"Unterschrift des Lehrbeauftragten",null,null,null,null,null,null,null,null,null,null,null,null,"Name und Nr. des Lehrbeauftragten",null,null,null,null,null,null,null,null,null,null,null,null,"Unterschrift des Lehrbeauftragten",null,null,null,null,null,null,null,null,null,null,null,null,"Name und Nr. des Ausbilders",null,null,null,null,null,null,null,null,null,null,null,null,"Unterschrift des Ausbilders",null,null,null,null,null,null,null,null,null,null,null,null,"Name und Nr. des Lehrbeauftragten",null,null,null,null,null,null,null,null,null,null,null,null,"Unterschrift des Lehrbeauftragten",null,null,null,null,null,null,null,null,null,null,null,null,"Name und Nr. des Ausbilders",null,null,null,null,null,null,null,null,null,null,null,null,"Unterschrift des Ausbilders",null,null,null,null,null,null,null,null,null,null,null,null,"Name und Nr. des Ausbilders",null,null,null,null,null,null,null,null,null,null,null,null,"Unterschrift des Ausbilders",null,null,null,null,null,null,null,null,null,null,null,null,"Name und Nr. des Multiplikators",null,null,null,null,null,null,null,null,null,null,null,null,"Unterschrift des Multiplikators",null,null,null,null,null,null,null,null,null,null,null,null,"Name und Nr. des Ausbilders",null,null,null,null,null,null,null,null,null,null,null,null,"Unterschrift des Ausbilders",null,null,null,null,null,null,null,null,null,null,null,null,"Name und Nr. des Ausbilders",null,null,null,null,null,null,null,null,null,null,null,null,"Unterschrift des Ausbilders",null,null,null,null,null,null,null,null,null,null,null,null,null,null,null,null,null,null,null,null,null,null,null,null,null,null,null,null,null,null,null,null,null,null,null,null,null,null,"Name und Nr. des Ausbilders",null,null,null,null,null,null,null,null,null,null,null,null,"Unterschrift des Ausbilders",null,null,null,null,null,null,null,null,null,null,null,null,"Name und Nr. des Ausbilders",null,null,null,null,null,null,null,null,null,null,null,null,"Unterschrift des Ausbilders",null,null,null,null,null,null,null,null,null,null,null,null,null,null,null,null,null,null,null,null,null,null,null,null,null,null,null,null,null,null,null,null,null,null,null,null,null,null,"Name und Nr. des Ausbilders",null,null,null,null,null,null,null,null,null,null,null,null,"Unterschrift des Ausbilders",null,null,null,null,null,null,null,null,null,null,null,null,"Name und Nr. des Lehrbeauftragten",null,null,null,null,null,null,null,null,null,null,null,null,"Unterschrift des Lehrbeauftragten",null,null,null,null,null,null,null,null,null,null,null,null,"Name und Nr. des Lehrbeauftragten",null,null,null,null,null,null,null,null,null,null,null,null,"Unterschrift des Lehrbeauftragten",null,null,null,null,null,null,null,null,null,null,null,null,"Name und Nr. des Multiplikators",null,null,null,null,null,null,null,null,null,null,null,null,"Unterschrift des Multiplikators"]
[]
[null,{"$f":"IF(Start!$K$14<>\"\",Start!$K$14,\"\")","v":""},null,null,null,null,null,null,null,null,null,null,null,null,null,null,null,null,null,null,null,null,null,null,null,null,null,{"$f":"IF(Start!$K$14<>\"\",Start!$K$14,\"\")","v":""},null,null,null,null,null,null,null,null,null,null,null,null,null,null,null,null,null,null,null,null,null,null,null,null,null,{"$f":"IF(Start!$K$14<>\"\",Start!$K$14,\"\")","v":""},null,null,null,null,null,null,null,null,null,null,null,null,null,null,null,null,null,null,null,null,null,null,null,null,null,{"$f":"IF(Start!$K$14<>\"\",Start!$K$14,\"\")","v":""},null,null,null,null,null,null,null,null,null,null,null,null,null,null,null,null,null,null,null,null,null,null,null,null,null,{"$f":"IF(Start!$K$14<>\"\",Start!$K$14,\"\")","v":""},null,null,null,null,null,null,null,null,null,null,null,null,null,null,null,null,null,null,null,null,null,null,null,null,null,{"$f":"IF(Start!$K$14<>\"\",Start!$K$14,\"\")","v":""},null,null,null,null,null,null,null,null,null,null,null,null,null,null,null,null,null,null,null,null,null,null,null,null,null,{"$f":"IF(Start!$K$14<>\"\",Start!$K$14,\"\")","v":""},null,null,null,null,null,null,null,null,null,null,null,null,null,null,null,null,null,null,null,null,null,null,null,null,null,{"$f":"IF(Start!$K$14<>\"\",Start!$K$14,\"\")","v":""},null,null,null,null,null,null,null,null,null,null,null,null,null,null,null,null,null,null,null,null,null,null,null,null,null,{"$f":"IF(Start!$K$14<>\"\",Start!$K$14,\"\")","v":""},null,null,null,null,null,null,null,null,null,null,null,null,null,null,null,null,null,null,null,null,null,null,null,null,null,{"$f":"IF(Start!$K$14<>\"\",Start!$K$14,\"\")","v":""},null,null,null,null,null,null,null,null,null,null,null,null,null,null,null,null,null,null,null,null,null,null,null,null,null,{"$f":"IF(Start!$K$14<>\"\",Start!$K$14,\"\")","v":""},null,null,null,null,null,null,null,null,null,null,null,null,null,null,null,null,null,null,null,null,null,null,null,null,null,{"$f":"IF(Start!$K$14<>\"\",Start!$K$14,\"\")","v":""},null,null,null,null,null,null,null,null,null,null,null,null,null,null,null,null,null,null,null,null,null,null,null,null,null,{"$f":"IF(Start!$K$14<>\"\",Start!$K$14,\"\")","v":""},null,null,null,null,null,null,null,null,null,null,null,null,null,null,null,null,null,null,null,null,null,null,null,null,null,{"$f":"IF(Start!$K$14<>\"\",Start!$K$14,\"\")","v":""},null,null,null,null,null,null,null,null,null,null,null,null,null,null,null,null,null,null,null,null,null,null,null,null,null,{"$f":"IF(Start!$K$14<>\"\",Start!$K$14,\"\")","v":""},null,null,null,null,null,null,null,null,null,null,null,null,null,null,null,null,null,null,null,null,null,null,null,null,null,{"$f":"IF(Start!$K$14<>\"\",Start!$K$14,\"\")","v":""},null,null,null,null,null,null,null,null,null,null,null,null,null,null,null,null,null,null,null,null,null,null,null,null,null,{"$f":"IF(Start!$K$14<>\"\",Start!$K$14,\"\")","v":""},null,null,null,null,null,null,null,null,null,null,null,null,null,null,null,null,null,null,null,null,null,null,null,null,null,{"$f":"IF(Start!$K$14<>\"\",Start!$K$14,\"\")","v":""},null,null,null,null,null,null,null,null,null,null,null,null,null,null,null,null,null,null,null,null,null,null,null,null,null,{"$f":"IF(Start!$K$14<>\"\",Start!$K$14,\"\")","v":""},null,null,null,null,null,null,null,null,null,null,null,null,null,null,null,null,null,null,null,null,null,null,null,null,null,{"$f":"IF(Start!$K$14<>\"\",Start!$K$14,\"\")","v":""}]
[null,"Leitung Medizin",null,null,null,null,null,null,null,null,null,{"$f":"IF(V25<>\"\",V25+1,\"\")","v":""},null,null,null,null,null,null,null,null,null,null,null,null,null,null,null,"Leitung Medizin",null,null,null,null,null,null,null,null,null,{"$f":"IF(AV25<>\"\",AV25+1,\"\")","v":""},null,null,null,null,null,null,null,null,null,null,null,null,null,null,null,"Leitung Medizin",null,null,null,null,null,null,null,null,null,{"$f":"IF(BV25<>\"\",BV25+1,\"\")","v":""},null,null,null,null,null,null,null,null,null,null,null,null,null,null,null,"Leitung Medizin",null,null,null,null,null,null,null,null,null,{"$f":"IF(CV25<>\"\",CV25+1,\"\")","v":""},null,null,null,null,null,null,null,null,null,null,null,null,null,null,null,"Leitung Medizin",null,null,null,null,null,null,null,null,null,{"$f":"IF(DV25<>\"\",DV25+1,\"\")","v":""},null,null,null,null,null,null,null,null,null,null,null,null,null,null,null,"Leitung Medizin",null,null,null,null,null,null,null,null,null,{"$f":"IF(EV25<>\"\",EV25+1,\"\")","v":""},null,null,null,null,null,null,null,null,null,null,null,null,null,null,null,"Leitung Medizin",null,null,null,null,null,null,null,null,null,{"$f":"IF(FV25<>\"\",FV25+1,\"\")","v":""},null,null,null,null,null,null,null,null,null,null,null,null,null,null,null,"Leitung Medizin",null,null,null,null,null,null,null,null,null,{"$f":"IF(GV25<>\"\",GV25+1,\"\")","v":""},null,null,null,null,null,null,null,null,null,null,null,null,null,null,null,"Leitung Medizin",null,null,null,null,null,null,null,null,null,{"$f":"IF(HV25<>\"\",HV25+1,\"\")","v":""},null,null,null,null,null,null,null,null,null,null,null,null,null,null,null,"Leitung Medizin",null,null,null,null,null,null,null,null,null,{"$f":"IF(IV25<>\"\",IV25+1,\"\")","v":""},null,null,null,null,null,null,null,null,null,null,null,null,null,null,null,"Leitung Medizin",null,null,null,null,null,null,null,null,null,{"$f":"IF(JV25<>\"\",JV25+1,\"\")","v":""},null,null,null,null,null,null,null,null,null,null,null,null,null,null,null,"Leitung Medizin",null,null,null,null,null,null,null,null,null,{"$f":"IF(KV25<>\"\",KV25+1,\"\")","v":""},null,null,null,null,null,null,null,null,null,null,null,null,null,null,null,"Leitung Medizin",null,null,null,null,null,null,null,null,null,{"$f":"IF(LV25<>\"\",LV25+1,\"\")","v":""},null,null,null,null,null,null,null,null,null,null,null,null,null,null,null,"Leitung Medizin",null,null,null,null,null,null,null,null,null,{"$f":"IF(MV25<>\"\",MV25+1,\"\")","v":""},null,null,null,null,null,null,null,null,null,null,null,null,null,null,null,"Leitung Medizin",null,null,null,null,null,null,null,null,null,{"$f":"IF(NV25<>\"\",NV25+1,\"\")","v":""},null,null,null,null,null,null,null,null,null,null,null,null,null,null,null,"Leitung Medizin",null,null,null,null,null,null,null,null,null,{"$f":"IF(OV25<>\"\",OV25+1,\"\")","v":""},null,null,null,null,null,null,null,null,null,null,null,null,null,null,null,"Leitung Medizin",null,null,null,null,null,null,null,null,null,{"$f":"IF(PV25<>\"\",PV25+1,\"\")","v":""},null,null,null,null,null,null,null,null,null,null,null,null,null,null,null,"Leitung Medizin",null,null,null,null,null,null,null,null,null,{"$f":"IF(QV25<>\"\",QV25+1,\"\")","v":""},null,null,null,null,null,null,null,null,null,null,null,null,null,null,null,"Leitung Medizin",null,null,null,null,null,null,null,null,null,{"$f":"IF(RV25<>\"\",RV25+1,\"\")","v":""},null,null,null,null,null,null,null,null,null,null,null,null,null,null,null,"Leitung Medizin",null,null,null,null,null,null,null,null,null,{"$f":"IF(SV25<>\"\",SV25+1,\"\")","v":""}]
[null,"Ausfertigungsstelle",null,null,null,null,null,null,null,null,null,"Datum",null,null,null,null,"Stempel | Unterschrift",null,null,null,null,null,null,null,null,null,null,"Ausfertigungsstelle",null,null,null,null,null,null,null,null,null,"Datum",null,null,null,null,"Stempel | Unterschrift",null,null,null,null,null,null,null,null,null,null,"Ausfertigungsstelle",null,null,null,null,null,null,null,null,null,"Datum",null,null,null,null,"Stempel | Unterschrift",null,null,null,null,null,null,null,null,null,null,"Ausfertigungsstelle",null,null,null,null,null,null,null,null,null,"Datum",null,null,null,null,"Stempel | Unterschrift",null,null,null,null,null,null,null,null,null,null,"Ausfertigungsstelle",null,null,null,null,null,null,null,null,null,"Datum",null,null,null,null,"Stempel | Unterschrift",null,null,null,null,null,null,null,null,null,null,"Ausfertigungsstelle",null,null,null,null,null,null,null,null,null,"Datum",null,null,null,null,"Stempel | Unterschrift",null,null,null,null,null,null,null,null,null,null,"Ausfertigungsstelle",null,null,null,null,null,null,null,null,null,"Datum",null,null,null,null,"Stempel | Unterschrift",null,null,null,null,null,null,null,null,null,null,"Ausfertigungsstelle",null,null,null,null,null,null,null,null,null,"Datum",null,null,null,null,"Stempel | Unterschrift",null,null,null,null,null,null,null,null,null,null,"Ausfertigungsstelle",null,null,null,null,null,null,null,null,null,"Datum",null,null,null,null,"Stempel | Unterschrift",null,null,null,null,null,null,null,null,null,null,"Ausfertigungsstelle",null,null,null,null,null,null,null,null,null,"Datum",null,null,null,null,"Stempel | Unterschrift",null,null,null,null,null,null,null,null,null,null,"Ausfertigungsstelle",null,null,null,null,null,null,null,null,null,"Datum",null,null,null,null,"Stempel | Unterschrift",null,null,null,null,null,null,null,null,null,null,"Ausfertigungsstelle",null,null,null,null,null,null,null,null,null,"Datum",null,null,null,null,"Stempel | Unterschrift",null,null,null,null,null,null,null,null,null,null,null,null,null,null,null,null,null,null,null,null,null,null,null,null,null,null,null,null,null,null,null,null,null,null,null,null,"Ausfertigungsstelle",null,null,null,null,null,null,null,null,null,"Datum",null,null,null,null,"Stempel | Unterschrift",null,null,null,null,null,null,null,null,null,null,"Ausfertigungsstelle",null,null,null,null,null,null,null,null,null,"Datum",null,null,null,null,"Stempel | Unterschrift",null,null,null,null,null,null,null,null,null,null,null,null,null,null,null,null,null,null,null,null,null,null,null,null,null,null,null,null,null,null,null,null,null,null,null,null,"Ausfertigungsstelle",null,null,null,null,null,null,null,null,null,"Datum",null,null,null,null,"Stempel | Unterschrift",null,null,null,null,null,null,null,null,null,null,"Ausfertigungsstelle",null,null,null,null,null,null,null,null,null,"Datum",null,null,null,null,"Stempel | Unterschrift",null,null,null,null,null,null,null,null,null,null,"Ausfertigungsstelle",null,null,null,null,null,null,null,null,null,"Datum",null,null,null,null,"Stempel | Unterschrift",null,null,null,null,null,null,null,null,null,null,"Ausfertigungsstelle",null,null,null,null,null,null,null,null,null,"Datum",null,null,null,null,"Stempel | Unterschrift"]
[]
[null,"Nur gültig mit aufgedruckter Rückseite!",null,null,null,null,null,null,null,null,null,null,null,null,null,null,null,null,null,null,null,null,null,null,null,null,null,"Nur gültig mit aufgedruckter Rückseite!",null,null,null,null,null,null,null,null,null,null,null,null,null,null,null,null,null,null,null,null,null,null,null,null,null,"Nur gültig mit aufgedruckter Rückseite!",null,null,null,null,null,null,null,null,null,null,null,null,null,null,null,null,null,null,null,null,null,null,null,null,null,"Nur gültig mit aufgedruckter Rückseite!",null,null,null,null,null,null,null,null,null,null,null,null,null,null,null,null,null,null,null,null,null,null,null,null,null,null,null,null,null,null,null,null,null,null,null,null,null,null,null,null,null,null,null,null,null,null,null,null,null,null,null,"Nur gültig mit aufgedruckter Rückseite!",null,null,null,null,null,null,null,null,null,null,null,null,null,null,null,null,null,null,null,null,null,null,null,null,null,"Nur gültig mit aufgedruckter Rückseite!",null,null,null,null,null,null,null,null,null,null,null,null,null,null,null,null,null,null,null,null,null,null,null,null,null,"Nur gültig mit aufgedruckter Rückseite!",null,null,null,null,null,null,null,null,null,null,null,null,null,null,null,null,null,null,null,null,null,null,null,null,null,"Nur gültig mit aufgedruckter Rückseite!",null,null,null,null,null,null,null,null,null,null,null,null,null,null,null,null,null,null,null,null,null,null,null,null,null,"Nur gültig mit aufgedruckter Rückseite!",null,null,null,null,null,null,null,null,null,null,null,null,null,null,null,null,null,null,null,null,null,null,null,null,null,"Nur gültig mit aufgedruckter Rückseite!",null,null,null,null,null,null,null,null,null,null,null,null,null,null,null,null,null,null,null,null,null,null,null,null,null,"Nur gültig mit aufgedruckter Rückseite!",null,null,null,null,null,null,null,null,null,null,null,null,null,null,null,null,null,null,null,null,null,null,null,null,null,"Nur gültig mit aufgedruckter Rückseite!",null,null,null,null,null,null,null,null,null,null,null,null,null,null,null,null,null,null,null,null,null,null,null,null,null,"Nur gültig mit aufgedruckter Rückseite!",null,null,null,null,null,null,null,null,null,null,null,null,null,null,null,null,null,null,null,null,null,null,null,null,null,"Nur gültig mit aufgedruckter Rückseite!",null,null,null,null,null,null,null,null,null,null,null,null,null,null,null,null,null,null,null,null,null,null,null,null,null,"Nur gültig mit aufgedruckter Rückseite!",null,null,null,null,null,null,null,null,null,null,null,null,null,null,null,null,null,null,null,null,null,null,null,null,null,"Nur gültig mit aufgedruckter Rückseite!",null,null,null,null,null,null,null,null,null,null,null,null,null,null,null,null,null,null,null,null,null,null,null,null,null,"Nur gültig mit aufgedruckter Rückseite!",null,null,null,null,null,null,null,null,null,null,null,null,null,null,null,null,null,null,null,null,null,null,null,null,null,"Nur gültig mit aufgedruckter Rückseite!",null,null,null,null,null,null,null,null,null,null,null,null,null,null,null,null,null,null,null,null,null,null,null,null,null,"Nur gültig mit aufgedruckter Rückseite!"]
[null,{"$f":"CONCATENATE(\"Die Ausbildung wurde unter der Lehrgangsnummer \",Doku!$Y$26,\" registriert.\")","v":"Die Ausbildung wurde unter der Lehrgangsnummer  registriert."},null,null,null,null,null,null,null,null,null,null,null,null,null,null,null,null,null,null,null,null,null,null,null,null,null,{"$f":"CONCATENATE(\"Die Ausbildung wurde unter der Lehrgangsnummer \",Doku!$Y$26,\" registriert.\")","v":"Die Ausbildung wurde unter der Lehrgangsnummer  registriert."},null,null,null,null,null,null,null,null,null,null,null,null,null,null,null,null,null,null,null,null,null,null,null,null,null,{"$f":"CONCATENATE(\"Die Ausbildung wurde unter der Lehrgangsnummer \",Doku!$Y$26,\" registriert.\")","v":"Die Ausbildung wurde unter der Lehrgangsnummer  registriert."},null,null,null,null,null,null,null,null,null,null,null,null,null,null,null,null,null,null,null,null,null,null,null,null,null,{"$f":"CONCATENATE(\"Die Ausbildung wurde unter der Lehrgangsnummer \",Doku!$Y$26,\" registriert.\")","v":"Die Ausbildung wurde unter der Lehrgangsnummer  registriert."},null,null,null,null,null,null,null,null,null,null,null,null,null,null,null,null,null,null,null,null,null,null,null,null,null,null,null,null,null,null,null,null,null,null,null,null,null,null,null,null,null,null,null,null,null,null,null,null,null,null,null,{"$f":"CONCATENATE(\"Die Ausbildung wurde unter der Lehrgangsnummer \",Doku!$Y$26,\" registriert.\")","v":"Die Ausbildung wurde unter der Lehrgangsnummer  registriert."},null,null,null,null,null,null,null,null,null,null,null,null,null,null,null,null,null,null,null,null,null,null,null,null,null,{"$f":"CONCATENATE(\"Die Ausbildung wurde unter der Lehrgangsnummer \",Doku!$Y$26,\" registriert.\")","v":"Die Ausbildung wurde unter der Lehrgangsnummer  registriert."},null,null,null,null,null,null,null,null,null,null,null,null,null,null,null,null,null,null,null,null,null,null,null,null,null,{"$f":"CONCATENATE(\"Die Ausbildung wurde unter der Lehrgangsnummer \",Doku!$Y$26,\" registriert.\")","v":"Die Ausbildung wurde unter der Lehrgangsnummer  registriert."},null,null,null,null,null,null,null,null,null,null,null,null,null,null,null,null,null,null,null,null,null,null,null,null,null,{"$f":"CONCATENATE(\"Die Ausbildung wurde unter der Lehrgangsnummer \",Doku!$Y$26,\" registriert.\")","v":"Die Ausbildung wurde unter der Lehrgangsnummer  registriert."},null,null,null,null,null,null,null,null,null,null,null,null,null,null,null,null,null,null,null,null,null,null,null,null,null,{"$f":"CONCATENATE(\"Die Ausbildung wurde unter der Lehrgangsnummer \",Doku!$Y$26,\" registriert.\")","v":"Die Ausbildung wurde unter der Lehrgangsnummer  registriert."},null,null,null,null,null,null,null,null,null,null,null,null,null,null,null,null,null,null,null,null,null,null,null,null,null,{"$f":"CONCATENATE(\"Die Ausbildung wurde unter der Lehrgangsnummer \",Doku!$Y$26,\" registriert.\")","v":"Die Ausbildung wurde unter der Lehrgangsnummer  registriert."},null,null,null,null,null,null,null,null,null,null,null,null,null,null,null,null,null,null,null,null,null,null,null,null,null,{"$f":"CONCATENATE(\"Die Ausbildung wurde unter der Lehrgangsnummer \",Doku!$Y$26,\" registriert.\")","v":"Die Ausbildung wurde unter der Lehrgangsnummer  registriert."},null,null,null,null,null,null,null,null,null,null,null,null,null,null,null,null,null,null,null,null,null,null,null,null,null,{"$f":"CONCATENATE(\"Die Ausbildung wurde unter der Lehrgangsnummer \",Doku!$Y$26,\" registriert.\")","v":"Die Ausbildung wurde unter der Lehrgangsnummer  registriert."},null,null,null,null,null,null,null,null,null,null,null,null,null,null,null,null,null,null,null,null,null,null,null,null,null,{"$f":"CONCATENATE(\"Die Ausbildung wurde unter der Lehrgangsnummer \",Doku!$Y$26,\" registriert.\")","v":"Die Ausbildung wurde unter der Lehrgangsnummer  registriert."},null,null,null,null,null,null,null,null,null,null,null,null,null,null,null,null,null,null,null,null,null,null,null,null,null,{"$f":"CONCATENATE(\"Die Ausbildung wurde unter der Lehrgangsnummer \",Doku!$Y$26,\" registriert.\")","v":"Die Ausbildung wurde unter der Lehrgangsnummer  registriert."},null,null,null,null,null,null,null,null,null,null,null,null,null,null,null,null,null,null,null,null,null,null,null,null,null,{"$f":"CONCATENATE(\"Die Ausbildung wurde unter der Lehrgangsnummer \",Doku!$Y$26,\" registriert.\")","v":"Die Ausbildung wurde unter der Lehrgangsnummer  registriert."},null,null,null,null,null,null,null,null,null,null,null,null,null,null,null,null,null,null,null,null,null,null,null,null,null,{"$f":"CONCATENATE(\"Die Fortbildung wurde unter der Lehrgangsnummer \",Doku!$Y$26,\" registriert.\")","v":"Die Fortbildung wurde unter der Lehrgangsnummer  registriert."},null,null,null,null,null,null,null,null,null,null,null,null,null,null,null,null,null,null,null,null,null,null,null,null,null,{"$f":"CONCATENATE(\"Die Fortbildung wurde unter der Lehrgangsnummer \",Doku!$Y$26,\" erfasst.\")","v":"Die Fortbildung wurde unter der Lehrgangsnummer  erfasst."},null,null,null,null,null,null,null,null,null,null,null,null,null,null,null,null,null,null,null,null,null,null,null,null,null,{"$f":"CONCATENATE(\"Die Fortbildung wurde unter der Lehrgangsnummer \",Doku!$Y$26,\" registriert.\")","v":"Die Fortbildung wurde unter der Lehrgangsnummer  registriert."},null,null,null,null,null,null,null,null,null,null,null,null,null,null,null,null,null,null,null,null,null,null,null,null,null,{"$f":"CONCATENATE(\"Die Fortbildung wurde unter der Lehrgangsnummer \",Doku!$Y$26,\" registriert.\")","v":"Die Fortbildung wurde unter der Lehrgangsnummer  registriert."}]
[null,{"$f":"CONCATENATE(Doku!$W$8,\" • \",Doku!$W$10,\" • \",Doku!$BR$10,\" \",Doku!$BZ$10)","v":" •  •  "},null,null,null,null,null,null,null,null,null,null,null,null,null,null,null,null,null,null,null,null,null,null,null,null,null,{"$f":"CONCATENATE(Doku!$W$8,\" • \",Doku!$W$10,\" • \",Doku!$BR$10,\" \",Doku!$BZ$10)","v":" •  •  "},null,null,null,null,null,null,null,null,null,null,null,null,null,null,null,null,null,null,null,null,null,null,null,null,null,{"$f":"CONCATENATE(Doku!$W$8,\" • \",Doku!$W$10,\" • \",Doku!$BR$10,\" \",Doku!$BZ$10)","v":" •  •  "},null,null,null,null,null,null,null,null,null,null,null,null,null,null,null,null,null,null,null,null,null,null,null,null,null,{"$f":"CONCATENATE(Doku!$W$8,\" • \",Doku!$W$10,\" • \",Doku!$BR$10,\" \",Doku!$BZ$10)","v":" •  •  "},null,null,null,null,null,null,null,null,null,null,null,null,null,null,null,null,null,null,null,null,null,null,null,null,null,null,null,null,null,null,null,null,null,null,null,null,null,null,null,null,null,null,null,null,null,null,null,null,null,null,null,{"$f":"CONCATENATE(Doku!$W$8,\" • \",Doku!$W$10,\" • \",Doku!$BR$10,\" \",Doku!$BZ$10)","v":" •  •  "},null,null,null,null,null,null,null,null,null,null,null,null,null,null,null,null,null,null,null,null,null,null,null,null,null,{"$f":"CONCATENATE(Doku!$W$8,\" • \",Doku!$W$10,\" • \",Doku!$BR$10,\" \",Doku!$BZ$10)","v":" •  •  "},null,null,null,null,null,null,null,null,null,null,null,null,null,null,null,null,null,null,null,null,null,null,null,null,null,{"$f":"CONCATENATE(Doku!$W$8,\" • \",Doku!$W$10,\" • \",Doku!$BR$10,\" \",Doku!$BZ$10)","v":" •  •  "},null,null,null,null,null,null,null,null,null,null,null,null,null,null,null,null,null,null,null,null,null,null,null,null,null,{"$f":"CONCATENATE(Doku!$W$8,\" • \",Doku!$W$10,\" • \",Doku!$BR$10,\" \",Doku!$BZ$10)","v":" •  •  "},null,null,null,null,null,null,null,null,null,null,null,null,null,null,null,null,null,null,null,null,null,null,null,null,null,{"$f":"CONCATENATE(Doku!$W$8,\" • \",Doku!$W$10,\" • \",Doku!$BR$10,\" \",Doku!$BZ$10)","v":" •  •  "},null,null,null,null,null,null,null,null,null,null,null,null,null,null,null,null,null,null,null,null,null,null,null,null,null,{"$f":"CONCATENATE(Doku!$W$8,\" • \",Doku!$W$10,\" • \",Doku!$BR$10,\" \",Doku!$BZ$10)","v":" •  •  "},null,null,null,null,null,null,null,null,null,null,null,null,null,null,null,null,null,null,null,null,null,null,null,null,null,{"$f":"CONCATENATE(Doku!$W$8,\" • \",Doku!$W$10,\" • \",Doku!$BR$10,\" \",Doku!$BZ$10)","v":" •  •  "},null,null,null,null,null,null,null,null,null,null,null,null,null,null,null,null,null,null,null,null,null,null,null,null,null,{"$f":"CONCATENATE(Doku!$W$8,\" • \",Doku!$W$10,\" • \",Doku!$BR$10,\" \",Doku!$BZ$10)","v":" •  •  "},null,null,null,null,null,null,null,null,null,null,null,null,null,null,null,null,null,null,null,null,null,null,null,null,null,{"$f":"CONCATENATE(Doku!$W$8,\" • \",Doku!$W$10,\" • \",Doku!$BR$10,\" \",Doku!$BZ$10)","v":" •  •  "},null,null,null,null,null,null,null,null,null,null,null,null,null,null,null,null,null,null,null,null,null,null,null,null,null,{"$f":"CONCATENATE(Doku!$W$8,\" • \",Doku!$W$10,\" • \",Doku!$BR$10,\" \",Doku!$BZ$10)","v":" •  •  "},null,null,null,null,null,null,null,null,null,null,null,null,null,null,null,null,null,null,null,null,null,null,null,null,null,{"$f":"CONCATENATE(Doku!$W$8,\" • \",Doku!$W$10,\" • \",Doku!$BR$10,\" \",Doku!$BZ$10)","v":" •  •  "},null,null,null,null,null,null,null,null,null,null,null,null,null,null,null,null,null,null,null,null,null,null,null,null,null,{"$f":"CONCATENATE(Doku!$W$8,\" • \",Doku!$W$10,\" • \",Doku!$BR$10,\" \",Doku!$BZ$10)","v":" •  •  "},null,null,null,null,null,null,null,null,null,null,null,null,null,null,null,null,null,null,null,null,null,null,null,null,null,{"$f":"CONCATENATE(Doku!$W$8,\" • \",Doku!$W$10,\" • \",Doku!$BR$10,\" \",Doku!$BZ$10)","v":" •  •  "},null,null,null,null,null,null,null,null,null,null,null,null,null,null,null,null,null,null,null,null,null,null,null,null,null,{"$f":"CONCATENATE(Doku!$W$8,\" • \",Doku!$W$10,\" • \",Doku!$BR$10,\" \",Doku!$BZ$10)","v":" •  •  "},null,null,null,null,null,null,null,null,null,null,null,null,null,null,null,null,null,null,null,null,null,null,null,null,null,{"$f":"CONCATENATE(Doku!$W$8,\" • \",Doku!$W$10,\" • \",Doku!$BR$10,\" \",Doku!$BZ$10)","v":" •  •  "}]
[]
[]
[null,"Ende"]
[]
[]
[null,{"$f":"IF(Rs_1!$AG$1<>0,VLOOKUP(Rs_1!$AG$4,Data_PD!$A$4:$U$23,18,FALSE),\"\")","v":""},null,null,null,null,null,null,null,null,null,null,null,null,null,null,null,null,null,null,null,null,null,null,null,null,null,{"$f":"IF(Rs_1!$AG$1<>0,VLOOKUP(Rs_1!$AG$4,Data_PD!$A$4:$U$23,18,FALSE),\"\")","v":""},null,null,null,null,null,null,null,null,null,null,null,null,null,null,null,null,null,null,null,null,null,null,null,null,null,{"$f":"IF(Rs_1!$AG$1<>0,VLOOKUP(Rs_1!$AG$4,Data_PD!$A$4:$U$23,18,FALSE),\"\")","v":""},null,null,null,null,null,null,null,null,null,null,null,null,null,null,null,null,null,null,null,null,null,null,null,null,null,{"$f":"IF(Rs_1!$AG$1<>0,VLOOKUP(Rs_1!$AG$4,Data_PD!$A$4:$U$23,18,FALSE),\"\")","v":""},null,null,null,null,null,null,null,null,null,null,null,null,null,null,null,null,null,null,null,null,null,null,null,null,null,{"$f":"IF(Rs_1!$AG$1<>0,VLOOKUP(Rs_1!$AG$4,Data_PD!$A$4:$U$23,18,FALSE),\"\")","v":""},null,null,null,null,null,null,null,null,null,null,null,null,null,null,null,null,null,null,null,null,null,null,null,null,null,{"$f":"IF(Rs_1!$AG$1<>0,VLOOKUP(Rs_1!$AG$4,Data_PD!$A$4:$U$23,18,FALSE),\"\")","v":""},null,null,null,null,null,null,null,null,null,null,null,null,null,null,null,null,null,null,null,null,null,null,null,null,null,{"$f":"IF(Rs_1!$AG$1<>0,VLOOKUP(Rs_1!$AG$4,Data_PD!$A$4:$U$23,18,FALSE),\"\")","v":""},null,null,null,null,null,null,null,null,null,null,null,null,null,null,null,null,null,null,null,null,null,null,null,null,null,{"$f":"IF(Rs_1!$AG$1<>0,VLOOKUP(Rs_1!$AG$4,Data_PD!$A$4:$U$23,18,FALSE),\"\")","v":""},null,null,null,null,null,null,null,null,null,null,null,null,null,null,null,null,null,null,null,null,null,null,null,null,null,{"$f":"IF(Rs_1!$AG$1<>0,VLOOKUP(Rs_1!$AG$4,Data_PD!$A$4:$U$23,18,FALSE),\"\")","v":""},null,null,null,null,null,null,null,null,null,null,null,null,null,null,null,null,null,null,null,null,null,null,null,null,null,{"$f":"IF(Rs_1!$AG$1<>0,VLOOKUP(Rs_1!$AG$4,Data_PD!$A$4:$U$23,18,FALSE),\"\")","v":""},null,null,null,null,null,null,null,null,null,null,null,null,null,null,null,null,null,null,null,null,null,null,null,null,null,{"$f":"IF(Rs_1!$AG$1<>0,VLOOKUP(Rs_1!$AG$4,Data_PD!$A$4:$U$23,18,FALSE),\"\")","v":""},null,null,null,null,null,null,null,null,null,null,null,null,null,null,null,null,null,null,null,null,null,null,null,null,null,{"$f":"IF(Rs_1!$AG$1<>0,VLOOKUP(Rs_1!$AG$4,Data_PD!$A$4:$U$23,18,FALSE),\"\")","v":""},null,null,null,null,null,null,null,null,null,null,null,null,null,null,null,null,null,null,null,null,null,null,null,null,null,{"$f":"IF(Rs_1!$AG$1<>0,VLOOKUP(Rs_1!$AG$4,Data_PD!$A$4:$U$23,18,FALSE),\"\")","v":""},null,null,null,null,null,null,null,null,null,null,null,null,null,null,null,null,null,null,null,null,null,null,null,null,null,{"$f":"IF(Rs_1!$AG$1<>0,VLOOKUP(Rs_1!$AG$4,Data_PD!$A$4:$U$23,18,FALSE),\"\")","v":""},null,null,null,null,null,null,null,null,null,null,null,null,null,null,null,null,null,null,null,null,null,null,null,null,null,{"$f":"IF(Rs_1!$AG$1<>0,VLOOKUP(Rs_1!$AG$4,Data_PD!$A$4:$U$23,18,FALSE),\"\")","v":""},null,null,null,null,null,null,null,null,null,null,null,null,null,null,null,null,null,null,null,null,null,null,null,null,null,{"$f":"IF(Rs_1!$AG$1<>0,VLOOKUP(Rs_1!$AG$4,Data_PD!$A$4:$U$23,18,FALSE),\"\")","v":""},null,null,null,null,null,null,null,null,null,null,null,null,null,null,null,null,null,null,null,null,null,null,null,null,null,{"$f":"IF(Rs_2!$AG$1<>0,VLOOKUP(Rs_2!$AG$4,Data_PD!$A$4:$U$23,18,FALSE),\"\")","v":""},null,null,null,null,null,null,null,null,null,null,null,null,null,null,null,null,null,null,null,null,null,null,null,null,null,{"$f":"IF(Rs_2!$AG$1<>0,VLOOKUP(Rs_2!$AG$4,Data_PD!$A$4:$U$23,18,FALSE),\"\")","v":""},null,null,null,null,null,null,null,null,null,null,null,null,null,null,null,null,null,null,null,null,null,null,null,null,null,{"$f":"IF(Rs_2!$AG$1<>0,VLOOKUP(Rs_2!$AG$4,Data_PD!$A$4:$U$23,18,FALSE),\"\")","v":""},null,null,null,null,null,null,null,null,null,null,null,null,null,null,null,null,null,null,null,null,null,null,null,null,null,{"$f":"IF(Rs_2!$AG$1<>0,VLOOKUP(Rs_2!$AG$4,Data_PD!$A$4:$U$23,18,FALSE),\"\")","v":""}]
[]
[]
[null,"Voraussetzungen (gesonderte Nachweise)",null,null,null,null,null,null,null,null,null,null,null,null,null,null,null,null,null,null,null,null,null,null,null,null,null,"Voraussetzungen (gesonderte Nachweise)",null,null,null,null,null,null,null,null,null,null,null,null,null,null,null,null,null,null,null,null,null,null,null,null,null,"Voraussetzungen (gesonderte Nachweise)",null,null,null,null,null,null,null,null,null,null,null,null,null,null,null,null,null,null,null,null,null,null,null,null,null,"Voraussetzungen (gesonderte Nachweise)",null,null,null,null,null,null,null,null,null,null,null,null,null,null,null,null,null,null,null,null,null,null,null,null,null,"Voraussetzungen (gesonderte Nachweise)",null,null,null,null,null,null,null,null,null,null,null,null,null,null,null,null,null,null,null,null,null,null,null,null,null,"Voraussetzungen (gesonderte Nachweise)",null,null,null,null,null,null,null,null,null,null,null,null,null,null,null,null,null,null,null,null,null,null,null,null,null,"Voraussetzungen (gesonderte Nachweise)",null,null,null,null,null,null,null,null,null,null,null,null,null,null,null,null,null,null,null,null,null,null,null,null,null,null,null,null,null,null,null,null,null,null,null,null,null,null,null,null,null,null,null,null,null,null,null,null,null,null,null,null,null,null,null,null,null,null,null,null,null,null,null,null,null,null,null,null,null,null,null,null,null,null,null,null,null,"Voraussetzungen (gesonderte Nachweise)",null,null,null,null,null,null,null,null,null,null,null,null,null,null,null,null,null,null,null,null,null,null,null,null,null,null,null,null,null,null,null,null,null,null,null,null,null,null,null,null,null,null,null,null,null,null,null,null,null,null,null,"Folgende Inhalte wurden in der Sanitätsausbildung A vermittelt:",null,null,null,null,null,null,null,null,null,null,null,null,null,null,null,null,null,null,null,null,null,null,null,null,null,"Folgende Inhalte wurden in der Sanitätsausbildung B vermittelt:",null,null,null,null,null,null,null,null,null,null,null,null,null,null,null,null,null,null,null,null,null,null,null,null,null,"Voraussetzungen (gesonderte Nachweise)",null,null,null,null,null,null,null,null,null,null,null,null,null,null,null,null,null,null,null,null,null,null,null,null,null,"Folgende Inhalte wurden im RUND-Grundkurs vermittelt:",null,null,null,null,null,null,null,null,null,null,null,null,null,null,null,null,null,null,null,null,null,null,null,null,null,"Folgende Inhalte wurden im RUND-Aufbaukurs vermittelt:",null,null,null,null,null,null,null,null,null,null,null,null,null,null,null,null,null,null,null,null,null,null,null,null,null,"Folgende Inhalte wurden in der Sanitätsfortbildung für Erste Hilfe-Ausbilder vermittelt:",null,null,null,null,null,null,null,null,null,null,null,null,null,null,null,null,null,null,null,null,null,null,null,null,null,"Folgende Inhalte wurden in der Fortbildung für Erste Hilfe-Ausbilder vermittelt:",null,null,null,null,null,null,null,null,null,null,null,null,null,null,null,null,null,null,null,null,null,null,null,null,null,"Folgende Inhalte wurden in der Fortbildung für Erste Hilfe-Ausbilder vermittelt:",null,null,null,null,null,null,null,null,null,null,null,null,null,null,null,null,null,null,null,null,null,null,null,null,null,"Folgende Inhalte wurden in der Fortbildung für Sanitätsausbilder vermittelt:"]
[]
[1,null,null,null,null,null,null,null,null,null,null,null,null,null,null,null,null,null,null,null,null,null,null,null,null,null,1,null,null,null,null,null,null,null,null,null,null,null,null,null,null,null,null,null,null,null,null,null,null,null,null,null,1,null,null,null,null,null,null,null,null,null,null,null,null,null,null,null,null,null,null,null,null,null,null,null,null,null,1,null,null,null,null,null,null,null,null,null,null,null,null,null,null,null,null,null,null,null,null,null,null,null,null,null,1,null,null,null,null,null,null,null,null,null,null,null,null,null,null,null,null,null,null,null,null,null,null,null,null,null,1,null,null,null,null,null,null,null,null,null,null,null,null,null,null,null,null,null,null,null,null,null,null,null,null,null,1,null,null,null,null,null,null,null,null,null,null,null,null,null,null,null,null,null,null,null,null,null,null,null,null,null,1,null,null,null,null,null,null,null,null,null,null,null,null,null,null,null,null,null,null,null,null,null,null,null,null,null,1,null,null,null,null,null,null,null,null,null,null,null,null,null,null,null,null,null,null,null,null,null,null,null,null,null,1,null,null,null,null,null,null,null,null,null,null,null,null,null,null,null,null,null,null,null,null,null,null,null,null,null,1,null,null,null,null,null,null,null,null,null,null,null,null,null,null,null,null,null,null,null,null,null,null,null,null,null,1,"•  Notfall, Überlebenskette, Notruf, Verhaltensweisen, Einsatz, Auftreten,\n   Feststellen von Lebensfunktionen, Bewusstsein, Bewusstseinslage,\n   Auffinden eines Ansprechbaren Notfallpatienten",null,null,null,null,null,null,null,null,null,null,null,null,null,null,null,null,null,null,null,null,null,null,null,null,1,"•  Auffinden eines Notfallpatienten I und II, Auffinden eines ansprechbaren\n   Notfallpatienten, Störungen der Atmung, Atemnot, Physiologie der Atmung,\n   Aufbau der Atmungsorgane, Asthma, Reizgasvergiftung, Lungenödem",null,null,null,null,null,null,null,null,null,null,null,null,null,null,null,null,null,null,null,null,null,null,null,null,1,null,null,null,null,null,null,null,null,null,null,null,null,null,null,null,null,null,null,null,null,null,null,null,null,null,1,"•  Geschichte der Realistischen Unfall- und Notfall-Darstellung\n•  Einsatzmöglichkeiten der RUND\n•  Struktur der RUND",null,null,null,null,null,null,null,null,null,null,null,null,null,null,null,null,null,null,null,null,null,null,null,null,1,"•  Struktur der RUND\n•  Schadensereignisse\n•  Begriffe im Katastrophenschutz"]
[2,null,null,null,null,null,null,null,null,null,null,null,null,null,null,null,null,null,null,null,null,null,null,null,null,null,2,null,null,null,null,null,null,null,null,null,null,null,null,null,null,null,null,null,null,null,null,null,null,null,null,null,2,null,null,null,null,null,null,null,null,null,null,null,null,null,null,null,null,null,null,null,null,null,null,null,null,null,2,null,null,null,null,null,null,null,null,null,null,null,null,null,null,null,null,null,null,null,null,null,null,null,null,null,2,null,null,null,null,null,null,null,null,null,null,null,null,null,null,null,null,null,null,null,null,null,null,null,null,null,2,null,null,null,null,null,null,null,null,null,null,null,null,null,null,null,null,null,null,null,null,null,null,null,null,null,2,null,null,null,null,null,null,null,null,null,null,null,null,null,null,null,null,null,null,null,null,null,null,null,null,null,2,null,null,null,null,null,null,null,null,null,null,null,null,null,null,null,null,null,null,null,null,null,null,null,null,null,2,null,null,null,null,null,null,null,null,null,null,null,null,null,null,null,null,null,null,null,null,null,null,null,null,null,2,null,null,null,null,null,null,null,null,null,null,null,null,null,null,null,null,null,null,null,null,null,null,null,null,null,2,null,null,null,null,null,null,null,null,null,null,null,null,null,null,null,null,null,null,null,null,null,null,null,null,null,2,null,null,null,null,null,null,null,null,null,null,null,null,null,null,null,null,null,null,null,null,null,null,null,null,null,2,null,null,null,null,null,null,null,null,null,null,null,null,null,null,null,null,null,null,null,null,null,null,null,null,null,2,null,null,null,null,null,null,null,null,null,null,null,null,null,null,null,null,null,null,null,null,null,null,null,null,null,2,null,null,null,null,null,null,null,null,null,null,null,null,null,null,null,null,null,null,null,null,null,null,null,null,null,2,null,null,null,null,null,null,null,null,null,null,null,null,null,null,null,null,null,null,null,null,null,null,null,null,null,null,"Pädagogische Inhalte",null,null,null,null,null,null,null,null,null,null,null,null,null,null,null,null,null,null,null,null,null,null,"LE",null,null,"Pädagogische Inhalte",null,null,null,null,null,null,null,null,null,null,null,null,null,null,null,null,null,null,null,null,null,null,"LE",null,null,"Pädagogische Inhalte",null,null,null,null,null,null,null,null,null,null,null,null,null,null,null,null,null,null,null,null,null,null,"LE",null,null,"Pädagogische Inhalte",null,null,null,null,null,null,null,null,null,null,null,null,null,null,null,null,null,null,null,null,null,null,"LE"]
[3,null,null,null,null,null,null,null,null,null,null,null,null,null,null,null,null,null,null,null,null,null,null,null,null,null,3,null,null,null,null,null,null,null,null,null,null,null,null,null,null,null,null,null,null,null,null,null,null,null,null,null,3,null,null,null,null,null,null,null,null,null,null,null,null,null,null,null,null,null,null,null,null,null,null,null,null,null,3,null,null,null,null,null,null,null,null,null,null,null,null,null,null,null,null,null,null,null,null,null,null,null,null,null,3,null,null,null,null,null,null,null,null,null,null,null,null,null,null,null,null,null,null,null,null,null,null,null,null,null,3,null,null,null,null,null,null,null,null,null,null,null,null,null,null,null,null,null,null,null,null,null,null,null,null,null,3,null,null,null,null,null,null,null,null,null,null,null,null,null,null,null,null,null,null,null,null,null,null,null,null,null,3,null,null,null,null,null,null,null,null,null,null,null,null,null,null,null,null,null,null,null,null,null,null,null,null,null,3,null,null,null,null,null,null,null,null,null,null,null,null,null,null,null,null,null,null,null,null,null,null,null,null,null,3,null,null,null,null,null,null,null,null,null,null,null,null,null,null,null,null,null,null,null,null,null,null,null,null,null,3,null,null,null,null,null,null,null,null,null,null,null,null,null,null,null,null,null,null,null,null,null,null,null,null,null,3,null,null,null,null,null,null,null,null,null,null,null,null,null,null,null,null,null,null,null,null,null,null,null,null,null,3,null,null,null,null,null,null,null,null,null,null,null,null,null,null,null,null,null,null,null,null,null,null,null,null,null,3,null,null,null,null,null,null,null,null,null,null,null,null,null,null,null,null,null,null,null,null,null,null,null,null,null,3,null,null,null,null,null,null,null,null,null,null,null,null,null,null,null,null,null,null,null,null,null,null,null,null,null,3,null,null,null,null,null,null,null,null,null,null,null,null,null,null,null,null,null,null,null,null,null,null,null,null,null,1,{"$f":"IF(PY51<>\"\",\"•\",\"\")","v":""},"P1",null,null,null,null,null,null,null,null,null,null,null,null,null,null,null,null,null,null,null,null,null,null,null,1,{"$f":"IF(QY51<>\"\",\"•\",\"\")","v":""},"P1",null,null,null,null,null,null,null,null,null,null,null,null,null,null,null,null,null,null,null,null,null,null,null,1,{"$f":"IF(RY51<>\"\",\"•\",\"\")","v":""},"P1",null,null,null,null,null,null,null,null,null,null,null,null,null,null,null,null,null,null,null,null,null,null,null,1,{"$f":"IF(SY51<>\"\",\"•\",\"\")","v":""},"P1"]
[4,null,null,null,null,null,null,null,null,null,null,null,null,null,null,null,null,null,null,null,null,null,null,null,null,null,4,null,null,null,null,null,null,null,null,null,null,null,null,null,null,null,null,null,null,null,null,null,null,null,null,null,4,null,null,null,null,null,null,null,null,null,null,null,null,null,null,null,null,null,null,null,null,null,null,null,null,null,4,null,null,null,null,null,null,null,null,null,null,null,null,null,null,null,null,null,null,null,null,null,null,null,null,null,4,null,null,null,null,null,null,null,null,null,null,null,null,null,null,null,null,null,null,null,null,null,null,null,null,null,4,null,null,null,null,null,null,null,null,null,null,null,null,null,null,null,null,null,null,null,null,null,null,null,null,null,4,null,null,null,null,null,null,null,null,null,null,null,null,null,null,null,null,null,null,null,null,null,null,null,null,null,4,null,null,null,null,null,null,null,null,null,null,null,null,null,null,null,null,null,null,null,null,null,null,null,null,null,4,null,null,null,null,null,null,null,null,null,null,null,null,null,null,null,null,null,null,null,null,null,null,null,null,null,4,null,null,null,null,null,null,null,null,null,null,null,null,null,null,null,null,null,null,null,null,null,null,null,null,null,4,null,null,null,null,null,null,null,null,null,null,null,null,null,null,null,null,null,null,null,null,null,null,null,null,null,4,"•  Atmung, Funktion der Atmung, Atemsteuerung, Atemgase, Blut, Blutgefäße,\n   Herz, Lage, Aufbau, Reizleitungssystem, Funktion, Blutkreislauf, Gestörte\n   Funktion, Puls fühlen, Blutdruck, Blutdruckmessung",null,null,null,null,null,null,null,null,null,null,null,null,null,null,null,null,null,null,null,null,null,null,null,null,4,"•  Pneumothorax, Atemstillstand, Sekret absaugen, Atemwegssicherung\n   durch Tuben, Guedeltubus, Wendltubus, Anwendung des Larynxtubus,\n   Herz-Lungen-Wiederbelebung mit AED und Sauerstoff",null,null,null,null,null,null,null,null,null,null,null,null,null,null,null,null,null,null,null,null,null,null,null,null,4,null,null,null,null,null,null,null,null,null,null,null,null,null,null,null,null,null,null,null,null,null,null,null,null,null,4,"•  Abbau der Hemmschwelle\n•  Schauspielerische Schulung\n•  Verletzungsorientierung",null,null,null,null,null,null,null,null,null,null,null,null,null,null,null,null,null,null,null,null,null,null,null,null,4,"•  Anhängekarte für Verletzte/Kranke\n•  Verlängerung der RUND-Darstellung\n•  Blutdruck",null,null,null,null,null,null,null,null,null,null,null,null,null,null,null,null,null,null,null,null,null,null,null,null,2,{"$f":"IF(PY52<>\"\",\"•\",\"\")","v":""},"P2",null,null,null,null,null,null,null,null,null,null,null,null,null,null,null,null,null,null,null,null,null,null,null,2,{"$f":"IF(QY52<>\"\",\"•\",\"\")","v":""},"P2",null,null,null,null,null,null,null,null,null,null,null,null,null,null,null,null,null,null,null,null,null,null,null,2,{"$f":"IF(RY52<>\"\",\"•\",\"\")","v":""},"P2",null,null,null,null,null,null,null,null,null,null,null,null,null,null,null,null,null,null,null,null,null,null,null,2,{"$f":"IF(SY52<>\"\",\"•\",\"\")","v":""},"P2"]
[5,null,null,null,null,null,null,null,null,null,null,null,null,null,null,null,null,null,null,null,null,null,null,null,null,null,5,null,null,null,null,null,null,null,null,null,null,null,null,null,null,null,null,null,null,null,null,null,null,null,null,null,5,null,null,null,null,null,null,null,null,null,null,null,null,null,null,null,null,null,null,null,null,null,null,null,null,null,5,null,null,null,null,null,null,null,null,null,null,null,null,null,null,null,null,null,null,null,null,null,null,null,null,null,5,null,null,null,null,null,null,null,null,null,null,null,null,null,null,null,null,null,null,null,null,null,null,null,null,null,5,null,null,null,null,null,null,null,null,null,null,null,null,null,null,null,null,null,null,null,null,null,null,null,null,null,5,null,null,null,null,null,null,null,null,null,null,null,null,null,null,null,null,null,null,null,null,null,null,null,null,null,5,null,null,null,null,null,null,null,null,null,null,null,null,null,null,null,null,null,null,null,null,null,null,null,null,null,5,null,null,null,null,null,null,null,null,null,null,null,null,null,null,null,null,null,null,null,null,null,null,null,null,null,5,null,null,null,null,null,null,null,null,null,null,null,null,null,null,null,null,null,null,null,null,null,null,null,null,null,5,null,null,null,null,null,null,null,null,null,null,null,null,null,null,null,null,null,null,null,null,null,null,null,null,null,5,null,null,null,null,null,null,null,null,null,null,null,null,null,null,null,null,null,null,null,null,null,null,null,null,null,5,null,null,null,null,null,null,null,null,null,null,null,null,null,null,null,null,null,null,null,null,null,null,null,null,null,5,null,null,null,null,null,null,null,null,null,null,null,null,null,null,null,null,null,null,null,null,null,null,null,null,null,5,null,null,null,null,null,null,null,null,null,null,null,null,null,null,null,null,null,null,null,null,null,null,null,null,null,5,null,null,null,null,null,null,null,null,null,null,null,null,null,null,null,null,null,null,null,null,null,null,null,null,null,3,"","P3",null,null,null,null,null,null,null,null,null,null,null,null,null,null,null,null,null,null,null,null,null,null,null,3,"","P3",null,null,null,null,null,null,null,null,null,null,null,null,null,null,null,null,null,null,null,null,null,null,null,3,"","P3",null,null,null,null,null,null,null,null,null,null,null,null,null,null,null,null,null,null,null,null,null,null,null,3,"","P3"]
[6,null,null,null,null,null,null,null,null,null,null,null,null,null,null,null,null,null,null,null,null,null,null,null,null,null,6,null,null,null,null,null,null,null,null,null,null,null,null,null,null,null,null,null,null,null,null,null,null,null,null,null,6,null,null,null,null,null,null,null,null,null,null,null,null,null,null,null,null,null,null,null,null,null,null,null,null,null,6,null,null,null,null,null,null,null,null,null,null,null,null,null,null,null,null,null,null,null,null,null,null,null,null,null,6,null,null,null,null,null,null,null,null,null,null,null,null,null,null,null,null,null,null,null,null,null,null,null,null,null,6,null,null,null,null,null,null,null,null,null,null,null,null,null,null,null,null,null,null,null,null,null,null,null,null,null,6,null,null,null,null,null,null,null,null,null,null,null,null,null,null,null,null,null,null,null,null,null,null,null,null,null,6,null,null,null,null,null,null,null,null,null,null,null,null,null,null,null,null,null,null,null,null,null,null,null,null,null,6,null,null,null,null,null,null,null,null,null,null,null,null,null,null,null,null,null,null,null,null,null,null,null,null,null,6,null,null,null,null,null,null,null,null,null,null,null,null,null,null,null,null,null,null,null,null,null,null,null,null,null,6,null,null,null,null,null,null,null,null,null,null,null,null,null,null,null,null,null,null,null,null,null,null,null,null,null,6,null,null,null,null,null,null,null,null,null,null,null,null,null,null,null,null,null,null,null,null,null,null,null,null,null,6,null,null,null,null,null,null,null,null,null,null,null,null,null,null,null,null,null,null,null,null,null,null,null,null,null,6,null,null,null,null,null,null,null,null,null,null,null,null,null,null,null,null,null,null,null,null,null,null,null,null,null,6,null,null,null,null,null,null,null,null,null,null,null,null,null,null,null,null,null,null,null,null,null,null,null,null,null,6,null,null,null,null,null,null,null,null,null,null,null,null,null,null,null,null,null,null,null,null,null,null,null,null,null,4,"","P4",null,null,null,null,null,null,null,null,null,null,null,null,null,null,null,null,null,null,null,null,null,null,null,4,"","P4",null,null,null,null,null,null,null,null,null,null,null,null,null,null,null,null,null,null,null,null,null,null,null,4,"","P4",null,null,null,null,null,null,null,null,null,null,null,null,null,null,null,null,null,null,null,null,null,null,null,4,"","P4"]
[7,null,null,null,null,null,null,null,null,null,null,null,null,null,null,null,null,null,null,null,null,null,null,null,null,null,7,null,null,null,null,null,null,null,null,null,null,null,null,null,null,null,null,null,null,null,null,null,null,null,null,null,7,null,null,null,null,null,null,null,null,null,null,null,null,null,null,null,null,null,null,null,null,null,null,null,null,null,7,null,null,null,null,null,null,null,null,null,null,null,null,null,null,null,null,null,null,null,null,null,null,null,null,null,7,null,null,null,null,null,null,null,null,null,null,null,null,null,null,null,null,null,null,null,null,null,null,null,null,null,7,null,null,null,null,null,null,null,null,null,null,null,null,null,null,null,null,null,null,null,null,null,null,null,null,null,7,null,null,null,null,null,null,null,null,null,null,null,null,null,null,null,null,null,null,null,null,null,null,null,null,null,7,null,null,null,null,null,null,null,null,null,null,null,null,null,null,null,null,null,null,null,null,null,null,null,null,null,7,null,null,null,null,null,null,null,null,null,null,null,null,null,null,null,null,null,null,null,null,null,null,null,null,null,7,null,null,null,null,null,null,null,null,null,null,null,null,null,null,null,null,null,null,null,null,null,null,null,null,null,7,null,null,null,null,null,null,null,null,null,null,null,null,null,null,null,null,null,null,null,null,null,null,null,null,null,7,"•  Atemstillstand, Guedeltubus, Beatmung, Sauerstoff, Druckminderer, \n   Flascheninhalt, Beatmung mit Beatmungsbeutel und Sauerstoff, \n   Sauerstoffinhalation (Maske, Brille), Sauerstoffreservoir, Demandventil",null,null,null,null,null,null,null,null,null,null,null,null,null,null,null,null,null,null,null,null,null,null,null,null,7,"•  Herz-Lungen-Wiederbelebung bei Kindern, Medikamente, Beschaffung\n   von Arzneimittel, Injektion und Infusion, Vorbereitung einer Infusion, \n   Vorbereitung einer Injektion",null,null,null,null,null,null,null,null,null,null,null,null,null,null,null,null,null,null,null,null,null,null,null,null,7,null,null,null,null,null,null,null,null,null,null,null,null,null,null,null,null,null,null,null,null,null,null,null,null,null,7,"•  Verletzungsorientierte Gebärden\n•  Probleme bei der Darstellung\n•  Dauer der RUND-Darstellung",null,null,null,null,null,null,null,null,null,null,null,null,null,null,null,null,null,null,null,null,null,null,null,null,7,"•  Beatmungshilfen\n•  Sauerstoff\n•  Venöse Punktion",null,null,null,null,null,null,null,null,null,null,null,null,null,null,null,null,null,null,null,null,null,null,null,null,5,"","P5",null,null,null,null,null,null,null,null,null,null,null,null,null,null,null,null,null,null,null,null,null,null,null,5,"","P5",null,null,null,null,null,null,null,null,null,null,null,null,null,null,null,null,null,null,null,null,null,null,null,5,"","P5",null,null,null,null,null,null,null,null,null,null,null,null,null,null,null,null,null,null,null,null,null,null,null,5,"","P5"]
[8,null,null,null,null,null,null,null,null,null,null,null,null,null,null,null,null,null,null,null,null,null,null,null,null,null,8,null,null,null,null,null,null,null,null,null,null,null,null,null,null,null,null,null,null,null,null,null,null,null,null,null,8,null,null,null,null,null,null,null,null,null,null,null,null,null,null,null,null,null,null,null,null,null,null,null,null,null,8,null,null,null,null,null,null,null,null,null,null,null,null,null,null,null,null,null,null,null,null,null,null,null,null,null,8,null,null,null,null,null,null,null,null,null,null,null,null,null,null,null,null,null,null,null,null,null,null,null,null,null,8,null,null,null,null,null,null,null,null,null,null,null,null,null,null,null,null,null,null,null,null,null,null,null,null,null,8,null,null,null,null,null,null,null,null,null,null,null,null,null,null,null,null,null,null,null,null,null,null,null,null,null,8,null,null,null,null,null,null,null,null,null,null,null,null,null,null,null,null,null,null,null,null,null,null,null,null,null,8,null,null,null,null,null,null,null,null,null,null,null,null,null,null,null,null,null,null,null,null,null,null,null,null,null,8,null,null,null,null,null,null,null,null,null,null,null,null,null,null,null,null,null,null,null,null,null,null,null,null,null,8,null,null,null,null,null,null,null,null,null,null,null,null,null,null,null,null,null,null,null,null,null,null,null,null,null,8,null,null,null,null,null,null,null,null,null,null,null,null,null,null,null,null,null,null,null,null,null,null,null,null,null,8,null,null,null,null,null,null,null,null,null,null,null,null,null,null,null,null,null,null,null,null,null,null,null,null,null,8,null,null,null,null,null,null,null,null,null,null,null,null,null,null,null,null,null,null,null,null,null,null,null,null,null,8,null,null,null,null,null,null,null,null,null,null,null,null,null,null,null,null,null,null,null,null,null,null,null,null,null,8,null,null,null,null,null,null,null,null,null,null,null,null,null,null,null,null,null,null,null,null,null,null,null,null,null,6,"","P6",null,null,null,null,null,null,null,null,null,null,null,null,null,null,null,null,null,null,null,null,null,null,null,6,"","P6",null,null,null,null,null,null,null,null,null,null,null,null,null,null,null,null,null,null,null,null,null,null,null,6,"","P6",null,null,null,null,null,null,null,null,null,null,null,null,null,null,null,null,null,null,null,null,null,null,null,6,"","P6"]
[9,null,null,null,null,null,null,null,null,null,null,null,null,null,null,null,null,null,null,null,null,null,null,null,null,null,9,null,null,null,null,null,null,null,null,null,null,null,null,null,null,null,null,null,null,null,null,null,null,null,null,null,9,null,null,null,null,null,null,null,null,null,null,null,null,null,null,null,null,null,null,null,null,null,null,null,null,null,9,null,null,null,null,null,null,null,null,null,null,null,null,null,null,null,null,null,null,null,null,null,null,null,null,null,9,null,null,null,null,null,null,null,null,null,null,null,null,null,null,null,null,null,null,null,null,null,null,null,null,null,9,null,null,null,null,null,null,null,null,null,null,null,null,null,null,null,null,null,null,null,null,null,null,null,null,null,9,null,null,null,null,null,null,null,null,null,null,null,null,null,null,null,null,null,null,null,null,null,null,null,null,null,9,null,null,null,null,null,null,null,null,null,null,null,null,null,null,null,null,null,null,null,null,null,null,null,null,null,9,null,null,null,null,null,null,null,null,null,null,null,null,null,null,null,null,null,null,null,null,null,null,null,null,null,9,null,null,null,null,null,null,null,null,null,null,null,null,null,null,null,null,null,null,null,null,null,null,null,null,null,9,null,null,null,null,null,null,null,null,null,null,null,null,null,null,null,null,null,null,null,null,null,null,null,null,null,9,null,null,null,null,null,null,null,null,null,null,null,null,null,null,null,null,null,null,null,null,null,null,null,null,null,9,null,null,null,null,null,null,null,null,null,null,null,null,null,null,null,null,null,null,null,null,null,null,null,null,null,9,null,null,null,null,null,null,null,null,null,null,null,null,null,null,null,null,null,null,null,null,null,null,null,null,null,9,null,null,null,null,null,null,null,null,null,null,null,null,null,null,null,null,null,null,null,null,null,null,null,null,null,9,null,null,null,null,null,null,null,null,null,null,null,null,null,null,null,null,null,null,null,null,null,null,null,null,null,7,"","P7",null,null,null,null,null,null,null,null,null,null,null,null,null,null,null,null,null,null,null,null,null,null,null,7,"","P7",null,null,null,null,null,null,null,null,null,null,null,null,null,null,null,null,null,null,null,null,null,null,null,7,"","P7",null,null,null,null,null,null,null,null,null,null,null,null,null,null,null,null,null,null,null,null,null,null,null,7,"","P7"]
[10,null,null,null,null,null,null,null,null,null,null,null,null,null,null,null,null,null,null,null,null,null,null,null,null,null,10,null,null,null,null,null,null,null,null,null,null,null,null,null,null,null,null,null,null,null,null,null,null,null,null,null,10,null,null,null,null,null,null,null,null,null,null,null,null,null,null,null,null,null,null,null,null,null,null,null,null,null,10,null,null,null,null,null,null,null,null,null,null,null,null,null,null,null,null,null,null,null,null,null,null,null,null,null,10,null,null,null,null,null,null,null,null,null,null,null,null,null,null,null,null,null,null,null,null,null,null,null,null,null,10,null,null,null,null,null,null,null,null,null,null,null,null,null,null,null,null,null,null,null,null,null,null,null,null,null,10,null,null,null,null,null,null,null,null,null,null,null,null,null,null,null,null,null,null,null,null,null,null,null,null,null,10,null,null,null,null,null,null,null,null,null,null,null,null,null,null,null,null,null,null,null,null,null,null,null,null,null,10,null,null,null,null,null,null,null,null,null,null,null,null,null,null,null,null,null,null,null,null,null,null,null,null,null,10,null,null,null,null,null,null,null,null,null,null,null,null,null,null,null,null,null,null,null,null,null,null,null,null,null,10,null,null,null,null,null,null,null,null,null,null,null,null,null,null,null,null,null,null,null,null,null,null,null,null,null,10,"•  Störungen der Atmung, Atemnot, Ungenügende Atmung, Hyperventilation,\n   Ertrinkungsunfall, Stilles Ertrinken, Schwimmbad-Blackout, Kälteschock,\n   Schwimmversagen",null,null,null,null,null,null,null,null,null,null,null,null,null,null,null,null,null,null,null,null,null,null,null,null,10,"•  Allgemeine Übersicht der Tauchunfälle, Barotraumen, Gasvergiftungen \n   beim Tauchen, Tauchunfälle, Dekompressionskrankheit (DCS), \n   Lungenüberdruckunfall (AGE)",null,null,null,null,null,null,null,null,null,null,null,null,null,null,null,null,null,null,null,null,null,null,null,null,10,null,null,null,null,null,null,null,null,null,null,null,null,null,null,null,null,null,null,null,null,null,null,null,null,null,10,"•  Sicherheit bei der RUND-Darstellung\n•  Sicherheitsrelevante Gebärden\n•  Grundausstattung der RUND",null,null,null,null,null,null,null,null,null,null,null,null,null,null,null,null,null,null,null,null,null,null,null,null,10,"•  Defibrillatoren\n•  Geräte zur Immobilisation\n•  Rettungsgeräte für den Transport",null,null,null,null,null,null,null,null,null,null,null,null,null,null,null,null,null,null,null,null,null,null,null,null,8,"","P8",null,null,null,null,null,null,null,null,null,null,null,null,null,null,null,null,null,null,null,null,null,null,null,8,"","P8",null,null,null,null,null,null,null,null,null,null,null,null,null,null,null,null,null,null,null,null,null,null,null,8,"","P8",null,null,null,null,null,null,null,null,null,null,null,null,null,null,null,null,null,null,null,null,null,null,null,8,"","P8"]
[11,null,null,null,null,null,null,null,null,null,null,null,null,null,null,null,null,null,null,null,null,null,null,null,null,null,11,null,null,null,null,null,null,null,null,null,null,null,null,null,null,null,null,null,null,null,null,null,null,null,null,null,11,null,null,null,null,null,null,null,null,null,null,null,null,null,null,null,null,null,null,null,null,null,null,null,null,null,11,null,null,null,null,null,null,null,null,null,null,null,null,null,null,null,null,null,null,null,null,null,null,null,null,null,11,null,null,null,null,null,null,null,null,null,null,null,null,null,null,null,null,null,null,null,null,null,null,null,null,null,11,null,null,null,null,null,null,null,null,null,null,null,null,null,null,null,null,null,null,null,null,null,null,null,null,null,11,null,null,null,null,null,null,null,null,null,null,null,null,null,null,null,null,null,null,null,null,null,null,null,null,null,11,null,null,null,null,null,null,null,null,null,null,null,null,null,null,null,null,null,null,null,null,null,null,null,null,null,11,null,null,null,null,null,null,null,null,null,null,null,null,null,null,null,null,null,null,null,null,null,null,null,null,null,11,null,null,null,null,null,null,null,null,null,null,null,null,null,null,null,null,null,null,null,null,null,null,null,null,null,11,null,null,null,null,null,null,null,null,null,null,null,null,null,null,null,null,null,null,null,null,null,null,null,null,null,11,null,null,null,null,null,null,null,null,null,null,null,null,null,null,null,null,null,null,null,null,null,null,null,null,null,11,null,null,null,null,null,null,null,null,null,null,null,null,null,null,null,null,null,null,null,null,null,null,null,null,null,11,null,null,null,null,null,null,null,null,null,null,null,null,null,null,null,null,null,null,null,null,null,null,null,null,null,11,null,null,null,null,null,null,null,null,null,null,null,null,null,null,null,null,null,null,null,null,null,null,null,null,null,11,null,null,null,null,null,null,null,null,null,null,null,null,null,null,null,null,null,null,null,null,null,null,null,null,null,9,"","P9",null,null,null,null,null,null,null,null,null,null,null,null,null,null,null,null,null,null,null,null,null,null,null,9,"","P9",null,null,null,null,null,null,null,null,null,null,null,null,null,null,null,null,null,null,null,null,null,null,null,9,"","P9",null,null,null,null,null,null,null,null,null,null,null,null,null,null,null,null,null,null,null,null,null,null,null,9,"","P9"]
[12,null,null,null,null,null,null,null,null,null,null,null,null,null,null,null,null,null,null,null,null,null,null,null,null,null,12,null,null,null,null,null,null,null,null,null,null,null,null,null,null,null,null,null,null,null,null,null,null,null,null,null,12,null,null,null,null,null,null,null,null,null,null,null,null,null,null,null,null,null,null,null,null,null,null,null,null,null,12,null,null,null,null,null,null,null,null,null,null,null,null,null,null,null,null,null,null,null,null,null,null,null,null,null,12,null,null,null,null,null,null,null,null,null,null,null,null,null,null,null,null,null,null,null,null,null,null,null,null,null,12,null,null,null,null,null,null,null,null,null,null,null,null,null,null,null,null,null,null,null,null,null,null,null,null,null,12,null,null,null,null,null,null,null,null,null,null,null,null,null,null,null,null,null,null,null,null,null,null,null,null,null,12,null,null,null,null,null,null,null,null,null,null,null,null,null,null,null,null,null,null,null,null,null,null,null,null,null,12,null,null,null,null,null,null,null,null,null,null,null,null,null,null,null,null,null,null,null,null,null,null,null,null,null,12,null,null,null,null,null,null,null,null,null,null,null,null,null,null,null,null,null,null,null,null,null,null,null,null,null,12,null,null,null,null,null,null,null,null,null,null,null,null,null,null,null,null,null,null,null,null,null,null,null,null,null,12,null,null,null,null,null,null,null,null,null,null,null,null,null,null,null,null,null,null,null,null,null,null,null,null,null,12,null,null,null,null,null,null,null,null,null,null,null,null,null,null,null,null,null,null,null,null,null,null,null,null,null,12,null,null,null,null,null,null,null,null,null,null,null,null,null,null,null,null,null,null,null,null,null,null,null,null,null,12,null,null,null,null,null,null,null,null,null,null,null,null,null,null,null,null,null,null,null,null,null,null,null,null,null,12,null,null,null,null,null,null,null,null,null,null,null,null,null,null,null,null,null,null,null,null,null,null,null,null,null,10,"","P10",null,null,null,null,null,null,null,null,null,null,null,null,null,null,null,null,null,null,null,null,null,null,null,10,"","P10",null,null,null,null,null,null,null,null,null,null,null,null,null,null,null,null,null,null,null,null,null,null,null,10,"","P10",null,null,null,null,null,null,null,null,null,null,null,null,null,null,null,null,null,null,null,null,null,null,null,10,"","P10"]
[null,null,null,null,null,null,null,null,null,null,null,null,null,null,null,null,null,null,null,null,null,null,null,null,null,null,null,null,null,null,null,null,null,null,null,null,null,null,null,null,null,null,null,null,null,null,null,null,null,null,null,null,null,null,null,null,null,null,null,null,null,null,null,null,null,null,null,null,null,null,null,null,null,null,null,null,null,null,null,null,null,null,null,null,null,null,null,null,null,null,null,null,null,null,null,null,null,null,null,null,null,null,null,null,null,null,null,null,null,null,null,null,null,null,null,null,null,null,null,null,null,null,null,null,null,null,null,null,null,null,null,null,null,null,null,null,null,null,null,null,null,null,null,null,null,null,null,null,null,null,null,null,null,null,null,null,null,null,null,null,null,null,null,null,null,null,null,null,null,null,null,null,null,null,null,null,null,null,null,null,null,null,13,null,null,null,null,null,null,null,null,null,null,null,null,null,null,null,null,null,null,null,null,null,null,null,null,null,null,null,null,null,null,null,null,null,null,null,null,null,null,null,null,null,null,null,null,null,null,null,null,null,null,null,null,null,null,null,null,null,null,null,null,null,null,null,null,null,null,null,null,null,null,null,null,null,null,null,null,null,null,null,null,null,null,null,null,null,null,null,null,null,null,null,null,null,null,null,null,null,null,null,null,null,null,null,null,"•  Auffinden eines Notfallpatienten II, Kreislaufstillstand, AED, Herz-Lungen-\n   Wiederbelebung mit 2 Helfern mit AED und Sauerstoff, Verlegung der\n   Atemwege",null,null,null,null,null,null,null,null,null,null,null,null,null,null,null,null,null,null,null,null,null,null,null,null,null,"•  Vergiftungen (allg.), Alkohol-, Schlaf- und Beruhigungsmittelvergiftung,\n   Vergiftungen durch Drogen, Heroin, Weckamine, Vergiftungen mit Gasen\n   und Dämpfen, Vergiftungen mit Kontaktgiften, Kontakt mit Phosphor",null,null,null,null,null,null,null,null,null,null,null,null,null,null,null,null,null,null,null,null,null,null,null,null,null,null,null,null,null,null,null,null,null,null,null,null,null,null,null,null,null,null,null,null,null,null,null,null,null,null,null,"•  Schmink- und Darstellungskunde\n•  Notruf\n•  Nachbesprechung",null,null,null,null,null,null,null,null,null,null,null,null,null,null,null,null,null,null,null,null,null,null,null,null,null,"•  Verfeinerung der Schminktechniken\n•  Schmink- und Darstellungskunde I\n•  Gebärdensprache innerhalb der RUND",null,null,null,null,null,null,null,null,null,null,null,null,null,null,null,null,null,null,null,null,null,null,null,null,11,"","P11",null,null,null,null,null,null,null,null,null,null,null,null,null,null,null,null,null,null,null,null,null,null,null,11,"","P11",null,null,null,null,null,null,null,null,null,null,null,null,null,null,null,null,null,null,null,null,null,null,null,11,"","P11",null,null,null,null,null,null,null,null,null,null,null,null,null,null,null,null,null,null,null,null,null,null,null,11,"","P11"]
[null,"Folgende Inhalte wurden in der pädagogischen Lehrkräfteschulung (Themenbereich I) vermittelt:",null,null,null,null,null,null,null,null,null,null,null,null,null,null,null,null,null,null,null,null,null,null,null,null,null,"Folgende Inhalte wurden in der Pädagogischen Lehrkräfteschulung (Themenbereich II) vermittelt:",null,null,null,null,null,null,null,null,null,null,null,null,null,null,null,null,null,null,null,null,null,null,null,null,null,"Folgende Inhalte wurden in der Pädagogischen Lehrkräfteschulung (Themenbereich II) für Pädagogen vermittelt:",null,null,null,null,null,null,null,null,null,null,null,null,null,null,null,null,null,null,null,null,null,null,null,null,null,"Folgende Inhalte wurden in der Pädagogischen Lehrkräfteschulung vermittelt:",null,null,null,null,null,null,null,null,null,null,null,null,null,null,null,null,null,null,null,null,null,null,null,null,null,"Folgende Inhalte wurden in der Ausbildung zum Erste Hilfe-Ausbilder mit mindestens 5 Lerneinheiten (LE) vermittelt:",null,null,null,null,null,null,null,null,null,null,null,null,null,null,null,null,null,null,null,null,null,null,null,null,null,"Folgende Inhalte wurden in der Ausbildung zum Erste Hilfe-Ausbilder mit mindestens 5 Lerneinheiten (LE) vermittelt:",null,null,null,null,null,null,null,null,null,null,null,null,null,null,null,null,null,null,null,null,null,null,null,null,null,"Folgende Inhalte für die Zusatzqualifikation wurden dem Erste Hilfe-Ausbilder mit mindestens 16 Lerneinheiten (LE) vermittelt:",null,null,null,null,null,null,null,null,null,null,null,null,null,null,null,null,null,null,null,null,null,null,null,null,14,null,null,null,null,null,null,null,null,null,null,null,null,null,null,null,null,null,null,null,null,null,null,null,null,null,null,null,null,null,null,null,null,null,null,null,null,null,null,null,null,null,null,null,null,null,null,null,null,null,null,null,null,null,null,null,null,null,null,null,null,null,null,null,null,null,null,null,null,null,null,null,null,null,null,null,null,null,null,null,null,null,null,null,null,null,null,null,null,null,null,null,null,null,null,null,null,null,null,null,null,null,null,null,null,null,null,null,null,null,null,null,null,null,null,null,null,null,null,null,null,null,null,null,null,null,null,null,null,null,null,null,null,null,null,null,null,null,null,null,null,null,null,null,null,null,null,null,null,null,null,null,null,null,null,null,null,null,null,null,null,null,null,null,null,null,null,null,null,null,null,null,null,null,null,null,null,null,null,null,null,null,null,null,null,null,null,null,null,null,null,null,null,null,null,null,null,null,null,null,null,null,null,null,null,null,null,null,null,null,null,null,null,null,null,null,null,null,null,null,null,null,null,null,null,null,null,null,null,null,null,null,null,null,12,"","P12",null,null,null,null,null,null,null,null,null,null,null,null,null,null,null,null,null,null,null,null,null,null,null,12,"","P12",null,null,null,null,null,null,null,null,null,null,null,null,null,null,null,null,null,null,null,null,null,null,null,12,"","P12",null,null,null,null,null,null,null,null,null,null,null,null,null,null,null,null,null,null,null,null,null,null,null,12,"","P12"]
[null,null,null,null,null,null,null,null,null,null,null,null,null,null,null,null,null,null,null,null,null,null,null,null,null,null,null,null,null,null,null,null,null,null,null,null,null,null,null,null,null,null,null,null,null,null,null,null,null,null,null,null,null,null,null,null,null,null,null,null,null,null,null,null,null,null,null,null,null,null,null,null,null,null,null,null,null,null,null,null,null,null,null,null,null,null,null,null,null,null,null,null,null,null,null,null,null,null,null,null,null,null,null,null,null,null,null,null,null,null,null,null,null,null,null,null,null,null,null,null,null,null,null,null,null,null,null,null,null,null,null,null,null,null,null,null,null,null,null,null,null,null,null,null,null,null,null,null,null,null,null,null,null,null,null,null,null,null,null,null,null,null,null,null,null,null,null,null,null,null,null,null,null,null,null,null,null,null,null,null,null,null,15,null,null,null,null,null,null,null,null,null,null,null,null,null,null,null,null,null,null,null,null,null,null,null,null,null,null,null,null,null,null,null,null,null,null,null,null,null,null,null,null,null,null,null,null,null,null,null,null,null,null,null,null,null,null,null,null,null,null,null,null,null,null,null,null,null,null,null,null,null,null,null,null,null,null,null,null,null,null,null,null,null,null,null,null,null,null,null,null,null,null,null,null,null,null,null,null,null,null,null,null,null,null,null,null,null,null,null,null,null,null,null,null,null,null,null,null,null,null,null,null,null,null,null,null,null,null,null,null,null,null,null,null,null,null,null,null,null,null,null,null,null,null,null,null,null,null,null,null,null,null,null,null,null,null,null,null,null,null,null,null,null,null,null,null,null,null,null,null,null,null,null,null,null,null,null,null,null,null,null,null,null,null,null,null,null,null,null,null,null,null,null,null,null,null,null,null,null,null,null,null,null,null,null,null,null,null,null,null,null,null,null,null,null,null,null,null,null,null,null,null,null,null,null,null,null,null,null,null,null,null,null,null,null,null,null,"Pädagogische Inhalte gesamt: ",null,null,null,null,null,null,null,null,null,null,null,null,null,null,null,null,null,null,null,null,null,{"$f":"IF(SUM(PY51:PZ62),SUM(PY51:PZ62),\"\")","v":""},null,null,null,"Pädagogische Inhalte gesamt: ",null,null,null,null,null,null,null,null,null,null,null,null,null,null,null,null,null,null,null,null,null,{"$f":"IF(SUM(QY51:QZ62),SUM(QY51:QZ62),\"\")","v":""},null,null,null,"Pädagogische Inhalte gesamt: ",null,null,null,null,null,null,null,null,null,null,null,null,null,null,null,null,null,null,null,null,null,{"$f":"IF(SUM(RY51:RZ62),SUM(RY51:RZ62),\"\")","v":""},null,null,null,"Pädagogische Inhalte gesamt: ",null,null,null,null,null,null,null,null,null,null,null,null,null,null,null,null,null,null,null,null,null,{"$f":"IF(SUM(SY51:SZ62),SUM(SY51:SZ62),\"\")","v":""}]
[null,null,null,null,null,null,null,null,null,null,null,null,null,null,null,null,null,null,null,null,null,null,null,null,null,null,null,null,null,null,null,null,null,null,null,null,null,null,null,null,null,null,null,null,null,null,null,null,null,null,null,null,null,null,null,null,null,null,null,null,null,null,null,null,null,null,null,null,null,null,null,null,null,null,null,null,null,null,null,null,null,null,null,null,null,null,null,null,null,null,null,null,null,null,null,null,null,null,null,null,null,null,null,null,null,null,null,null,null,null,null,null,null,null,null,null,null,null,null,null,null,null,null,null,null,null,null,null,null,null,null,null,null,null,null,null,null,null,null,null,null,null,null,null,null,null,null,null,null,null,null,null,null,null,null,null,null,null,null,null,null,null,null,null,null,null,null,null,null,null,null,null,null,null,null,null,null,null,null,null,null,null,16,null,null,null,null,null,null,null,null,null,null,null,null,null,null,null,null,null,null,null,null,null,null,null,null,null,null,null,null,null,null,null,null,null,null,null,null,null,null,null,null,null,null,null,null,null,null,null,null,null,null,null,null,null,null,null,null,null,null,null,null,null,null,null,null,null,null,null,null,null,null,null,null,null,null,null,null,null,null,null,null,null,null,null,null,null,null,null,null,null,null,null,null,null,null,null,null,null,null,null,null,null,null,null,null,"•  Herz-Kreislauf-Störung, akutes Koronarsyndrom, Schock, \n   Volumenmangelschock\n",null,null,null,null,null,null,null,null,null,null,null,null,null,null,null,null,null,null,null,null,null,null,null,null,null,"•   Vergiftungen durch Injektionen und Tierbisse, Schock (allgemein), \n    Volumenmangelschock, Kardiogener Schock, Neurogener Schock, \n    Vasovagale Synkope, Anaphylaktischer Schock",null,null,null,null,null,null,null,null,null,null,null,null,null,null,null,null,null,null,null,null,null,null,null,null,null,null,null,null,null,null,null,null,null,null,null,null,null,null,null,null,null,null,null,null,null,null,null,null,null,null,null,"•  Vertiefung des Erlernten\n•  Materialpflege\n",null,null,null,null,null,null,null,null,null,null,null,null,null,null,null,null,null,null,null,null,null,null,null,null,null,"•  Schmink- und Darstellungskunde II\n•  Requisiten\n•  Szenarien"]
[1,null,null,null,null,null,null,null,null,null,null,null,null,null,null,null,null,null,null,null,null,null,null,null,null,null,1,null,null,null,null,null,null,null,null,null,null,null,null,null,null,null,null,null,null,null,null,null,null,null,null,null,1,null,null,null,null,null,null,null,null,null,null,null,null,null,null,null,null,null,null,null,null,null,null,null,null,null,1,null,null,null,null,null,null,null,null,null,null,null,null,null,null,null,null,null,null,null,null,null,null,null,null,null,1,null,null,null,null,null,null,null,null,null,null,null,null,null,null,null,null,null,null,null,null,null,null,null,null,null,1,null,null,null,null,null,null,null,null,null,null,null,null,null,null,null,null,null,null,null,null,null,null,null,null,null,1,"•  Strukturellen Merkmale dieser Ausbildungsform",null,null,null,null,null,null,null,null,null,null,null,null,null,null,null,null,null,null,null,null,null,null,null,null,17,null,null,null,null,null,null,null,null,null,null,null,null,null,null,null,null,null,null,null,null,null,null,null,null,null,1,null,null,null,null,null,null,null,null,null,null,null,null,null,null,null,null,null,null,null,null,null,null,null,null,null,1,null,null,null,null,null,null,null,null,null,null,null,null,null,null,null,null,null,null,null,null,null,null,null,null,null,1,null,null,null,null,null,null,null,null,null,null,null,null,null,null,null,null,null,null,null,null,null,null,null,null,null,1,null,null,null,null,null,null,null,null,null,null,null,null,null,null,null,null,null,null,null,null,null,null,null,null,null,1,null,null,null,null,null,null,null,null,null,null,null,null,null,null,null,null,null,null,null,null,null,null,null,null,null,1,null,null,null,null,null,null,null,null,null,null,null,null,null,null,null,null,null,null,null,null,null,null,null,null,null,1,null,null,null,null,null,null,null,null,null,null,null,null,null,null,null,null,null,null,null,null,null,null,null,null,null,1]
[2,null,null,null,null,null,null,null,null,null,null,null,null,null,null,null,null,null,null,null,null,null,null,null,null,null,2,null,null,null,null,null,null,null,null,null,null,null,null,null,null,null,null,null,null,null,null,null,null,null,null,null,2,null,null,null,null,null,null,null,null,null,null,null,null,null,null,null,null,null,null,null,null,null,null,null,null,null,2,null,null,null,null,null,null,null,null,null,null,null,null,null,null,null,null,null,null,null,null,null,null,null,null,null,2,null,null,null,null,null,null,null,null,null,null,null,null,null,null,null,null,null,null,null,null,null,null,null,null,null,2,null,null,null,null,null,null,null,null,null,null,null,null,null,null,null,null,null,null,null,null,null,null,null,null,null,2,"•  Das Kind als besonderer Patient",null,null,null,null,null,null,null,null,null,null,null,null,null,null,null,null,null,null,null,null,null,null,null,null,18,null,null,null,null,null,null,null,null,null,null,null,null,null,null,null,null,null,null,null,null,null,null,null,null,null,2,null,null,null,null,null,null,null,null,null,null,null,null,null,null,null,null,null,null,null,null,null,null,null,null,null,2,null,null,null,null,null,null,null,null,null,null,null,null,null,null,null,null,null,null,null,null,null,null,null,null,null,2,null,null,null,null,null,null,null,null,null,null,null,null,null,null,null,null,null,null,null,null,null,null,null,null,null,2,null,null,null,null,null,null,null,null,null,null,null,null,null,null,null,null,null,null,null,null,null,null,null,null,null,2,null,null,null,null,null,null,null,null,null,null,null,null,null,null,null,null,null,null,null,null,null,null,null,null,null,2,null,null,null,null,null,null,null,null,null,null,null,null,null,null,null,null,null,null,null,null,null,null,null,null,null,2,null,null,null,null,null,null,null,null,null,null,null,null,null,null,null,null,null,null,null,null,null,null,null,null,null,2,null,null,null,null,null,null,null,null,null,null,null,null,null,null,null,null,null,null,null,null,null,null,null,null,null,null,"Fachliche medizinische Inhalte",null,null,null,null,null,null,null,null,null,null,null,null,null,null,null,null,null,null,null,null,null,null,"LE",null,null,"Fachliche medizinische Inhalte",null,null,null,null,null,null,null,null,null,null,null,null,null,null,null,null,null,null,null,null,null,null,"LE",null,null,"Fachliche medizinische Inhalte",null,null,null,null,null,null,null,null,null,null,null,null,null,null,null,null,null,null,null,null,null,null,"LE",null,null,"Fachliche medizinische Inhalte",null,null,null,null,null,null,null,null,null,null,null,null,null,null,null,null,null,null,null,null,null,null,"LE"]
[3,null,null,null,null,null,null,null,null,null,null,null,null,null,null,null,null,null,null,null,null,null,null,null,null,null,3,null,null,null,null,null,null,null,null,null,null,null,null,null,null,null,null,null,null,null,null,null,null,null,null,null,3,null,null,null,null,null,null,null,null,null,null,null,null,null,null,null,null,null,null,null,null,null,null,null,null,null,3,null,null,null,null,null,null,null,null,null,null,null,null,null,null,null,null,null,null,null,null,null,null,null,null,null,3,null,null,null,null,null,null,null,null,null,null,null,null,null,null,null,null,null,null,null,null,null,null,null,null,null,3,null,null,null,null,null,null,null,null,null,null,null,null,null,null,null,null,null,null,null,null,null,null,null,null,null,3,"•  Kenntnisse über kinderbezogene Notfälle und Kinderkrankheiten",null,null,null,null,null,null,null,null,null,null,null,null,null,null,null,null,null,null,null,null,null,null,null,null,19,null,null,null,null,null,null,null,null,null,null,null,null,null,null,null,null,null,null,null,null,null,null,null,null,null,3,null,null,null,null,null,null,null,null,null,null,null,null,null,null,null,null,null,null,null,null,null,null,null,null,null,3,null,null,null,null,null,null,null,null,null,null,null,null,null,null,null,null,null,null,null,null,null,null,null,null,null,3,null,null,null,null,null,null,null,null,null,null,null,null,null,null,null,null,null,null,null,null,null,null,null,null,null,3,"•  Sportverletzungen, Gelenkverletzungen, Knochenbruch, Alu-Polster-\n   schiene, Halswirbelsäulenbruch, HWS-Stützkragen\n",null,null,null,null,null,null,null,null,null,null,null,null,null,null,null,null,null,null,null,null,null,null,null,null,3,"•  Schaufeltrage, mögl. zum Einsatz der Schaufeltrage, Vakuummatratze,\n   Einsatz der Vakuummatratze, CombiCarrier, Besonderheiten des \n   CombiCarrier, Spineboard, praktisches Vorgehen an Land",null,null,null,null,null,null,null,null,null,null,null,null,null,null,null,null,null,null,null,null,null,null,null,null,3,null,null,null,null,null,null,null,null,null,null,null,null,null,null,null,null,null,null,null,null,null,null,null,null,null,3,null,null,null,null,null,null,null,null,null,null,null,null,null,null,null,null,null,null,null,null,null,null,null,null,null,3,"•  Rechtliche Grundlagen\n•  Versicherungen\n•  Sicherheit bei der RUND-Darstellung",null,null,null,null,null,null,null,null,null,null,null,null,null,null,null,null,null,null,null,null,null,null,null,null,1,{"$f":"IF(PY67<>\"\",\"•\",\"\")","v":""},"F1",null,null,null,null,null,null,null,null,null,null,null,null,null,null,null,null,null,null,null,null,null,null,null,1,{"$f":"IF(QY67<>\"\",\"•\",\"\")","v":""},"F1",null,null,null,null,null,null,null,null,null,null,null,null,null,null,null,null,null,null,null,null,null,null,null,1,{"$f":"IF(RY67<>\"\",\"•\",\"\")","v":""},"F1",null,null,null,null,null,null,null,null,null,null,null,null,null,null,null,null,null,null,null,null,null,null,null,1,{"$f":"IF(SY67<>\"\",\"•\",\"\")","v":""},"F1"]
[4,null,null,null,null,null,null,null,null,null,null,null,null,null,null,null,null,null,null,null,null,null,null,null,null,null,4,null,null,null,null,null,null,null,null,null,null,null,null,null,null,null,null,null,null,null,null,null,null,null,null,null,4,null,null,null,null,null,null,null,null,null,null,null,null,null,null,null,null,null,null,null,null,null,null,null,null,null,4,null,null,null,null,null,null,null,null,null,null,null,null,null,null,null,null,null,null,null,null,null,null,null,null,null,4,null,null,null,null,null,null,null,null,null,null,null,null,null,null,null,null,null,null,null,null,null,null,null,null,null,4,null,null,null,null,null,null,null,null,null,null,null,null,null,null,null,null,null,null,null,null,null,null,null,null,null,4,"•  Auffinden eines bewusstlosen Kleinkindes bzw. Säuglings",null,null,null,null,null,null,null,null,null,null,null,null,null,null,null,null,null,null,null,null,null,null,null,null,20,null,null,null,null,null,null,null,null,null,null,null,null,null,null,null,null,null,null,null,null,null,null,null,null,null,4,null,null,null,null,null,null,null,null,null,null,null,null,null,null,null,null,null,null,null,null,null,null,null,null,null,4,null,null,null,null,null,null,null,null,null,null,null,null,null,null,null,null,null,null,null,null,null,null,null,null,null,4,null,null,null,null,null,null,null,null,null,null,null,null,null,null,null,null,null,null,null,null,null,null,null,null,null,4,null,null,null,null,null,null,null,null,null,null,null,null,null,null,null,null,null,null,null,null,null,null,null,null,null,4,null,null,null,null,null,null,null,null,null,null,null,null,null,null,null,null,null,null,null,null,null,null,null,null,null,4,null,null,null,null,null,null,null,null,null,null,null,null,null,null,null,null,null,null,null,null,null,null,null,null,null,4,null,null,null,null,null,null,null,null,null,null,null,null,null,null,null,null,null,null,null,null,null,null,null,null,null,4,null,null,null,null,null,null,null,null,null,null,null,null,null,null,null,null,null,null,null,null,null,null,null,null,null,2,{"$f":"IF(PY68<>\"\",\"•\",\"\")","v":""},"F2",null,null,null,null,null,null,null,null,null,null,null,null,null,null,null,null,null,null,null,null,null,null,null,2,{"$f":"IF(QY68<>\"\",\"•\",\"\")","v":""},"F2",null,null,null,null,null,null,null,null,null,null,null,null,null,null,null,null,null,null,null,null,null,null,null,2,{"$f":"IF(RY68<>\"\",\"•\",\"\")","v":""},"F2",null,null,null,null,null,null,null,null,null,null,null,null,null,null,null,null,null,null,null,null,null,null,null,2,{"$f":"IF(SY68<>\"\",\"•\",\"\")","v":""},"F2"]
[5,null,null,null,null,null,null,null,null,null,null,null,null,null,null,null,null,null,null,null,null,null,null,null,null,null,5,null,null,null,null,null,null,null,null,null,null,null,null,null,null,null,null,null,null,null,null,null,null,null,null,null,5,null,null,null,null,null,null,null,null,null,null,null,null,null,null,null,null,null,null,null,null,null,null,null,null,null,5,null,null,null,null,null,null,null,null,null,null,null,null,null,null,null,null,null,null,null,null,null,null,null,null,null,5,null,null,null,null,null,null,null,null,null,null,null,null,null,null,null,null,null,null,null,null,null,null,null,null,null,5,null,null,null,null,null,null,null,null,null,null,null,null,null,null,null,null,null,null,null,null,null,null,null,null,null,5,"•  Seitenlage Kleinkinder bzw. Bauchlage (Säugling)",null,null,null,null,null,null,null,null,null,null,null,null,null,null,null,null,null,null,null,null,null,null,null,null,21,null,null,null,null,null,null,null,null,null,null,null,null,null,null,null,null,null,null,null,null,null,null,null,null,null,5,null,null,null,null,null,null,null,null,null,null,null,null,null,null,null,null,null,null,null,null,null,null,null,null,null,5,null,null,null,null,null,null,null,null,null,null,null,null,null,null,null,null,null,null,null,null,null,null,null,null,null,5,null,null,null,null,null,null,null,null,null,null,null,null,null,null,null,null,null,null,null,null,null,null,null,null,null,5,null,null,null,null,null,null,null,null,null,null,null,null,null,null,null,null,null,null,null,null,null,null,null,null,null,5,null,null,null,null,null,null,null,null,null,null,null,null,null,null,null,null,null,null,null,null,null,null,null,null,null,5,null,null,null,null,null,null,null,null,null,null,null,null,null,null,null,null,null,null,null,null,null,null,null,null,null,5,null,null,null,null,null,null,null,null,null,null,null,null,null,null,null,null,null,null,null,null,null,null,null,null,null,5,null,null,null,null,null,null,null,null,null,null,null,null,null,null,null,null,null,null,null,null,null,null,null,null,null,3,"","F3",null,null,null,null,null,null,null,null,null,null,null,null,null,null,null,null,null,null,null,null,null,null,null,3,"","F3",null,null,null,null,null,null,null,null,null,null,null,null,null,null,null,null,null,null,null,null,null,null,null,3,"","F3",null,null,null,null,null,null,null,null,null,null,null,null,null,null,null,null,null,null,null,null,null,null,null,3,"","F3"]
[6,null,null,null,null,null,null,null,null,null,null,null,null,null,null,null,null,null,null,null,null,null,null,null,null,null,6,null,null,null,null,null,null,null,null,null,null,null,null,null,null,null,null,null,null,null,null,null,null,null,null,null,6,null,null,null,null,null,null,null,null,null,null,null,null,null,null,null,null,null,null,null,null,null,null,null,null,null,6,null,null,null,null,null,null,null,null,null,null,null,null,null,null,null,null,null,null,null,null,null,null,null,null,null,6,null,null,null,null,null,null,null,null,null,null,null,null,null,null,null,null,null,null,null,null,null,null,null,null,null,6,null,null,null,null,null,null,null,null,null,null,null,null,null,null,null,null,null,null,null,null,null,null,null,null,null,6,"•  Beatmung von Kleinkindern und Säuglingen",null,null,null,null,null,null,null,null,null,null,null,null,null,null,null,null,null,null,null,null,null,null,null,null,22,null,null,null,null,null,null,null,null,null,null,null,null,null,null,null,null,null,null,null,null,null,null,null,null,null,6,null,null,null,null,null,null,null,null,null,null,null,null,null,null,null,null,null,null,null,null,null,null,null,null,null,6,null,null,null,null,null,null,null,null,null,null,null,null,null,null,null,null,null,null,null,null,null,null,null,null,null,6,null,null,null,null,null,null,null,null,null,null,null,null,null,null,null,null,null,null,null,null,null,null,null,null,null,6,"•  Schlaganfall, Krampfanfälle, Blutzuckerentgleisung, Akuter Bauch, \n   Gynäkologischer Notfall\n",null,null,null,null,null,null,null,null,null,null,null,null,null,null,null,null,null,null,null,null,null,null,null,null,6,"•  Anatomie des Schädels, Gewalteinwirkung auf den Kopf, Schädel-Hirn-\n   Trauma, Helmabnahme, Wirbelsäulenbruch, Beckenbruch, \n   Beckenbruchstabilisierungsgurt (T-POD), Polytrauma",null,null,null,null,null,null,null,null,null,null,null,null,null,null,null,null,null,null,null,null,null,null,null,null,6,null,null,null,null,null,null,null,null,null,null,null,null,null,null,null,null,null,null,null,null,null,null,null,null,null,6,null,null,null,null,null,null,null,null,null,null,null,null,null,null,null,null,null,null,null,null,null,null,null,null,null,6,"•  Feedback\n\n",null,null,null,null,null,null,null,null,null,null,null,null,null,null,null,null,null,null,null,null,null,null,null,null,4,"","F4",null,null,null,null,null,null,null,null,null,null,null,null,null,null,null,null,null,null,null,null,null,null,null,4,"","F4",null,null,null,null,null,null,null,null,null,null,null,null,null,null,null,null,null,null,null,null,null,null,null,4,"","F4",null,null,null,null,null,null,null,null,null,null,null,null,null,null,null,null,null,null,null,null,null,null,null,4,"","F4"]
[7,null,null,null,null,null,null,null,null,null,null,null,null,null,null,null,null,null,null,null,null,null,null,null,null,null,7,null,null,null,null,null,null,null,null,null,null,null,null,null,null,null,null,null,null,null,null,null,null,null,null,null,7,null,null,null,null,null,null,null,null,null,null,null,null,null,null,null,null,null,null,null,null,null,null,null,null,null,7,null,null,null,null,null,null,null,null,null,null,null,null,null,null,null,null,null,null,null,null,null,null,null,null,null,7,null,null,null,null,null,null,null,null,null,null,null,null,null,null,null,null,null,null,null,null,null,null,null,null,null,7,null,null,null,null,null,null,null,null,null,null,null,null,null,null,null,null,null,null,null,null,null,null,null,null,null,7,"•  Herz-Lungen-Wiederbelebung bei Säuglingen",null,null,null,null,null,null,null,null,null,null,null,null,null,null,null,null,null,null,null,null,null,null,null,null,23,null,null,null,null,null,null,null,null,null,null,null,null,null,null,null,null,null,null,null,null,null,null,null,null,null,7,null,null,null,null,null,null,null,null,null,null,null,null,null,null,null,null,null,null,null,null,null,null,null,null,null,7,null,null,null,null,null,null,null,null,null,null,null,null,null,null,null,null,null,null,null,null,null,null,null,null,null,7,null,null,null,null,null,null,null,null,null,null,null,null,null,null,null,null,null,null,null,null,null,null,null,null,null,7,null,null,null,null,null,null,null,null,null,null,null,null,null,null,null,null,null,null,null,null,null,null,null,null,null,7,null,null,null,null,null,null,null,null,null,null,null,null,null,null,null,null,null,null,null,null,null,null,null,null,null,7,null,null,null,null,null,null,null,null,null,null,null,null,null,null,null,null,null,null,null,null,null,null,null,null,null,7,null,null,null,null,null,null,null,null,null,null,null,null,null,null,null,null,null,null,null,null,null,null,null,null,null,7,null,null,null,null,null,null,null,null,null,null,null,null,null,null,null,null,null,null,null,null,null,null,null,null,null,5,"","F5",null,null,null,null,null,null,null,null,null,null,null,null,null,null,null,null,null,null,null,null,null,null,null,5,"","F5",null,null,null,null,null,null,null,null,null,null,null,null,null,null,null,null,null,null,null,null,null,null,null,5,"","F5",null,null,null,null,null,null,null,null,null,null,null,null,null,null,null,null,null,null,null,null,null,null,null,5,"","F5"]
[8,null,null,null,null,null,null,null,null,null,null,null,null,null,null,null,null,null,null,null,null,null,null,null,null,null,8,null,null,null,null,null,null,null,null,null,null,null,null,null,null,null,null,null,null,null,null,null,null,null,null,null,8,null,null,null,null,null,null,null,null,null,null,null,null,null,null,null,null,null,null,null,null,null,null,null,null,null,8,null,null,null,null,null,null,null,null,null,null,null,null,null,null,null,null,null,null,null,null,null,null,null,null,null,8,null,null,null,null,null,null,null,null,null,null,null,null,null,null,null,null,null,null,null,null,null,null,null,null,null,8,null,null,null,null,null,null,null,null,null,null,null,null,null,null,null,null,null,null,null,null,null,null,null,null,null,8,"•  Herz-Lungen-Wiederbelebung bei Kleinkindern",null,null,null,null,null,null,null,null,null,null,null,null,null,null,null,null,null,null,null,null,null,null,null,null,24,null,null,null,null,null,null,null,null,null,null,null,null,null,null,null,null,null,null,null,null,null,null,null,null,null,8,null,null,null,null,null,null,null,null,null,null,null,null,null,null,null,null,null,null,null,null,null,null,null,null,null,8,null,null,null,null,null,null,null,null,null,null,null,null,null,null,null,null,null,null,null,null,null,null,null,null,null,8,null,null,null,null,null,null,null,null,null,null,null,null,null,null,null,null,null,null,null,null,null,null,null,null,null,8,null,null,null,null,null,null,null,null,null,null,null,null,null,null,null,null,null,null,null,null,null,null,null,null,null,8,null,null,null,null,null,null,null,null,null,null,null,null,null,null,null,null,null,null,null,null,null,null,null,null,null,8,null,null,null,null,null,null,null,null,null,null,null,null,null,null,null,null,null,null,null,null,null,null,null,null,null,8,null,null,null,null,null,null,null,null,null,null,null,null,null,null,null,null,null,null,null,null,null,null,null,null,null,8,null,null,null,null,null,null,null,null,null,null,null,null,null,null,null,null,null,null,null,null,null,null,null,null,null,6,"","F6",null,null,null,null,null,null,null,null,null,null,null,null,null,null,null,null,null,null,null,null,null,null,null,6,"","F6",null,null,null,null,null,null,null,null,null,null,null,null,null,null,null,null,null,null,null,null,null,null,null,6,"","F6",null,null,null,null,null,null,null,null,null,null,null,null,null,null,null,null,null,null,null,null,null,null,null,6,"","F6"]
[9,null,null,null,null,null,null,null,null,null,null,null,null,null,null,null,null,null,null,null,null,null,null,null,null,null,9,null,null,null,null,null,null,null,null,null,null,null,null,null,null,null,null,null,null,null,null,null,null,null,null,null,9,null,null,null,null,null,null,null,null,null,null,null,null,null,null,null,null,null,null,null,null,null,null,null,null,null,9,null,null,null,null,null,null,null,null,null,null,null,null,null,null,null,null,null,null,null,null,null,null,null,null,null,9,null,null,null,null,null,null,null,null,null,null,null,null,null,null,null,null,null,null,null,null,null,null,null,null,null,9,null,null,null,null,null,null,null,null,null,null,null,null,null,null,null,null,null,null,null,null,null,null,null,null,null,9,null,null,null,null,null,null,null,null,null,null,null,null,null,null,null,null,null,null,null,null,null,null,null,null,null,25,null,null,null,null,null,null,null,null,null,null,null,null,null,null,null,null,null,null,null,null,null,null,null,null,null,9,null,null,null,null,null,null,null,null,null,null,null,null,null,null,null,null,null,null,null,null,null,null,null,null,null,9,null,null,null,null,null,null,null,null,null,null,null,null,null,null,null,null,null,null,null,null,null,null,null,null,null,9,null,null,null,null,null,null,null,null,null,null,null,null,null,null,null,null,null,null,null,null,null,null,null,null,null,9,"•  Verletzungen durch Nesseltiere, Insektenstiche, Zeckenstich, Wunden,\n   Verbände – Praxis, Notverband, Bedrohliche Blutungen, Tourniquet,\n   Hygiene, Hygiene im Einsatz, Händewaschen, Händedesinfektion",null,null,null,null,null,null,null,null,null,null,null,null,null,null,null,null,null,null,null,null,null,null,null,null,9,"•  Hygiene, Hygiene im Einsatz, Desinfektionsplan, Anwendungshinweise für \n   die Desinfektion, Herstellung einer Desinfektionslösung, Abfallbeseitigung\n",null,null,null,null,null,null,null,null,null,null,null,null,null,null,null,null,null,null,null,null,null,null,null,null,9,null,null,null,null,null,null,null,null,null,null,null,null,null,null,null,null,null,null,null,null,null,null,null,null,null,9,null,null,null,null,null,null,null,null,null,null,null,null,null,null,null,null,null,null,null,null,null,null,null,null,null,9,null,null,null,null,null,null,null,null,null,null,null,null,null,null,null,null,null,null,null,null,null,null,null,null,null,7,"","F7",null,null,null,null,null,null,null,null,null,null,null,null,null,null,null,null,null,null,null,null,null,null,null,7,"","F7",null,null,null,null,null,null,null,null,null,null,null,null,null,null,null,null,null,null,null,null,null,null,null,7,"","F7",null,null,null,null,null,null,null,null,null,null,null,null,null,null,null,null,null,null,null,null,null,null,null,7,"","F7"]
[10,null,null,null,null,null,null,null,null,null,null,null,null,null,null,null,null,null,null,null,null,null,null,null,null,null,10,null,null,null,null,null,null,null,null,null,null,null,null,null,null,null,null,null,null,null,null,null,null,null,null,null,10,null,null,null,null,null,null,null,null,null,null,null,null,null,null,null,null,null,null,null,null,null,null,null,null,null,10,null,null,null,null,null,null,null,null,null,null,null,null,null,null,null,null,null,null,null,null,null,null,null,null,null,10,null,null,null,null,null,null,null,null,null,null,null,null,null,null,null,null,null,null,null,null,null,null,null,null,null,10,null,null,null,null,null,null,null,null,null,null,null,null,null,null,null,null,null,null,null,null,null,null,null,null,null,10,null,null,null,null,null,null,null,null,null,null,null,null,null,null,null,null,null,null,null,null,null,null,null,null,null,26,null,null,null,null,null,null,null,null,null,null,null,null,null,null,null,null,null,null,null,null,null,null,null,null,null,10,null,null,null,null,null,null,null,null,null,null,null,null,null,null,null,null,null,null,null,null,null,null,null,null,null,10,null,null,null,null,null,null,null,null,null,null,null,null,null,null,null,null,null,null,null,null,null,null,null,null,null,10,null,null,null,null,null,null,null,null,null,null,null,null,null,null,null,null,null,null,null,null,null,null,null,null,null,10,null,null,null,null,null,null,null,null,null,null,null,null,null,null,null,null,null,null,null,null,null,null,null,null,null,10,null,null,null,null,null,null,null,null,null,null,null,null,null,null,null,null,null,null,null,null,null,null,null,null,null,10,null,null,null,null,null,null,null,null,null,null,null,null,null,null,null,null,null,null,null,null,null,null,null,null,null,10,null,null,null,null,null,null,null,null,null,null,null,null,null,null,null,null,null,null,null,null,null,null,null,null,null,10,null,null,null,null,null,null,null,null,null,null,null,null,null,null,null,null,null,null,null,null,null,null,null,null,null,8,"","F8",null,null,null,null,null,null,null,null,null,null,null,null,null,null,null,null,null,null,null,null,null,null,null,8,"","F8",null,null,null,null,null,null,null,null,null,null,null,null,null,null,null,null,null,null,null,null,null,null,null,8,"","F8",null,null,null,null,null,null,null,null,null,null,null,null,null,null,null,null,null,null,null,null,null,null,null,8,"","F8"]
[11,null,null,null,null,null,null,null,null,null,null,null,null,null,null,null,null,null,null,null,null,null,null,null,null,null,11,null,null,null,null,null,null,null,null,null,null,null,null,null,null,null,null,null,null,null,null,null,null,null,null,null,11,null,null,null,null,null,null,null,null,null,null,null,null,null,null,null,null,null,null,null,null,null,null,null,null,null,11,null,null,null,null,null,null,null,null,null,null,null,null,null,null,null,null,null,null,null,null,null,null,null,null,null,11,null,null,null,null,null,null,null,null,null,null,null,null,null,null,null,null,null,null,null,null,null,null,null,null,null,11,null,null,null,null,null,null,null,null,null,null,null,null,null,null,null,null,null,null,null,null,null,null,null,null,null,11,null,null,null,null,null,null,null,null,null,null,null,null,null,null,null,null,null,null,null,null,null,null,null,null,null,27,null,null,null,null,null,null,null,null,null,null,null,null,null,null,null,null,null,null,null,null,null,null,null,null,null,11,null,null,null,null,null,null,null,null,null,null,null,null,null,null,null,null,null,null,null,null,null,null,null,null,null,11,null,null,null,null,null,null,null,null,null,null,null,null,null,null,null,null,null,null,null,null,null,null,null,null,null,11,null,null,null,null,null,null,null,null,null,null,null,null,null,null,null,null,null,null,null,null,null,null,null,null,null,11,null,null,null,null,null,null,null,null,null,null,null,null,null,null,null,null,null,null,null,null,null,null,null,null,null,11,null,null,null,null,null,null,null,null,null,null,null,null,null,null,null,null,null,null,null,null,null,null,null,null,null,11,null,null,null,null,null,null,null,null,null,null,null,null,null,null,null,null,null,null,null,null,null,null,null,null,null,11,null,null,null,null,null,null,null,null,null,null,null,null,null,null,null,null,null,null,null,null,null,null,null,null,null,11,null,null,null,null,null,null,null,null,null,null,null,null,null,null,null,null,null,null,null,null,null,null,null,null,null,9,"","F9",null,null,null,null,null,null,null,null,null,null,null,null,null,null,null,null,null,null,null,null,null,null,null,9,"","F9",null,null,null,null,null,null,null,null,null,null,null,null,null,null,null,null,null,null,null,null,null,null,null,9,"","F9",null,null,null,null,null,null,null,null,null,null,null,null,null,null,null,null,null,null,null,null,null,null,null,9,"","F9"]
[12,null,null,null,null,null,null,null,null,null,null,null,null,null,null,null,null,null,null,null,null,null,null,null,null,null,12,null,null,null,null,null,null,null,null,null,null,null,null,null,null,null,null,null,null,null,null,null,null,null,null,null,12,null,null,null,null,null,null,null,null,null,null,null,null,null,null,null,null,null,null,null,null,null,null,null,null,null,12,null,null,null,null,null,null,null,null,null,null,null,null,null,null,null,null,null,null,null,null,null,null,null,null,null,12,null,null,null,null,null,null,null,null,null,null,null,null,null,null,null,null,null,null,null,null,null,null,null,null,null,12,null,null,null,null,null,null,null,null,null,null,null,null,null,null,null,null,null,null,null,null,null,null,null,null,null,12,null,null,null,null,null,null,null,null,null,null,null,null,null,null,null,null,null,null,null,null,null,null,null,null,null,28,null,null,null,null,null,null,null,null,null,null,null,null,null,null,null,null,null,null,null,null,null,null,null,null,null,12,null,null,null,null,null,null,null,null,null,null,null,null,null,null,null,null,null,null,null,null,null,null,null,null,null,12,null,null,null,null,null,null,null,null,null,null,null,null,null,null,null,null,null,null,null,null,null,null,null,null,null,12,null,null,null,null,null,null,null,null,null,null,null,null,null,null,null,null,null,null,null,null,null,null,null,null,null,12,"•  Persönliche Schutzausrüstung, Entsorgung bzw. Aufbereitung von \n   Materialien, Sonnenstich, Hitzschlag, Hitzeerschöpfung, Verbrennungen, \n   Verbrühungen, Unterkühlung, Stadien der Unterkühlung, Erfrierungen",null,null,null,null,null,null,null,null,null,null,null,null,null,null,null,null,null,null,null,null,null,null,null,null,12,"•  Sanitätseinsätze, Rettungsdienststrukturen, Der DLRG-Sanitäter bei \n   Großeinsätzen, Registrierung von Patienten\n",null,null,null,null,null,null,null,null,null,null,null,null,null,null,null,null,null,null,null,null,null,null,null,null,12,null,null,null,null,null,null,null,null,null,null,null,null,null,null,null,null,null,null,null,null,null,null,null,null,null,12,null,null,null,null,null,null,null,null,null,null,null,null,null,null,null,null,null,null,null,null,null,null,null,null,null,12,null,null,null,null,null,null,null,null,null,null,null,null,null,null,null,null,null,null,null,null,null,null,null,null,null,10,"","F10",null,null,null,null,null,null,null,null,null,null,null,null,null,null,null,null,null,null,null,null,null,null,null,10,"","F10",null,null,null,null,null,null,null,null,null,null,null,null,null,null,null,null,null,null,null,null,null,null,null,10,"","F10",null,null,null,null,null,null,null,null,null,null,null,null,null,null,null,null,null,null,null,null,null,null,null,10,"","F10"]
[13,null,null,null,null,null,null,null,null,null,null,null,null,null,null,null,null,null,null,null,null,null,null,null,null,null,13,null,null,null,null,null,null,null,null,null,null,null,null,null,null,null,null,null,null,null,null,null,null,null,null,null,13,null,null,null,null,null,null,null,null,null,null,null,null,null,null,null,null,null,null,null,null,null,null,null,null,null,13,null,null,null,null,null,null,null,null,null,null,null,null,null,null,null,null,null,null,null,null,null,null,null,null,null,13,null,null,null,null,null,null,null,null,null,null,null,null,null,null,null,null,null,null,null,null,null,null,null,null,null,13,null,null,null,null,null,null,null,null,null,null,null,null,null,null,null,null,null,null,null,null,null,null,null,null,null,13,null,null,null,null,null,null,null,null,null,null,null,null,null,null,null,null,null,null,null,null,null,null,null,null,null,29,null,null,null,null,null,null,null,null,null,null,null,null,null,null,null,null,null,null,null,null,null,null,null,null,null,13,null,null,null,null,null,null,null,null,null,null,null,null,null,null,null,null,null,null,null,null,null,null,null,null,null,13,null,null,null,null,null,null,null,null,null,null,null,null,null,null,null,null,null,null,null,null,null,null,null,null,null,13,null,null,null,null,null,null,null,null,null,null,null,null,null,null,null,null,null,null,null,null,null,null,null,null,null,13,null,null,null,null,null,null,null,null,null,null,null,null,null,null,null,null,null,null,null,null,null,null,null,null,null,13,null,null,null,null,null,null,null,null,null,null,null,null,null,null,null,null,null,null,null,null,null,null,null,null,null,13,null,null,null,null,null,null,null,null,null,null,null,null,null,null,null,null,null,null,null,null,null,null,null,null,null,13,null,null,null,null,null,null,null,null,null,null,null,null,null,null,null,null,null,null,null,null,null,null,null,null,null,13,null,null,null,null,null,null,null,null,null,null,null,null,null,null,null,null,null,null,null,null,null,null,null,null,null,11,"","F11",null,null,null,null,null,null,null,null,null,null,null,null,null,null,null,null,null,null,null,null,null,null,null,11,"","F11",null,null,null,null,null,null,null,null,null,null,null,null,null,null,null,null,null,null,null,null,null,null,null,11,"","F11",null,null,null,null,null,null,null,null,null,null,null,null,null,null,null,null,null,null,null,null,null,null,null,11,"","F11"]
[14,null,null,null,null,null,null,null,null,null,null,null,null,null,null,null,null,null,null,null,null,null,null,null,null,null,14,null,null,null,null,null,null,null,null,null,null,null,null,null,null,null,null,null,null,null,null,null,null,null,null,null,14,null,null,null,null,null,null,null,null,null,null,null,null,null,null,null,null,null,null,null,null,null,null,null,null,null,14,null,null,null,null,null,null,null,null,null,null,null,null,null,null,null,null,null,null,null,null,null,null,null,null,null,14,null,null,null,null,null,null,null,null,null,null,null,null,null,null,null,null,null,null,null,null,null,null,null,null,null,14,null,null,null,null,null,null,null,null,null,null,null,null,null,null,null,null,null,null,null,null,null,null,null,null,null,14,null,null,null,null,null,null,null,null,null,null,null,null,null,null,null,null,null,null,null,null,null,null,null,null,null,30,null,null,null,null,null,null,null,null,null,null,null,null,null,null,null,null,null,null,null,null,null,null,null,null,null,14,null,null,null,null,null,null,null,null,null,null,null,null,null,null,null,null,null,null,null,null,null,null,null,null,null,14,null,null,null,null,null,null,null,null,null,null,null,null,null,null,null,null,null,null,null,null,null,null,null,null,null,14,null,null,null,null,null,null,null,null,null,null,null,null,null,null,null,null,null,null,null,null,null,null,null,null,null,14,null,null,null,null,null,null,null,null,null,null,null,null,null,null,null,null,null,null,null,null,null,null,null,null,null,14,null,null,null,null,null,null,null,null,null,null,null,null,null,null,null,null,null,null,null,null,null,null,null,null,null,14,null,null,null,null,null,null,null,null,null,null,null,null,null,null,null,null,null,null,null,null,null,null,null,null,null,14,null,null,null,null,null,null,null,null,null,null,null,null,null,null,null,null,null,null,null,null,null,null,null,null,null,14,null,null,null,null,null,null,null,null,null,null,null,null,null,null,null,null,null,null,null,null,null,null,null,null,null,12,"","F12",null,null,null,null,null,null,null,null,null,null,null,null,null,null,null,null,null,null,null,null,null,null,null,12,"","F12",null,null,null,null,null,null,null,null,null,null,null,null,null,null,null,null,null,null,null,null,null,null,null,12,"","F12",null,null,null,null,null,null,null,null,null,null,null,null,null,null,null,null,null,null,null,null,null,null,null,12,"","F12"]
[15,null,null,null,null,null,null,null,null,null,null,null,null,null,null,null,null,null,null,null,null,null,null,null,null,null,15,null,null,null,null,null,null,null,null,null,null,null,null,null,null,null,null,null,null,null,null,null,null,null,null,null,15,null,null,null,null,null,null,null,null,null,null,null,null,null,null,null,null,null,null,null,null,null,null,null,null,null,15,null,null,null,null,null,null,null,null,null,null,null,null,null,null,null,null,null,null,null,null,null,null,null,null,null,15,null,null,null,null,null,null,null,null,null,null,null,null,null,null,null,null,null,null,null,null,null,null,null,null,null,15,null,null,null,null,null,null,null,null,null,null,null,null,null,null,null,null,null,null,null,null,null,null,null,null,null,15,null,null,null,null,null,null,null,null,null,null,null,null,null,null,null,null,null,null,null,null,null,null,null,null,null,31,null,null,null,null,null,null,null,null,null,null,null,null,null,null,null,null,null,null,null,null,null,null,null,null,null,15,null,null,null,null,null,null,null,null,null,null,null,null,null,null,null,null,null,null,null,null,null,null,null,null,null,15,null,null,null,null,null,null,null,null,null,null,null,null,null,null,null,null,null,null,null,null,null,null,null,null,null,15,null,null,null,null,null,null,null,null,null,null,null,null,null,null,null,null,null,null,null,null,null,null,null,null,null,15,"•  Transportieren, Schultertragegriff nach Rautek, Patienten aufnehmen und\n   Tragen, Rettungstuch, Krankentrage\n",null,null,null,null,null,null,null,null,null,null,null,null,null,null,null,null,null,null,null,null,null,null,null,null,15,null,null,null,null,null,null,null,null,null,null,null,null,null,null,null,null,null,null,null,null,null,null,null,null,null,15,null,null,null,null,null,null,null,null,null,null,null,null,null,null,null,null,null,null,null,null,null,null,null,null,null,15,null,null,null,null,null,null,null,null,null,null,null,null,null,null,null,null,null,null,null,null,null,null,null,null,null,15,null,null,null,null,null,null,null,null,null,null,null,null,null,null,null,null,null,null,null,null,null,null,null,null,null,null,null,"Medizinische Inhalte gesamt: ",null,null,null,null,null,null,null,null,null,null,null,null,null,null,null,null,null,null,null,null,null,{"$f":"IF(SUM(PY67:PZ78),SUM(PY66:PZ78),\"\")","v":""},null,null,null,"Medizinische Inhalte gesamt: ",null,null,null,null,null,null,null,null,null,null,null,null,null,null,null,null,null,null,null,null,null,{"$f":"IF(SUM(QY67:QZ78),SUM(QY66:QZ78),\"\")","v":""},null,null,null,"Medizinische Inhalte gesamt: ",null,null,null,null,null,null,null,null,null,null,null,null,null,null,null,null,null,null,null,null,null,{"$f":"IF(SUM(RY67:RZ78),SUM(RY66:RZ78),\"\")","v":""},null,null,null,"Medizinische Inhalte gesamt: ",null,null,null,null,null,null,null,null,null,null,null,null,null,null,null,null,null,null,null,null,null,{"$f":"IF(SUM(SY67:SZ78),SUM(SY66:SZ78),\"\")","v":""}]
[16,null,null,null,null,null,null,null,null,null,null,null,null,null,null,null,null,null,null,null,null,null,null,null,null,null,16,null,null,null,null,null,null,null,null,null,null,null,null,null,null,null,null,null,null,null,null,null,null,null,null,null,16,null,null,null,null,null,null,null,null,null,null,null,null,null,null,null,null,null,null,null,null,null,null,null,null,null,16,null,null,null,null,null,null,null,null,null,null,null,null,null,null,null,null,null,null,null,null,null,null,null,null,null,16,null,null,null,null,null,null,null,null,null,null,null,null,null,null,null,null,null,null,null,null,null,null,null,null,null,16,null,null,null,null,null,null,null,null,null,null,null,null,null,null,null,null,null,null,null,null,null,null,null,null,null,16,null,null,null,null,null,null,null,null,null,null,null,null,null,null,null,null,null,null,null,null,null,null,null,null,null,32,null,null,null,null,null,null,null,null,null,null,null,null,null,null,null,null,null,null,null,null,null,null,null,null,null,16,null,null,null,null,null,null,null,null,null,null,null,null,null,null,null,null,null,null,null,null,null,null,null,null,null,16,null,null,null,null,null,null,null,null,null,null,null,null,null,null,null,null,null,null,null,null,null,null,null,null,null,16,null,null,null,null,null,null,null,null,null,null,null,null,null,null,null,null,null,null,null,null,null,null,null,null,null,16,null,null,null,null,null,null,null,null,null,null,null,null,null,null,null,null,null,null,null,null,null,null,null,null,null,16,null,null,null,null,null,null,null,null,null,null,null,null,null,null,null,null,null,null,null,null,null,null,null,null,null,16,null,null,null,null,null,null,null,null,null,null,null,null,null,null,null,null,null,null,null,null,null,null,null,null,null,16,null,null,null,null,null,null,null,null,null,null,null,null,null,null,null,null,null,null,null,null,null,null,null,null,null,16]
[17,null,null,null,null,null,null,null,null,null,null,null,null,null,null,null,null,null,null,null,null,null,null,null,null,null,17,null,null,null,null,null,null,null,null,null,null,null,null,null,null,null,null,null,null,null,null,null,null,null,null,null,17,null,null,null,null,null,null,null,null,null,null,null,null,null,null,null,null,null,null,null,null,null,null,null,null,null,17,null,null,null,null,null,null,null,null,null,null,null,null,null,null,null,null,null,null,null,null,null,null,null,null,null,17,null,null,null,null,null,null,null,null,null,null,null,null,null,null,null,null,null,null,null,null,null,null,null,null,null,17,null,null,null,null,null,null,null,null,null,null,null,null,null,null,null,null,null,null,null,null,null,null,null,null,null,17,null,null,null,null,null,null,null,null,null,null,null,null,null,null,null,null,null,null,null,null,null,null,null,null,null,33,null,null,null,null,null,null,null,null,null,null,null,null,null,null,null,null,null,null,null,null,null,null,null,null,null,17,null,null,null,null,null,null,null,null,null,null,null,null,null,null,null,null,null,null,null,null,null,null,null,null,null,17,null,null,null,null,null,null,null,null,null,null,null,null,null,null,null,null,null,null,null,null,null,null,null,null,null,17,null,null,null,null,null,null,null,null,null,null,null,null,null,null,null,null,null,null,null,null,null,null,null,null,null,17,null,null,null,null,null,null,null,null,null,null,null,null,null,null,null,null,null,null,null,null,null,null,null,null,null,17,null,null,null,null,null,null,null,null,null,null,null,null,null,null,null,null,null,null,null,null,null,null,null,null,null,17,null,null,null,null,null,null,null,null,null,null,null,null,null,null,null,null,null,null,null,null,null,null,null,null,null,17,null,null,null,null,null,null,null,null,null,null,null,null,null,null,null,null,null,null,null,null,null,null,null,null,null,17,null,null,null,null,null,null,null,null,null,null,null,null,null,null,null,null,null,null,null,null,null,null,null,null,null,null,{"$f":"IF(QE41<>0,CONCATENATE(\"Insgesamt sind \",SUM(PY63,PY79),\" Lerneinheiten (1 LE = 45 Min.) anzurechnenden.\"),\"\")","v":""},null,null,null,null,null,null,null,null,null,null,null,null,null,null,null,null,null,null,null,null,null,null,null,null,null,{"$f":"IF(RE41<>0,CONCATENATE(\"Insgesamt sind \",SUM(QY63,QY79),\" Lerneinheiten (1 LE = 45 Min.) anzurechnenden.\"),\"\")","v":""},null,null,null,null,null,null,null,null,null,null,null,null,null,null,null,null,null,null,null,null,null,null,null,null,null,{"$f":"IF(SE41<>0,CONCATENATE(\"Insgesamt sind \",SUM(RY63,RY79),\" Lerneinheiten (1 LE = 45 Min.) anzurechnenden.\"),\"\")","v":""},null,null,null,null,null,null,null,null,null,null,null,null,null,null,null,null,null,null,null,null,null,null,null,null,null,{"$f":"IF(TE41<>0,CONCATENATE(\"Insgesamt sind \",SUM(SY63,SY79),\" Lerneinheiten (1 LE = 45 Min.) anzurechnenden.\"),\"\")","v":""}]
[18,null,null,null,null,null,null,null,null,null,null,null,null,null,null,null,null,null,null,null,null,null,null,null,null,null,18,null,null,null,null,null,null,null,null,null,null,null,null,null,null,null,null,null,null,null,null,null,null,null,null,null,18,null,null,null,null,null,null,null,null,null,null,null,null,null,null,null,null,null,null,null,null,null,null,null,null,null,18,null,null,null,null,null,null,null,null,null,null,null,null,null,null,null,null,null,null,null,null,null,null,null,null,null,18,null,null,null,null,null,null,null,null,null,null,null,null,null,null,null,null,null,null,null,null,null,null,null,null,null,18,null,null,null,null,null,null,null,null,null,null,null,null,null,null,null,null,null,null,null,null,null,null,null,null,null,18,null,null,null,null,null,null,null,null,null,null,null,null,null,null,null,null,null,null,null,null,null,null,null,null,null,null,null,null,null,null,null,null,null,null,null,null,null,null,null,null,null,null,null,null,null,null,null,null,null,null,null,18,null,null,null,null,null,null,null,null,null,null,null,null,null,null,null,null,null,null,null,null,null,null,null,null,null,18,null,null,null,null,null,null,null,null,null,null,null,null,null,null,null,null,null,null,null,null,null,null,null,null,null,18,null,null,null,null,null,null,null,null,null,null,null,null,null,null,null,null,null,null,null,null,null,null,null,null,null,18,null,null,null,null,null,null,null,null,null,null,null,null,null,null,null,null,null,null,null,null,null,null,null,null,null,18,null,null,null,null,null,null,null,null,null,null,null,null,null,null,null,null,null,null,null,null,null,null,null,null,null,18,null,null,null,null,null,null,null,null,null,null,null,null,null,null,null,null,null,null,null,null,null,null,null,null,null,18,null,null,null,null,null,null,null,null,null,null,null,null,null,null,null,null,null,null,null,null,null,null,null,null,null,18]
[19,null,null,null,null,null,null,null,null,null,null,null,null,null,null,null,null,null,null,null,null,null,null,null,null,null,19,null,null,null,null,null,null,null,null,null,null,null,null,null,null,null,null,null,null,null,null,null,null,null,null,null,19,null,null,null,null,null,null,null,null,null,null,null,null,null,null,null,null,null,null,null,null,null,null,null,null,null,19,null,null,null,null,null,null,null,null,null,null,null,null,null,null,null,null,null,null,null,null,null,null,null,null,null,19,null,null,null,null,null,null,null,null,null,null,null,null,null,null,null,null,null,null,null,null,null,null,null,null,null,19,null,null,null,null,null,null,null,null,null,null,null,null,null,null,null,null,null,null,null,null,null,null,null,null,null,19,null,null,null,null,null,null,null,null,null,null,null,null,null,null,null,null,null,null,null,null,null,null,null,null,null,null,null,null,null,null,null,null,null,null,null,null,null,null,null,null,null,null,null,null,null,null,null,null,null,null,null,19,null,null,null,null,null,null,null,null,null,null,null,null,null,null,null,null,null,null,null,null,null,null,null,null,null,19,null,null,null,null,null,null,null,null,null,null,null,null,null,null,null,null,null,null,null,null,null,null,null,null,null,19,null,null,null,null,null,null,null,null,null,null,null,null,null,null,null,null,null,null,null,null,null,null,null,null,null,19,null,null,null,null,null,null,null,null,null,null,null,null,null,null,null,null,null,null,null,null,null,null,null,null,null,19,null,null,null,null,null,null,null,null,null,null,null,null,null,null,null,null,null,null,null,null,null,null,null,null,null,19,null,null,null,null,null,null,null,null,null,null,null,null,null,null,null,null,null,null,null,null,null,null,null,null,null,19,null,null,null,null,null,null,null,null,null,null,null,null,null,null,null,null,null,null,null,null,null,null,null,null,null,19,null,null,null,null,null,null,null,null,null,null,null,null,null,null,null,null,null,null,null,null,null,null,null,null,null,null,{"$f":"CONCATENATE(\"Insgesamt sind \",SUM(PY63,PY79),\" Lerneinheiten (1 LE = 45 Min.) anzurechnenden.\")","v":"Insgesamt sind 0 Lerneinheiten (1 LE = 45 Min.) anzurechnenden."},null,null,null,null,null,null,null,null,null,null,null,null,null,null,null,null,null,null,null,null,null,null,null,null,null,{"$f":"CONCATENATE(\"Insgesamt sind \",SUM(QY63,QY79),\" Lerneinheiten (1 LE = 45 Min.) anzurechnenden.\")","v":"Insgesamt sind 0 Lerneinheiten (1 LE = 45 Min.) anzurechnenden."},null,null,null,null,null,null,null,null,null,null,null,null,null,null,null,null,null,null,null,null,null,null,{"$f":"SUM(Rs_2!AA40)","v":12},null,null,{"$f":"CONCATENATE(\"Insgesamt sind \",SUM(RY63,RY79),\" Lerneinheiten (1 LE = 45 Min.) anzurechnenden.\")","v":"Insgesamt sind 0 Lerneinheiten (1 LE = 45 Min.) anzurechnenden."},null,null,null,null,null,null,null,null,null,null,null,null,null,null,null,null,null,null,null,null,null,null,null,null,null,{"$f":"CONCATENATE(\"Insgesamt sind \",SUM(SY63,SY79),\" Lerneinheiten (1 LE = 45 Min.) anzurechnenden.\")","v":"Insgesamt sind 0 Lerneinheiten (1 LE = 45 Min.) anzurechnenden."}]
[20,null,null,null,null,null,null,null,null,null,null,null,null,null,null,null,null,null,null,null,null,null,null,null,null,null,20,null,null,null,null,null,null,null,null,null,null,null,null,null,null,null,null,null,null,null,null,null,null,null,null,null,20,null,null,null,null,null,null,null,null,null,null,null,null,null,null,null,null,null,null,null,null,null,null,null,null,null,20,null,null,null,null,null,null,null,null,null,null,null,null,null,null,null,null,null,null,null,null,null,null,null,null,null,20,null,null,null,null,null,null,null,null,null,null,null,null,null,null,null,null,null,null,null,null,null,null,null,null,null,20,null,null,null,null,null,null,null,null,null,null,null,null,null,null,null,null,null,null,null,null,null,null,null,null,null,20,null,null,null,null,null,null,null,null,null,null,null,null,null,null,null,null,null,null,null,null,null,null,null,null,null,null,null,null,null,null,null,null,null,null,null,null,null,null,null,null,null,null,null,null,null,null,null,null,null,null,null,20,null,null,null,null,null,null,null,null,null,null,null,null,null,null,null,null,null,null,null,null,null,null,null,null,null,20,null,null,null,null,null,null,null,null,null,null,null,null,null,null,null,null,null,null,null,null,null,null,null,null,null,20,null,null,null,null,null,null,null,null,null,null,null,null,null,null,null,null,null,null,null,null,null,null,null,null,null,20,null,null,null,null,null,null,null,null,null,null,null,null,null,null,null,null,null,null,null,null,null,null,null,null,null,20,null,null,null,null,null,null,null,null,null,null,null,null,null,null,null,null,null,null,null,null,null,null,null,null,null,20,null,null,null,null,null,null,null,null,null,null,null,null,null,null,null,null,null,null,null,null,null,null,null,null,null,20,null,null,null,null,null,null,null,null,null,null,null,null,null,null,null,null,null,null,null,null,null,null,null,null,null,20]
[]
[null,"Dieser Ausbildungsnachweis ist gemäß dem DGUV Grundsatz 304-001 Voraussetzung zum Erwerb der Urkunde Pädagogische Lehrkräfteschulung (371).",null,null,null,null,null,null,null,null,null,null,null,null,null,null,null,null,null,null,null,null,null,null,null,null,null,"Dieser Ausbildungsnachweis ist gemäß dem DGUV Grundsatz 304-001 Voraussetzung zum Erwerb der Urkunde Pädagogische Lehrkräfteschulung (371).",null,null,null,null,null,null,null,null,null,null,null,null,null,null,null,null,null,null,null,null,null,null,null,null,null,"Dieser Ausbildungsnachweis ist gemäß dem DGUV Grundsatz 304-001 Voraussetzung zum Erwerb der Urkunde Pädagogische Lehrkräfteschulung (371).",null,null,null,null,null,null,null,null,null,null,null,null,null,null,null,null,null,null,null,null,null,null,null,null,null,"Diese Urkunde ist gemäß Ausbildungs- und Prüfungsordnung der DLRG Voraussetzung zum Erwerb der Urkunde Erste Hilfe-Ausbilder (381).",null,null,null,null,null,null,null,null,null,null,null,null,null,null,null,null,null,null,null,null,null,null,null,null,null,"Der Inhaber dieser Urkunde ist nur in Verbindung mit einem Lehrauftrag des zuständigen Landes- oder Bundesverband berechtigt, als Ausbilder tätig zu werden.",null,null,null,null,null,null,null,null,null,null,null,null,null,null,null,null,null,null,null,null,null,null,null,null,null,"Der Inhaber dieser Urkunde ist nur in Verbindung mit einem Lehrauftrag des zuständigen Landes- oder Bundesverband berechtigt, als Ausbilder tätig zu werden.",null,null,null,null,null,null,null,null,null,null,null,null,null,null,null,null,null,null,null,null,null,null,null,null,null,"Der Inhaber dieser Urkunde ist nur in Verbindung mit einem Lehrauftrag des zuständigen Landes- oder Bundesverband berechtigt, als Ausbilder tätig zu werden.",null,null,null,null,null,null,null,null,null,null,null,null,null,null,null,null,null,null,null,null,null,null,null,null,null,"Die hier aufgeführten Themen wurden ausschließlich von pädagogisch und fachlich geeigneten Lehrkräften erteilt.",null,null,null,null,null,null,null,null,null,null,null,null,null,null,null,null,null,null,null,null,null,null,null,null,null,"Die hier aufgeführten Themen wurden ausschließlich von pädagogisch und fachlich geeigneten Lehrkräften erteilt.",null,null,null,null,null,null,null,null,null,null,null,null,null,null,null,null,null,null,null,null,null,null,null,null,null,"Der Inhaber dieser Urkunde ist nur in Verbindung mit einem Lehrauftrag des zuständigen Landes- oder Bundesverband berechtigt, als Ausbilder tätig zu werden.",null,null,null,null,null,null,null,null,null,null,null,null,null,null,null,null,null,null,null,null,null,null,null,null,null,"Die hier aufgeführten Themen wurden ausschließlich von pädagogisch und fachlich geeigneten Lehrkräften erteilt.",null,null,null,null,null,null,null,null,null,null,null,null,null,null,null,null,null,null,null,null,null,null,null,null,null,"Die hier aufgeführten Themen wurden ausschließlich von pädagogisch und fachlich geeigneten Lehrkräften erteilt.",null,null,null,null,null,null,null,null,null,null,null,null,null,null,null,null,null,null,null,null,null,null,null,null,null,"Die hier aufgeführten Themen wurden ausschließlich von pädagogisch und fachlich geeigneten Lehrkräften erteilt.",null,null,null,null,null,null,null,null,null,null,null,null,null,null,null,null,null,null,null,null,null,null,null,null,null,"Der Inhaber dieser Urkunde ist nur in Verbindung mit einem Lehrauftrag des zuständigen Landes- oder Bundesverband berechtigt, als Ausbilder tätig zu werden.",null,null,null,null,null,null,null,null,null,null,null,null,null,null,null,null,null,null,null,null,null,null,null,null,null,"Die hier aufgeführten Themen wurden ausschließlich von pädagogisch und fachlich geeigneten Lehrkräften erteilt.",null,null,null,null,null,null,null,null,null,null,null,null,null,null,null,null,null,null,null,null,null,null,null,null,null,"Die hier aufgeführten Themen wurden ausschließlich von pädagogisch und fachlich geeigneten Lehrkräften erteilt.",null,null,null,null,null,null,null,null,null,null,null,null,null,null,null,null,null,null,null,null,null,null,null,null,null,"Die Inhalte dieser Fortbildung wurden ausschließliche von pädagogisch und fachlich geeigneten Lehrkräften erteilt.",null,null,null,null,null,null,null,null,null,null,null,null,null,null,null,null,null,null,null,null,null,null,null,null,null,"Die Inhalte dieser Fortbildung wurden ausschließliche von pädagogisch und fachlich geeigneten Lehrkräften erteilt.",null,null,null,null,null,null,null,null,null,null,null,null,null,null,null,null,null,null,null,null,null,null,null,null,null,"Die Inhalte dieser Fortbildung wurden ausschließliche von pädagogisch und fachlich geeigneten Lehrkräften erteilt.",null,null,null,null,null,null,null,null,null,null,null,null,null,null,null,null,null,null,null,null,null,null,null,null,null,"Die Inhalte dieser Fortbildung wurden ausschließliche von pädagogisch und fachlich geeigneten Lehrkräften erteilt."]